{"text_format":"1","workbook":"xlsx","n_sheets":5,"sheets":["jednotlivci","garáže","stat. celkem","turnaje","zápis"],"not_rendered":{"charts":0,"images":4,"macros":1,"external_links":0,"defined_names":0,"comments":0,"pivot_tables":0},"unopened":[],"bounds":{"document_bytes":16777216,"sheet_cells":100000,"rows_first":2000,"rows_last":500,"rows_between":2000,"halvings":0,"cell_chars":16384,"cell_head_chars":4096},"cells_cut":0,"cells_raw":0,"read":"whole","date_system":"1900"}

{"sheet":"jednotlivci","index":0,"n_rows":89,"n_cols":32,"rows_kept":89,"cut":false,"hidden":false,"merged":[[2,17,2,19],[2,20,2,22],[2,23,2,25],[1,1,1,30],[2,5,2,7],[2,8,2,10],[2,11,2,13],[2,14,2,16]]}
[]
[null,"Celkové umístění jednotlivců na turnajích v BOWLINGU  2013",null,null,null,null,null,null,null,null,null,null,null,null,null,null,null,null,null,null,null,null,null,null,null,null,null,null,null,null,null," turnaje"]
[null,0,null,null,"   garáže",null,null,null,null,null,null,null,null,null,null,null,null,null,null,null,null,null,null,null,null,null," Počet turnajů"," Počet celkových bodů",null," Průměer na hru"," Průměr na turnaj"]
[null,{"$f":"SUM(B3+1)","v":1},"Šafařík Luděk",{"$f":"IF(AA4<6,0,1)","v":1},"Hostivař",1,{"$f":"IF(F4=\"\",\"\",IF(F4>50,\"\",51-F4))","v":50},928,3,{"$f":"IF(I4=\"\",\"\",IF(I4>50,\"\",51-I4))","v":48},905,2,{"$f":"IF(L4=\"\",\"\",IF(L4>50,\"\",51-L4))","v":49},897,2,{"$f":"IF(O4=\"\",\"\",IF(O4>50,\"\",51-O4))","v":49},883,8,{"$f":"IF(R4=\"\",\"\",IF(R4>50,\"\",51-R4))","v":43},805,1,{"$f":"IF(U4=\"\",\"\",IF(U4>50,\"\",51-U4))","v":50},962,7,{"$f":"IF(X4=\"\",\"\",IF(X4>50,\"\",51-X4))","v":44},833,{"$f":"COUNT(X4,U4,R4,O4,L4,I4,F4)","v":7},{"$f":"SUM(G4,J4,M4,P4,S4,V4,Y4)","v":333},{"$f":"IF(AB4=0,\"\",SUM(AB4*1000)+AD4)","v":333177.51428571431},{"$f":"IF(AA4=0,\"\",AE4/5)","v":177.51428571428571},{"$f":"IF(AA4=0,\"\",(H4+K4+N4+Q4+T4+W4+Z4)/AA4)","v":887.57142857142856}]
[null,2,"Kocúr Jaroslav",1,"Řepy",15,36,744,2,49,915,1,50,960,null,"",null,4,47,854,4,47,889,5,46,850,6,275,275173.73333333334,173.73333333333332,868.66666666666663]
[null,3,"Lazur Ladislav",1,"Hostivař",5,46,847,1,50,945,8,43,831,null,"",null,12,39,794,2,49,901,3,48,863,6,275,275172.7,172.7,863.5]
[null,4,"Krupa Jozef",1,"Vršovice",9,42,799,5,46,891,17,34,760,3,48,883,1,50,959,7,44,847,4,47,860,7,311,311171.40000000002,171.4,857]
[null,5,"Pospíšil Václav",1,"Řepy",3,48,881,6,45,876,10,41,814,1,50,901,15,36,766,8,43,834,6,45,844,7,308,308169.02857142856,169.02857142857141,845.14285714285711]
[null,6,"Novotný Lukáš",0,"Klíčov",4,47,860,8,43,833,12,39,793,null,"",null,null,"",null,11,40,814,2,49,888,5,218,218167.52,167.52,837.6]
[null,7,"Holkup Jan",0,"Vršovice",13,38,755,14,37,790,null,"",null,null,"",null,2,49,912,9,42,823,12,39,802,5,205,205163.28,163.28,816.4]
[null,8,"Ondřich František",1,"Kačerov",10,41,796,11,40,815,3,48,895,30,21,664,3,48,858,5,46,863,10,41,809,7,285,285162.85714285716,162.85714285714286,814.28571428571433]
[null,9,"Pecka Jiří",1,"Klíčov",8,43,814,9,42,831,7,44,831,null,"",null,17,34,751,6,45,854,15,36,790,6,244,244162.36666666667,162.36666666666667,811.83333333333337]
[null,10,"Mašát Petr",1,"Kačerov",2,49,895,10,41,826,4,47,859,4,47,854,null,"",null,31,20,657,30,21,669,6,225,225158.66666666666,158.66666666666669,793.33333333333337]
[null,11,"Kalfiřt Petr",1,"Klíčov",25,26,680,13,38,796,15,36,768,8,43,807,7,44,822,3,48,894,17,34,761,7,269,269157.94285714283,157.94285714285712,789.71428571428567]
[null,12,"Kročil Tomáš",1,"Řepy",11,40,786,12,39,806,18,33,742,9,42,791,9,42,802,18,33,728,13,38,796,7,267,267155.74285714288,155.74285714285713,778.71428571428567]
[null,13,"Carvan Pavel",1,"Kačerov",14,37,752,7,44,860,25,26,705,5,46,842,30,21,683,15,36,762,9,42,810,7,252,252154.6857142857,154.68571428571428,773.42857142857144]
[null,14,"Alba Vladimír",1,"Řepy",12,39,777,23,28,701,13,38,770,16,35,738,14,37,776,10,41,814,22,29,722,7,247,247151.37142857144,151.37142857142857,756.85714285714289]
[null,15,"Jelínek Jan",1,"Hostivař",18,33,727,20,31,719,14,37,770,28,23,666,13,38,782,13,38,775,8,43,816,7,243,243150.14285714287,150.14285714285714,750.71428571428567]
[null,16,"Tomášek Zdeněk",0,"Kačerov",7,44,825,19,32,728,20,31,733,20,31,723,18,33,725,null,"",null,null,"",null,5,171,171149.36,149.35999999999999,746.8]
[null,17,"Sladovník Miloš",1,"Řepy",19,32,720,24,27,693,21,30,727,6,45,842,35,16,668,null,"",null,19,32,755,6,182,182146.83333333334,146.83333333333331,734.16666666666663]
[null,18,"Hübner Jiří",0,"Kačerov",17,34,737,null,"",null,null,"",null,17,34,725,26,25,703,27,24,677,11,40,803,5,157,157145.79999999999,145.80000000000001,729]
[null,19,"Berger Michal",0,"Hostivař",null,"",null,26,25,689,16,35,767,22,29,703,null,"",null,17,34,730,21,30,729,5,153,153144.72,144.72,723.6]
[null,20,"Skružná Pavla",0,"Vršovice",37,14,616,18,33,738,11,40,811,null,"",null,11,40,795,null,"",null,35,16,647,5,143,143144.28,144.28,721.4]
[null,21,"Bošek Jan",0,"Vršovice",null,"",null,21,30,710,33,18,673,27,24,675,19,32,723,14,37,773,null,"",null,5,141,141142.16,142.16,710.8]
[null,22,"Křemenák Petr",0,"Klíčov",21,30,707,null,"",null,26,25,703,32,19,638,10,41,801,null,"",null,25,26,687,5,141,141141.44,141.44,707.2]
[null,23,"Troller Pavel",0,"Klíčov",24,27,691,33,18,638,null,"",null,null,"",null,16,35,757,21,30,701,20,31,742,5,141,141141.16,141.16,705.8]
[null,24,"Mysliveček  Jaroslav",1,"Hostivař",23,28,702,15,36,768,38,13,631,14,37,754,27,24,701,34,17,642,23,28,717,7,183,183140.42857142858,140.42857142857142,702.14285714285711]
[null,25,"Radová Petra",1,"Kačerov",20,31,718,27,24,686,28,23,684,24,27,688,24,27,717,26,25,685,28,23,675,7,180,180138.65714285715,138.65714285714287,693.28571428571433]
[null,26,"Douša Adam",1,"Kačerov",33,18,636,16,35,766,34,17,672,10,41,785,34,17,669,null,"",null,40,11,631,6,139,139138.63333333333,138.63333333333333,693.16666666666663]
[null,27,"Mottl Pavel",1,"Řepy",27,24,664,45,6,596,6,45,838,12,39,773,39,12,630,29,22,673,41,10,628,7,158,158137.20000000001,137.19999999999999,686]
[null,28,"Brož Stanislav",1,"Kačerov",29,22,657,25,26,693,19,32,742,29,22,666,null,"",null,19,32,723,42,9,625,6,143,143136.86666666667,136.86666666666667,684.33333333333337]
[null,29,"Křápek Roman",0,"Hostivař",32,19,637,36,15,632,null,"",null,null,"",null,5,46,834,35,16,633,31,20,668,5,116,116136.16,136.16,680.8]
[null,30,"Brejcha Jaroslav",1,"Kačerov",38,13,614,39,12,618,29,22,683,15,36,753,22,29,718,25,26,691,27,24,681,7,162,162135.94285714286,135.94285714285712,679.71428571428567]
[null,31,"Kazda Jan",1,"Vršovice",30,21,655,32,19,656,32,19,676,23,28,700,null,"",null,24,27,694,26,25,682,6,139,139135.43333333332,135.43333333333334,677.16666666666663]
[null,32,"Sehnal Ivan",1,"Řepy",34,17,631,30,21,665,31,20,680,13,38,761,20,31,722,42,9,612,32,19,658,7,155,155135.11428571428,135.1142857142857,675.57142857142856]
[null,{"$f":"SUM(B35+1)","v":33},"Tichý Hugo",{"$f":"IF(AA36<6,0,1)","v":0},"Řepy",22,{"$f":"IF(F36=\"\",\"\",IF(F36>50,\"\",51-F36))","v":29},705,34,{"$f":"IF(I36=\"\",\"\",IF(I36>50,\"\",51-I36))","v":17},636,24,{"$f":"IF(L36=\"\",\"\",IF(L36>50,\"\",51-L36))","v":27},711,36,{"$f":"IF(O36=\"\",\"\",IF(O36>50,\"\",51-O36))","v":15},618,null,{"$f":"IF(R36=\"\",\"\",IF(R36>50,\"\",51-R36))","v":""},null,45,6,597,null,{"$f":"IF(X36=\"\",\"\",IF(X36>50,\"\",51-X36))","v":""},null,{"$f":"COUNT(X36,U36,R36,O36,L36,I36,F36)","v":5},{"$f":"SUM(G36,J36,M36,P36,S36,V36,Y36)","v":94},{"$f":"IF(AB36=0,\"\",SUM(AB36*1000)+AD36)","v":94130.68},{"$f":"IF(AA36=0,\"\",AE36/5)","v":130.68},{"$f":"IF(AA36=0,\"\",(H36+K36+N36+Q36+T36+W36+Z36)/AA36)","v":653.4}]
[null,34,"Kovář Jaroslav",0,"Vršovice",26,25,673,null,"",null,22,29,726,41,10,569,29,22,688,46,5,596,null,"",null,5,91,91130.08,130.07999999999998,650.4]
[null,35,"Šafář Vladimír",1,"Hostivař",36,15,616,22,29,708,42,9,593,33,18,632,31,20,683,36,15,631,33,18,652,7,124,124129,129,645]
[null,36,"Novotná Petra",0,"Klíčov",40,11,590,35,16,636,30,21,681,38,13,594,42,9,606,null,"",null,null,"",null,5,70,70124.28,124.28,621.4]
[null,37,"Pospíšil Lukáš",1,"Vršovice",39,12,611,29,22,683,44,7,573,39,12,583,28,23,697,null,null,null,47,4,575,6,80,80124.066666666666,124.06666666666668,620.33333333333337]
[null,38,"Aunický František",1,"Vršovice",46,5,560,42,9,604,40,11,605,21,30,705,41,10,619,47,{"$f":"IF(U41=\"\",\"\",IF(U41>50,\"\",51-U41))","v":4},593,38,13,640,7,82,82123.600000000006,123.6,618]
[null,39,"Kollár Pavel",1,"Hostivař",44,7,571,null,"",null,48,3,529,43,8,558,32,19,681,22,29,695,29,22,672,6,88,88123.53333333334,123.53333333333333,617.66666666666663]
[null,40,"Kutina Pavel",1,"Kačerov",50,1,473,40,11,611,41,10,599,25,26,682,33,18,676,37,14,627,44,7,615,7,87,87122.371428571423,122.37142857142858,611.85714285714289]
[null,41,"Křikava Miroslav",1,"Řepy",43,8,572,48,3,548,47,4,536,31,20,651,40,11,619,39,12,626,36,15,644,7,73,73119.885714285716,119.88571428571429,599.42857142857144]
[null,42,"Fay Vlastimil",1,"Vršovice",45,6,571,43,8,603,39,12,611,37,14,601,48,3,539,44,7,598,null,"",null,6,50,50117.433333333334,117.43333333333332,587.16666666666663]
[null,43,"Čermák Tomáš",0,"Hostivař",42,9,577,null,"",null,46,5,564,34,17,631,45,6,561,48,3,585,null,"",null,5,40,40116.720000000001,116.72,583.6]
[null,44,"Řehák František",0,"Klíčov",47,4,553,46,5,573,45,6,567,42,9,560,37,14,649,null,"",null,null,"",null,5,38,38116.080000000002,116.08,580.4]
[null,45,"Táborský František",0,"Klíčov",48,3,530,47,4,563,null,"",null,46,5,535,null,"",null,41,10,615,49,2,544,5,24,24111.48,111.47999999999999,557.4]
[null,46,"Stejskal Martin",0,"Kačerov",null,"",null,null,"",null,5,46,846,null,"",null,null,"",null,null,"",null,null,"",null,1,46,46169.2,169.2,846]
[null,47,"Greman Milan",0,"Vršovice",null,"",null,null,"",null,null,"",null,7,44,840,null,"",null,null,"",null,null,"",null,1,44,44168,168,840]
[null,48,"Podhola Martin",0,"Vršovice",null,"",null,4,47,896,9,42,824,null,"",null,6,45,826,null,"",null,18,33,757,4,167,167165.15,165.15,825.75]
[null,49,"Věchtík Antonín",0,"Vršovice",6,45,830,null,"",null,null,"",null,null,"",null,null,"",null,null,"",null,16,35,766,2,80,80159.600000000006,159.6,798]
[null,50,"Froněk Martin",0,"Řepy",null,"",null,null,"",null,23,28,720,null,"",null,null,"",null,12,39,778,1,50,893,3,117,117159.4,159.4,797]
[null,51,"Růžička Ladislav",0,"Hostivař",16,35,744,null,"",null,null,"",null,null,"",null,23,28,717,30,21,664,14,37,792,4,121,121145.85,145.85,729.25]
[null,52,"Krupová Martina",0,"Vršovice",null,"",null,31,20,662,null,"",null,18,33,725,null,"",null,16,35,755,null,"",null,3,88,88142.8,142.80000000000001,714]
[null,53,"Šafář Bohumil",0,"Klíčov",null,"",null,17,34,751,37,14,660,null,"",null,null,"",null,null,"",null,null,"",null,2,48,48141.1,141.1,705.5]
[null,54,"Štěpán Radek",0,"Klíčov",null,null,null,null,null,null,null,null,null,11,40,779,36,15,667,20,31,716,37,14,642,4,100,100140.2,140.19999999999999,701]
[null,55,"Kučera Miroslav",0,"Vršovice",null,{"$f":"IF(F58=\"\",\"\",IF(F58>50,\"\",51-F58))","v":""},null,null,{"$f":"IF(I58=\"\",\"\",IF(I58>50,\"\",51-I58))","v":""},null,36,{"$f":"IF(L58=\"\",\"\",IF(L58>50,\"\",51-L58))","v":15},665,19,32,724,null,"",null,null,"",null,null,"",null,2,47,47138.9,138.9,694.5]
[null,56,"Táborský Lukáš",0,"Klíčov",28,{"$f":"IF(F59=\"\",\"\",IF(F59>50,\"\",51-F59))","v":23},661,null,{"$f":"IF(I59=\"\",\"\",IF(I59>50,\"\",51-I59))","v":""},null,null,{"$f":"IF(L59=\"\",\"\",IF(L59>50,\"\",51-L59))","v":""},null,null,"",null,null,"",null,23,28,695,24,27,697,3,78,78136.866666666669,136.86666666666667,684.33333333333337]
[null,57,"Turek Stanislav",0,"Kačerov",null,{"$f":"IF(F60=\"\",\"\",IF(F60>50,\"\",51-F60))","v":""},null,null,{"$f":"IF(I60=\"\",\"\",IF(I60>50,\"\",51-I60))","v":""},null,null,{"$f":"IF(L60=\"\",\"\",IF(L60>50,\"\",51-L60))","v":""},null,null,"",null,21,30,721,28,23,674,34,17,649,3,70,70136.266666666663,136.26666666666668,681.33333333333337]
[null,58,"Číhal František",0,"Řepy",null,{"$f":"IF(F61=\"\",\"\",IF(F61>50,\"\",51-F61))","v":""},null,null,{"$f":"IF(I61=\"\",\"\",IF(I61>50,\"\",51-I61))","v":""},null,null,{"$f":"IF(L61=\"\",\"\",IF(L61>50,\"\",51-L61))","v":""},null,26,25,681,null,"",null,null,"",null,null,"",null,1,25,25136.2,136.19999999999999,681]
[null,59,"Lokvenc Jiří",0,"Klíčov",null,{"$f":"IF(F62=\"\",\"\",IF(F62>50,\"\",51-F62))","v":""},null,28,{"$f":"IF(I62=\"\",\"\",IF(I62>50,\"\",51-I62))","v":23},686,null,{"$f":"IF(L62=\"\",\"\",IF(L62>50,\"\",51-L62))","v":""},null,null,"",null,null,"",null,33,18,645,null,"",null,2,41,41133.1,133.1,665.5]
[null,60,"Křikavová Miroslava",0,"Řepy",null,null,null,null,null,null,null,null,null,null,"",null,38,13,640,null,null,null,null,"",null,1,13,13128,128,640]
[null,61,"Kolář Ladislav",0,"Klíčov",null,{"$f":"IF(F64=\"\",\"\",IF(F64>50,\"\",51-F64))","v":""},null,38,{"$f":"IF(I64=\"\",\"\",IF(I64>50,\"\",51-I64))","v":13},621,null,{"$f":"IF(L64=\"\",\"\",IF(L64>50,\"\",51-L64))","v":""},null,null,"",null,null,"",null,32,{"$f":"IF(U64=\"\",\"\",IF(U64>50,\"\",51-U64))","v":19},650,null,"",null,2,32,32127.1,127.1,635.5]
[null,62,"Lazurová Jiřina",0,"Hostivař",null,"",null,44,7,598,35,16,669,null,"",null,25,26,704,null,"",null,48,3,551,4,52,52126.1,126.1,630.5]
[null,63,"Plecháček Miroslav",0,"Řepy",31,20,653,41,10,608,null,"",null,null,"",null,null,"",null,null,"",null,null,"",null,2,30,30126.1,126.1,630.5]
[null,64,"Krupka Jakub",0,"Klíčov",35,16,627,null,"",null,null,"",null,null,"",null,null,"",null,null,"",null,null,"",null,1,16,16125.4,125.4,627]
[null,{"$f":"SUM(B67+1)","v":65},"Žalud Miroslav",{"$f":"IF(AA68<6,0,1)","v":0},"Kačerov",null,"",null,37,14,625,null,"",null,null,"",null,null,"",null,null,"",null,null,{"$f":"IF(X68=\"\",\"\",IF(X68>50,\"\",51-X68))","v":""},null,{"$f":"COUNT(X68,U68,R68,O68,L68,I68,F68)","v":1},{"$f":"SUM(G68,J68,M68,P68,S68,V68,Y68)","v":14},{"$f":"IF(AB68=0,\"\",SUM(AB68*1000)+AD68)","v":14125},{"$f":"IF(AA68=0,\"\",AE68/5)","v":125},{"$f":"IF(AA68=0,\"\",(H68+K68+N68+Q68+T68+W68+Z68)/AA68)","v":625}]
[null,66,"Hájek Mojmír",0,"Klíčov",null,"",null,null,"",null,27,24,699,45,6,549,null,"",null,null,"",null,null,"",null,2,30,30124.799999999999,124.8,624," "]
[null,67,"Pavlíček Rudolf",0,"Vršovice",null,"",null,null,"",null,null,"",null,null,"",null,44,7,564,40,11,623,43,8,619,3,26,26120.400000000001,120.4,602]
[null,68,"Růžička Václav",0,"Řepy",null,"",null,null,"",null,null,"",null,35,16,619,null,"",null,43,8,598,45,6,586,3,30,30120.2,120.2,601]
[null,69,"Katolický Zdeněk",0,"Kačerov",null,null,null,null,null,null,null,null,null,null,null,null,46,5,557,38,13,627,null,"",null,2,18,18118.400000000001,118.4,592]
[null,70,"Veselý Vlastimil",0,"Vršovice",41,{"$f":"IF(F73=\"\",\"\",IF(F73>50,\"\",51-F73))","v":10},589,null,{"$f":"IF(I73=\"\",\"\",IF(I73>50,\"\",51-I73))","v":""},null,null,{"$f":"IF(L73=\"\",\"\",IF(L73>50,\"\",51-L73))","v":""},null,null,{"$f":"IF(O73=\"\",\"\",IF(O73>50,\"\",51-O73))","v":""},null,null,"",null,null,"",null,null,"",null,1,10,10117.799999999999,117.8,589]
[null,71,"Novotná Jana",0,"Klíčov",null,{"$f":"IF(F74=\"\",\"\",IF(F74>50,\"\",51-F74))","v":""},null,null,{"$f":"IF(I74=\"\",\"\",IF(I74>50,\"\",51-I74))","v":""},null,43,{"$f":"IF(L74=\"\",\"\",IF(L74>50,\"\",51-L74))","v":8},581,null,{"$f":"IF(O74=\"\",\"\",IF(O74>50,\"\",51-O74))","v":""},null,43,8,585,null,"",null,null,"",null,2,16,16116.6,116.6,583]
[null,72,"Pipek Pavel",0,"Klíčov",null,null,null,null,null,null,null,null,null,40,{"$f":"IF(O75=\"\",\"\",IF(O75>50,\"\",51-O75))","v":11},577,null,null,null,49,2,538,39,12,632,3,25,25116.466666666667,116.46666666666667,582.33333333333337]
[null,73,"Pelikán Stanislav",0,"Klíčov",null,{"$f":"IF(F76=\"\",\"\",IF(F76>50,\"\",51-F76))","v":""},null,null,{"$f":"IF(I76=\"\",\"\",IF(I76>50,\"\",51-I76))","v":""},null,null,{"$f":"IF(L76=\"\",\"\",IF(L76>50,\"\",51-L76))","v":""},null,null,{"$f":"IF(O76=\"\",\"\",IF(O76>50,\"\",51-O76))","v":""},null,null,{"$f":"IF(R76=\"\",\"\",IF(R76>50,\"\",51-R76))","v":""},null,null,"",null,46,5,578,1,5,5115.6000000000004,115.6,578]
[null,74,"Neshyba Jaroslav",0,"Klíčov",null,null,null,null,null,null,null,null,null,null,null,null,47,4,550,null,null,null,null,"",null,1,4,4110,110,550]
[null,75,"Vychnerová Michala",0,"Klíčov",null,{"$f":"IF(F78=\"\",\"\",IF(F78>50,\"\",51-F78))","v":""},null,null,{"$f":"IF(I78=\"\",\"\",IF(I78>50,\"\",51-I78))","v":""},null,49,{"$f":"IF(L78=\"\",\"\",IF(L78>50,\"\",51-L78))","v":2},508,44,{"$f":"IF(O78=\"\",\"\",IF(O78>50,\"\",51-O78))","v":7},556,null,"",null,null,{"$f":"IF(U78=\"\",\"\",IF(U78>50,\"\",51-U78))","v":""},null,null,"",null,2,9,9106.4,106.4,532]
[null,76,"Dvořák Petr",0,"Řepy",null,{"$f":"IF(F79=\"\",\"\",IF(F79>50,\"\",51-F79))","v":""},null,null,{"$f":"IF(I79=\"\",\"\",IF(I79>50,\"\",51-I79))","v":""},null,null,{"$f":"IF(L79=\"\",\"\",IF(L79>50,\"\",51-L79))","v":""},null,null,{"$f":"IF(O79=\"\",\"\",IF(O79>50,\"\",51-O79))","v":""},null,49,2,524,null,{"$f":"IF(U79=\"\",\"\",IF(U79>50,\"\",51-U79))","v":""},null,null,"",null,1,2,2104.8000000000002,104.8,524]
[null,77,"Šafrová Martina",0,"Klíčov",null,null,null,null,null,null,null,null,null,null,null,null,50,1,518,null,null,null,null,"",null,1,1,1103.5999999999999,103.6,518]
[null,78,"Kalošová Dagmar",0,"Hostivař",49,{"$f":"IF(F81=\"\",\"\",IF(F81>50,\"\",51-F81))","v":2},496,50,{"$f":"IF(I81=\"\",\"\",IF(I81>50,\"\",51-I81))","v":1},498,null,{"$f":"IF(L81=\"\",\"\",IF(L81>50,\"\",51-L81))","v":""},null,47,{"$f":"IF(O81=\"\",\"\",IF(O81>50,\"\",51-O81))","v":4},533,null,"",null,null,{"$f":"IF(U81=\"\",\"\",IF(U81>50,\"\",51-U81))","v":""},null,null,"",null,3,7,7101.8,101.8,509]
[null,79,"Bergerová Marcela",0,"Hostivař",null,{"$f":"IF(F82=\"\",\"\",IF(F82>50,\"\",51-F82))","v":""},null,49,{"$f":"IF(I82=\"\",\"\",IF(I82>50,\"\",51-I82))","v":2},504,null,{"$f":"IF(L82=\"\",\"\",IF(L82>50,\"\",51-L82))","v":""},null,48,3,511,null,"",null,null,{"$f":"IF(U82=\"\",\"\",IF(U82>50,\"\",51-U82))","v":""},null,null,"",null,2,5,5101.5,101.5,507.5]
[null,80,"Štarková Tereza",0,"Klíčov",null,null,null,null,null,null,null,null,null,50,1,487,null,null,null,null,null,null,null,"",null,1,1,1097.4000000000001,97.4,487]
[null,81,"Svítil Pavel",0,"Hostivař",null,null,null,null,null,null,50,{"$f":"IF(L84=\"\",\"\",IF(L84>50,\"\",51-L84))","v":1},480,49,2,490,null,null,null,null,null,null,null,"",null,2,3,3097,97,485]
[null,82,"Hyková Lucie",0,"Vršovice",null,{"$f":"IF(F85=\"\",\"\",IF(F85>50,\"\",51-F85))","v":""},null,null,{"$f":"IF(I85=\"\",\"\",IF(I85>50,\"\",51-I85))","v":""},null,null,"",null,null,"",null,null,{"$f":"IF(R85=\"\",\"\",IF(R85>50,\"\",51-R85))","v":""},null,50,{"$f":"IF(U85=\"\",\"\",IF(U85>50,\"\",51-U85))","v":1},333,50,1,400,2,2,2073.3000000000002,73.3,366.5]
[null,null,null,0,null,null,{"$f":"IF(F86=\"\",\"\",IF(F86>50,\"\",51-F86))","v":""},null,null,{"$f":"IF(I86=\"\",\"\",IF(I86>50,\"\",51-I86))","v":""},null,null,"",null,null,"",null,null,{"$f":"IF(R86=\"\",\"\",IF(R86>50,\"\",51-R86))","v":""},null,null,{"$f":"IF(U86=\"\",\"\",IF(U86>50,\"\",51-U86))","v":""},null,null,""]
[null,null,null,0,null,null,{"$f":"IF(F87=\"\",\"\",IF(F87>50,\"\",51-F87))","v":""},null,null,{"$f":"IF(I87=\"\",\"\",IF(I87>50,\"\",51-I87))","v":""},null,null,"",null,null,"",null,null,{"$f":"IF(R87=\"\",\"\",IF(R87>50,\"\",51-R87))","v":""},null,null,{"$f":"IF(U87=\"\",\"\",IF(U87>50,\"\",51-U87))","v":""},null,null,""]
[null,null,null,0,null,null,{"$f":"IF(F88=\"\",\"\",IF(F88>50,\"\",51-F88))","v":""},null,null,{"$f":"IF(I88=\"\",\"\",IF(I88>50,\"\",51-I88))","v":""},null,null,"",null,null,"",null,null,{"$f":"IF(R88=\"\",\"\",IF(R88>50,\"\",51-R88))","v":""},null,null,{"$f":"IF(U88=\"\",\"\",IF(U88>50,\"\",51-U88))","v":""},null,null,""]
[null,null,null,0,null,null,{"$f":"IF(F89=\"\",\"\",IF(F89>50,\"\",51-F89))","v":""},null,null,{"$f":"IF(I89=\"\",\"\",IF(I89>50,\"\",51-I89))","v":""},null,null,"",null,null,"",null,null,{"$f":"IF(R89=\"\",\"\",IF(R89>50,\"\",51-R89))","v":""},null,null,{"$f":"IF(U89=\"\",\"\",IF(U89>50,\"\",51-U89))","v":""},null,null,""]

{"sheet":"garáže","index":1,"n_rows":104,"n_cols":17,"rows_kept":104,"cut":false,"hidden":false,"merged":[]}
[null," jméno","19.1.","9.2.","9.3.","27.4.","12.10.","9.11.","8.12.","kuželky",null,"průměr",null,"garáž","průměr na 1 hru","průměr na turnaj","zpět"]
["Dejvice","Štěrba Ladislav",{"$f":"zápis!H5","v":0},{"$f":"zápis!N5","v":0},{"$f":"zápis!T5","v":0},{"$f":"zápis!Z5","v":0},{"$f":"zápis!AF5","v":0},{"$f":"zápis!AL5","v":0},{"$f":"zápis!AR5","v":0},{"$f":"SUM(C2:I2)","v":0},{"$f":"zápis!AT5","v":0},{"$f":"IF(K2=0,\"\",J2/K2)","v":""},null,"Řepy",{"$f":"zápis!$AU$97","v":144.74202898550723},{"$f":"SUM(O2*5)","v":723.71014492753613}]
["Dejvice","Jošt Michal",{"$f":"zápis!H2","v":0},{"$f":"zápis!N2","v":0},{"$f":"zápis!T2","v":0},{"$f":"zápis!Z2","v":0},{"$f":"zápis!AF2","v":0},{"$f":"zápis!AL2","v":0},{"$f":"zápis!AR2","v":0},0,{"$f":"zápis!AT2","v":0},"",null,"Kačerov",{"$f":"zápis!$AU$48","v":143.1742857142857},{"$f":"SUM(O3*5)","v":715.87142857142851}]
["Dejvice","Joštová Alena",{"$f":"zápis!H4","v":0},{"$f":"zápis!N4","v":0},{"$f":"zápis!T4","v":0},{"$f":"zápis!Z4","v":0},{"$f":"zápis!AF4","v":0},{"$f":"zápis!AL4","v":0},{"$f":"zápis!AR4","v":0},0,{"$f":"zápis!AT4","v":0},"",null,"Hostivař",{"$f":"zápis!$AU$31","v":138.66363636363636},{"$f":"SUM(O4*5)","v":693.31818181818176}]
["Dejvice","Pěchočová Soňa",{"$f":"zápis!H3","v":0},{"$f":"zápis!N3","v":0},{"$f":"zápis!T3","v":0},{"$f":"zápis!Z3","v":0},{"$f":"zápis!AF3","v":0},{"$f":"zápis!AL3","v":0},{"$f":"zápis!AR3","v":0},0,{"$f":"zápis!AT3","v":0},"",null,"Vršovice",{"$f":"zápis!$AU$121","v":138.64571428571429},{"$f":"SUM(O5*5)","v":693.22857142857151}]
["Dejvice","Novák Antonín",{"$f":"zápis!H6","v":0},{"$f":"zápis!N6","v":0},{"$f":"zápis!T6","v":0},{"$f":"zápis!Z6","v":0},{"$f":"zápis!AF6","v":0},{"$f":"zápis!AL6","v":0},{"$f":"zápis!AR6","v":0},0,{"$f":"zápis!AT6","v":0},"",null,"Klíčov",{"$f":"zápis!$AU$74","v":135.15142857142857},{"$f":"SUM(O6*5)","v":675.75714285714287}]
["Hostivař","Šafařík Luděk",{"$f":"zápis!H10","v":928},{"$f":"zápis!N10","v":905},{"$f":"zápis!T10","v":897},{"$f":"zápis!Z10","v":883},{"$f":"zápis!AF10","v":805},{"$f":"zápis!AL10","v":962},{"$f":"zápis!AR10","v":833},6213,{"$f":"zápis!AT10","v":35},177.51428571428571,null,"Dejvice"]
["Hostivař","Lazur Ladislav",{"$f":"zápis!H19","v":847},{"$f":"zápis!N19","v":945},{"$f":"zápis!T19","v":831},{"$f":"zápis!Z19","v":0},{"$f":"zápis!AF19","v":794},{"$f":"zápis!AL19","v":901},{"$f":"zápis!AR19","v":863},5181,{"$f":"zápis!AT19","v":30},172.7]
["Hostivař","Jelínek Jan",{"$f":"zápis!H12","v":727},{"$f":"zápis!N12","v":719},{"$f":"zápis!T12","v":770},{"$f":"zápis!Z12","v":666},{"$f":"zápis!AF12","v":782},{"$f":"zápis!AL12","v":775},{"$f":"zápis!AR12","v":816},5255,{"$f":"zápis!AT12","v":35},150.14285714285714," "]
["Hostivař","Růžička Ladislav",{"$f":"zápis!H28","v":744},{"$f":"zápis!N28","v":0},{"$f":"zápis!T28","v":0},{"$f":"zápis!Z28","v":0},{"$f":"zápis!AF28","v":717},{"$f":"zápis!AL28","v":664},{"$f":"zápis!AR28","v":792},2917,{"$f":"zápis!AT28","v":20},145.85]
["Hostivař","Berger Michal",{"$f":"zápis!H24","v":0},{"$f":"zápis!N24","v":689},{"$f":"zápis!T24","v":767},{"$f":"zápis!Z24","v":703},{"$f":"zápis!AF24","v":0},{"$f":"zápis!AL24","v":730},{"$f":"zápis!AR24","v":729},3618,{"$f":"zápis!AT24","v":25},144.72]
["Hostivař","Mysliveček  Jaroslav",{"$f":"zápis!H13","v":702},{"$f":"zápis!N13","v":768},{"$f":"zápis!T13","v":631},{"$f":"zápis!Z13","v":754},{"$f":"zápis!AF13","v":701},{"$f":"zápis!AL13","v":642},{"$f":"zápis!AR13","v":717},4915,{"$f":"zápis!AT13","v":35},140.42857142857142]
["Hostivař","Křápek Roman",{"$f":"zápis!H15","v":637},{"$f":"zápis!N15","v":632},{"$f":"zápis!T15","v":0},{"$f":"zápis!Z15","v":0},{"$f":"zápis!AF15","v":834},{"$f":"zápis!AL15","v":633},{"$f":"zápis!AR15","v":668},3404,{"$f":"zápis!AT15","v":25},136.16]
["Hostivař","Šafář Vladimír",{"$f":"zápis!H26","v":616},{"$f":"zápis!N26","v":708},{"$f":"zápis!T26","v":593},{"$f":"zápis!Z26","v":632},{"$f":"zápis!AF26","v":683},{"$f":"zápis!AL26","v":631},{"$f":"zápis!AR26","v":652},4515,{"$f":"zápis!AT26","v":35},129]
["Hostivař","Lazurová Jiřina",{"$f":"zápis!H20","v":0},{"$f":"zápis!N20","v":598},{"$f":"zápis!T20","v":669},{"$f":"zápis!Z20","v":0},{"$f":"zápis!AF20","v":704},{"$f":"zápis!AL20","v":0},{"$f":"zápis!AR20","v":551},2522,{"$f":"zápis!AT20","v":20},126.1]
["Hostivař","Kollár Pavel",{"$f":"zápis!H25","v":571},{"$f":"zápis!N25","v":0},{"$f":"zápis!T25","v":529},{"$f":"zápis!Z25","v":558},{"$f":"zápis!AF25","v":681},{"$f":"zápis!AL25","v":695},{"$f":"zápis!AR25","v":672},3706,{"$f":"zápis!AT25","v":30},123.53333333333333]
["Hostivař","Čermák Tomáš",{"$f":"zápis!H17","v":577},{"$f":"zápis!N17","v":0},{"$f":"zápis!T17","v":564},{"$f":"zápis!Z17","v":631},{"$f":"zápis!AF17","v":561},{"$f":"zápis!AL17","v":585},{"$f":"zápis!AR17","v":0},2918,{"$f":"zápis!AT17","v":25},116.72]
["Hostivař","Kalošová Dagmar",{"$f":"zápis!H23","v":496},{"$f":"zápis!N23","v":498},{"$f":"zápis!T23","v":0},{"$f":"zápis!Z23","v":533},{"$f":"zápis!AF23","v":0},{"$f":"zápis!AL23","v":0},{"$f":"zápis!AR23","v":0},1527,{"$f":"zápis!AT23","v":15},101.8]
["Hostivař","Bergerová Marcela",{"$f":"zápis!H27","v":0},{"$f":"zápis!N27","v":504},{"$f":"zápis!T27","v":0},{"$f":"zápis!Z27","v":511},{"$f":"zápis!AF27","v":0},{"$f":"zápis!AL27","v":0},{"$f":"zápis!AR27","v":0},1015,{"$f":"zápis!AT27","v":10},101.5]
["Hostivař","Svítil Pavel",{"$f":"zápis!H16","v":0},{"$f":"zápis!N16","v":0},{"$f":"zápis!T16","v":480},{"$f":"zápis!Z16","v":490},{"$f":"zápis!AF16","v":0},{"$f":"zápis!AL16","v":0},{"$f":"zápis!AR16","v":0},970,{"$f":"zápis!AT16","v":10},97]
["Hostivař","Jirkovská Iveta",{"$f":"zápis!H14","v":0},{"$f":"zápis!N14","v":0},{"$f":"zápis!T14","v":0},{"$f":"zápis!Z14","v":0},{"$f":"zápis!AF14","v":0},{"$f":"zápis!AL14","v":0},{"$f":"zápis!AR14","v":0}]
["Hostivař","Kačena Martin",{"$f":"zápis!H21","v":0},{"$f":"zápis!N21","v":0},{"$f":"zápis!T21","v":0},{"$f":"zápis!Z21","v":0},{"$f":"zápis!AF21","v":0},{"$f":"zápis!AL21","v":0},{"$f":"zápis!AR21","v":0}]
["Hostivař","Sláma Karel",{"$f":"zápis!H11","v":0},{"$f":"zápis!N11","v":0},{"$f":"zápis!T11","v":0},{"$f":"zápis!Z11","v":0},{"$f":"zápis!AF11","v":0},{"$f":"zápis!AL11","v":0},{"$f":"zápis!AR11","v":0}]
["Kačerov","Stejskal Martin",{"$f":"zápis!H42","v":0},{"$f":"zápis!N42","v":0},{"$f":"zápis!T42","v":846},{"$f":"zápis!Z42","v":0},{"$f":"zápis!AF42","v":0},{"$f":"zápis!AL42","v":0},{"$f":"zápis!AR42","v":0},{"$f":"SUM(C24:I24)","v":846},{"$f":"zápis!AT42","v":5},{"$f":"IF(K24=0,\"\",J24/K24)","v":169.2}]
["Kačerov","Ondřich František",{"$f":"zápis!H44","v":796},{"$f":"zápis!N44","v":815},{"$f":"zápis!T44","v":895},{"$f":"zápis!Z44","v":664},{"$f":"zápis!AF44","v":858},{"$f":"zápis!AL44","v":863},{"$f":"zápis!AR44","v":809},5700,{"$f":"zápis!AT44","v":35},162.85714285714286]
["Kačerov","Mašát Petr",{"$f":"zápis!H36","v":895},{"$f":"zápis!N36","v":826},{"$f":"zápis!T36","v":859},{"$f":"zápis!Z36","v":854},{"$f":"zápis!AF36","v":0},{"$f":"zápis!AL36","v":657},{"$f":"zápis!AR36","v":669},4760,{"$f":"zápis!AT36","v":30},158.66666666666666,null,null,null," "]
["Kačerov","Carvan Pavel",{"$f":"zápis!H33","v":752},{"$f":"zápis!N33","v":860},{"$f":"zápis!T33","v":705},{"$f":"zápis!Z33","v":842},{"$f":"zápis!AF33","v":683},{"$f":"zápis!AL33","v":762},{"$f":"zápis!AR33","v":810},5414,{"$f":"zápis!AT33","v":35},154.68571428571428]
["Kačerov","Tomášek Zdeněk",{"$f":"zápis!H35","v":825},{"$f":"zápis!N35","v":728},{"$f":"zápis!T35","v":733},{"$f":"zápis!Z35","v":723},{"$f":"zápis!AF35","v":725},{"$f":"zápis!AL35","v":0},{"$f":"zápis!AR35","v":0},3734,{"$f":"zápis!AT35","v":25},149.36000000000001]
["Kačerov","Hübner Jiří",{"$f":"zápis!H37","v":737},{"$f":"zápis!N37","v":0},{"$f":"zápis!T37","v":0},{"$f":"zápis!Z37","v":725},{"$f":"zápis!AF37","v":703},{"$f":"zápis!AL37","v":677},{"$f":"zápis!AR37","v":803},3645,{"$f":"zápis!AT37","v":25},145.80000000000001]
["Kačerov","Radová Petra",{"$f":"zápis!H45","v":718},{"$f":"zápis!N45","v":686},{"$f":"zápis!T45","v":684},{"$f":"zápis!Z45","v":688},{"$f":"zápis!AF45","v":717},{"$f":"zápis!AL45","v":685},{"$f":"zápis!AR45","v":675},4853,{"$f":"zápis!AT45","v":35},138.65714285714284]
["Kačerov","Douša Adam",{"$f":"zápis!H38","v":636},{"$f":"zápis!N38","v":766},{"$f":"zápis!T38","v":672},{"$f":"zápis!Z38","v":785},{"$f":"zápis!AF38","v":669},{"$f":"zápis!AL38","v":0},{"$f":"zápis!AR38","v":631},4159,{"$f":"zápis!AT38","v":30},138.63333333333333]
["Kačerov","Brož Stanislav",{"$f":"zápis!H34","v":657},{"$f":"zápis!N34","v":693},{"$f":"zápis!T34","v":742},{"$f":"zápis!Z34","v":666},{"$f":"zápis!AF34","v":0},{"$f":"zápis!AL34","v":723},{"$f":"zápis!AR34","v":625},4106,{"$f":"zápis!AT34","v":30},136.86666666666667]
["Kačerov","Turek Stanislav",{"$f":"zápis!H39","v":0},{"$f":"zápis!N39","v":0},{"$f":"zápis!T39","v":0},{"$f":"zápis!Z39","v":0},{"$f":"zápis!AF39","v":721},{"$f":"zápis!AL39","v":674},{"$f":"zápis!AR39","v":649},2044,{"$f":"zápis!AT39","v":15},136.26666666666668]
["Kačerov","Brejcha Jaroslav",{"$f":"zápis!H40","v":614},{"$f":"zápis!N40","v":618},{"$f":"zápis!T40","v":683},{"$f":"zápis!Z40","v":753},{"$f":"zápis!AF40","v":718},{"$f":"zápis!AL40","v":691},{"$f":"zápis!AR40","v":681},4758,{"$f":"zápis!AT40","v":35},135.94285714285715]
["Kačerov","Žalud Miroslav",{"$f":"zápis!H41","v":0},{"$f":"zápis!N41","v":625},{"$f":"zápis!T41","v":0},{"$f":"zápis!Z41","v":0},{"$f":"zápis!AF41","v":0},{"$f":"zápis!AL41","v":0},{"$f":"zápis!AR41","v":0},625,{"$f":"zápis!AT41","v":5},125]
["Kačerov","Kutina Pavel",{"$f":"zápis!H43","v":473},{"$f":"zápis!N43","v":611},{"$f":"zápis!T43","v":599},{"$f":"zápis!Z43","v":682},{"$f":"zápis!AF43","v":676},{"$f":"zápis!AL43","v":627},{"$f":"zápis!AR43","v":615},4283,{"$f":"zápis!AT43","v":35},122.37142857142857]
["Kačerov","Katolický Zdeněk",null,null,null,null,{"$f":"zápis!AF46","v":557},{"$f":"zápis!AL46","v":627},{"$f":"zápis!AM46","v":0},1184,{"$f":"zápis!AT46","v":10},118.4]
["Klíčov","Novotný Lukáš",{"$f":"zápis!H53","v":860},{"$f":"zápis!N53","v":833},{"$f":"zápis!T53","v":793},{"$f":"zápis!Z53","v":0},{"$f":"zápis!AF53","v":0},{"$f":"zápis!AL53","v":814},{"$f":"zápis!AR53","v":888},4188,{"$f":"zápis!AT53","v":25},167.52]
["Klíčov","Pecka Jiří",{"$f":"zápis!H56","v":814},{"$f":"zápis!N56","v":831},{"$f":"zápis!T56","v":831},{"$f":"zápis!Z56","v":0},{"$f":"zápis!AF56","v":751},{"$f":"zápis!AL56","v":854},{"$f":"zápis!AR56","v":790},4871,{"$f":"zápis!AT56","v":30},162.36666666666667]
["Klíčov","Kalfiřt Petr",{"$f":"zápis!H57","v":680},{"$f":"zápis!N57","v":796},{"$f":"zápis!T57","v":768},{"$f":"zápis!Z57","v":807},{"$f":"zápis!AF57","v":822},{"$f":"zápis!AL57","v":894},{"$f":"zápis!AR57","v":761},5528,{"$f":"zápis!AT57","v":35},157.94285714285715]
["Klíčov","Křemenák Petr",{"$f":"zápis!H64","v":707},{"$f":"zápis!N64","v":0},{"$f":"zápis!T64","v":703},{"$f":"zápis!Z64","v":638},{"$f":"zápis!AF64","v":801},{"$f":"zápis!AL64","v":0},{"$f":"zápis!AR64","v":687},3536,{"$f":"zápis!AT64","v":25},141.44]
["Klíčov","Troller Pavel",{"$f":"zápis!H50","v":691},{"$f":"zápis!N50","v":638},{"$f":"zápis!T50","v":0},{"$f":"zápis!Z50","v":0},{"$f":"zápis!AF50","v":757},{"$f":"zápis!AL50","v":701},{"$f":"zápis!AR50","v":742},3529,{"$f":"zápis!AT50","v":25},141.16]
["Klíčov","Šafář Bohumil",{"$f":"zápis!H60","v":0},{"$f":"zápis!N60","v":751},{"$f":"zápis!T60","v":660},{"$f":"zápis!Z60","v":0},{"$f":"zápis!AF60","v":0},{"$f":"zápis!AL60","v":0},{"$f":"zápis!AR60","v":0},1411,{"$f":"zápis!AT60","v":10},141.1]
["Klíčov","Štěpán Radek",{"$f":"zápis!H70","v":0},{"$f":"zápis!N70","v":0},{"$f":"zápis!T70","v":0},{"$f":"zápis!Z70","v":779},{"$f":"zápis!AF70","v":667},{"$f":"zápis!AL70","v":716},{"$f":"zápis!AR70","v":642},2804,{"$f":"zápis!AT70","v":20},140.19999999999999]
["Klíčov","Táborský Lukáš",{"$f":"zápis!H54","v":661},{"$f":"zápis!N54","v":0},{"$f":"zápis!T54","v":0},{"$f":"zápis!Z54","v":0},{"$f":"zápis!AF54","v":0},{"$f":"zápis!AL54","v":695},{"$f":"zápis!AR54","v":697},2053,{"$f":"zápis!AT54","v":15},136.86666666666667]
["Klíčov","Lokvenc Jiří",{"$f":"zápis!H62","v":0},{"$f":"zápis!N62","v":686},{"$f":"zápis!T62","v":0},{"$f":"zápis!Z62","v":0},{"$f":"zápis!AF62","v":0},{"$f":"zápis!AL62","v":645},{"$f":"zápis!AR62","v":0},1331,{"$f":"zápis!AT62","v":10},133.1]
["Klíčov","Kolář Ladislav",{"$f":"zápis!H69","v":0},{"$f":"zápis!N69","v":621},{"$f":"zápis!T69","v":0},{"$f":"zápis!Z69","v":0},{"$f":"zápis!AF69","v":0},{"$f":"zápis!AL69","v":650},{"$f":"zápis!AR69","v":0},1271,{"$f":"zápis!AT69","v":10},127.1]
["Klíčov","Krupka Jakub",{"$f":"zápis!H67","v":627},{"$f":"zápis!N67","v":0},{"$f":"zápis!T67","v":0},{"$f":"zápis!Z67","v":0},{"$f":"zápis!AF67","v":0},{"$f":"zápis!AL67","v":0},{"$f":"zápis!AR67","v":0},627,{"$f":"zápis!AT67","v":5},125.4]
["Klíčov","Hájek Mojmír",{"$f":"zápis!H63","v":0},{"$f":"zápis!N63","v":0},{"$f":"zápis!T63","v":699},{"$f":"zápis!Z63","v":549},{"$f":"zápis!AF63","v":0},{"$f":"zápis!AL63","v":0},{"$f":"zápis!AR63","v":0},1248,{"$f":"zápis!AT63","v":10},124.8]
["Klíčov","Novotná Petra",{"$f":"zápis!H52","v":590},{"$f":"zápis!N52","v":636},{"$f":"zápis!T52","v":681},{"$f":"zápis!Z52","v":594},{"$f":"zápis!AF52","v":606},{"$f":"zápis!AL52","v":0},{"$f":"zápis!AR52","v":0},3107,{"$f":"zápis!AT52","v":25},124.28]
["Klíčov","Novotná Jana",{"$f":"zápis!H58","v":0},{"$f":"zápis!N58","v":0},{"$f":"zápis!T58","v":581},{"$f":"zápis!Z58","v":0},{"$f":"zápis!AF58","v":585},{"$f":"zápis!AL58","v":0},{"$f":"zápis!AR58","v":0},1166,{"$f":"zápis!AT58","v":10},116.6]
["Klíčov","Pipek Pavel",{"$f":"zápis!H72","v":0},{"$f":"zápis!N72","v":0},{"$f":"zápis!T72","v":0},{"$f":"zápis!Z72","v":577},{"$f":"zápis!AF72","v":0},{"$f":"zápis!AL72","v":538},{"$f":"zápis!AR72","v":632},1747,{"$f":"zápis!AT72","v":15},116.46666666666667]
["Klíčov","Řehák Jaroslav",{"$f":"zápis!H66","v":553},{"$f":"zápis!N66","v":573},{"$f":"zápis!T66","v":567},{"$f":"zápis!Z66","v":560},{"$f":"zápis!AF66","v":649},{"$f":"zápis!AL66","v":0},{"$f":"zápis!AR66","v":0},2902,{"$f":"zápis!AT66","v":25},116.08]
["Klíčov","Pelikán Stanislav",{"$f":"zápis!H51","v":0},{"$f":"zápis!N51","v":0},{"$f":"zápis!T51","v":0},{"$f":"zápis!Z51","v":0},{"$f":"zápis!AF51","v":0},{"$f":"zápis!AL51","v":0},{"$f":"zápis!AR51","v":578},578,{"$f":"zápis!AT51","v":5},115.6]
["Klíčov","Táborský František",{"$f":"zápis!H55","v":530},{"$f":"zápis!N55","v":563},{"$f":"zápis!T55","v":0},{"$f":"zápis!Z55","v":535},{"$f":"zápis!AF55","v":0},{"$f":"zápis!AL55","v":615},{"$f":"zápis!AR55","v":544},2787,{"$f":"zápis!AT55","v":25},111.48]
["Klíčov","Neshyba Jaroslav",{"$f":"zápis!H68","v":0},{"$f":"zápis!N68","v":0},{"$f":"zápis!T68","v":0},{"$f":"zápis!Z68","v":0},{"$f":"zápis!AF68","v":550},{"$f":"zápis!AL68","v":0},{"$f":"zápis!AR68","v":0},550,{"$f":"zápis!AT68","v":5},110]
["Klíčov","Vychnerová Michala",{"$f":"zápis!H65","v":0},{"$f":"zápis!N65","v":0},{"$f":"zápis!T65","v":508},{"$f":"zápis!Z65","v":556},{"$f":"zápis!AF65","v":0},{"$f":"zápis!AL65","v":0},{"$f":"zápis!AR65","v":0},1064,{"$f":"zápis!AT65","v":10},106.4]
["Klíčov","Šafrová Martina",{"$f":"zápis!H61","v":0},{"$f":"zápis!N61","v":0},{"$f":"zápis!T61","v":0},{"$f":"zápis!Z61","v":0},{"$f":"zápis!AF61","v":518},{"$f":"zápis!AL61","v":0},{"$f":"zápis!AR61","v":0},518,{"$f":"zápis!AT61","v":5},103.6]
["Klíčov","Štarková Tereza",{"$f":"zápis!H71","v":0},{"$f":"zápis!N71","v":0},{"$f":"zápis!T71","v":0},{"$f":"zápis!Z71","v":487},{"$f":"zápis!AF71","v":0},{"$f":"zápis!AL71","v":0},{"$f":"zápis!AR71","v":0},487,{"$f":"zápis!AT71","v":5},97.4]
["Klíčov","Šafářová Veronika",{"$f":"zápis!H59","v":0},{"$f":"zápis!N59","v":0},{"$f":"zápis!T59","v":0},{"$f":"zápis!Z59","v":0},{"$f":"zápis!AF59","v":0},{"$f":"zápis!AL59","v":0},{"$f":"zápis!AR59","v":0}]
["Řepy","Kocúr Jaroslav",{"$f":"zápis!H77","v":744},{"$f":"zápis!N77","v":915},{"$f":"zápis!T77","v":960},{"$f":"zápis!Z77","v":0},{"$f":"zápis!AF77","v":854},{"$f":"zápis!AL77","v":889},{"$f":"zápis!AR77","v":850},{"$f":"SUM(C61:I61)","v":5212},{"$f":"zápis!AT77","v":30},{"$f":"IF(K61=0,\"\",J61/K61)","v":173.73333333333332}]
["Řepy","Pospíšil Václav",{"$f":"zápis!H76","v":881},{"$f":"zápis!N76","v":876},{"$f":"zápis!T76","v":814},{"$f":"zápis!Z76","v":901},{"$f":"zápis!AF76","v":766},{"$f":"zápis!AL76","v":834},{"$f":"zápis!AR76","v":844},5916,{"$f":"zápis!AT76","v":35},169.02857142857144]
["Řepy","Froněk Martin",{"$f":"zápis!H88","v":0},{"$f":"zápis!N88","v":0},{"$f":"zápis!T88","v":720},{"$f":"zápis!Z88","v":0},{"$f":"zápis!AF88","v":0},{"$f":"zápis!AL88","v":778},{"$f":"zápis!AR88","v":893},2391,{"$f":"zápis!AT88","v":15},159.4]
["Řepy","Kročil Tomáš",{"$f":"zápis!H83","v":786},{"$f":"zápis!N83","v":806},{"$f":"zápis!T83","v":742},{"$f":"zápis!Z83","v":791},{"$f":"zápis!AF83","v":802},{"$f":"zápis!AL83","v":728},{"$f":"zápis!AR83","v":796},5451,{"$f":"zápis!AT83","v":35},155.74285714285713]
["Řepy","Alba Vladimír",{"$f":"zápis!H84","v":777},{"$f":"zápis!N84","v":701},{"$f":"zápis!T84","v":770},{"$f":"zápis!Z84","v":738},{"$f":"zápis!AF84","v":776},{"$f":"zápis!AL84","v":814},{"$f":"zápis!AR84","v":722},5298,{"$f":"zápis!AT84","v":35},151.37142857142857]
["Řepy","Sladovník Miloš",{"$f":"zápis!H80","v":720},{"$f":"zápis!N80","v":693},{"$f":"zápis!T80","v":727},{"$f":"zápis!Z80","v":842},{"$f":"zápis!AF80","v":668},{"$f":"zápis!AL80","v":0},{"$f":"zápis!AR80","v":755},4405,{"$f":"zápis!AT80","v":30},146.83333333333334]
["Řepy","Mottl Pavel",{"$f":"zápis!H81","v":664},{"$f":"zápis!N81","v":596},{"$f":"zápis!T81","v":838},{"$f":"zápis!Z81","v":773},{"$f":"zápis!AF81","v":630},{"$f":"zápis!AL81","v":673},{"$f":"zápis!AR81","v":628},4802,{"$f":"zápis!AT81","v":35},137.19999999999999]
["Řepy","Číhal František",{"$f":"zápis!H82","v":0},{"$f":"zápis!N82","v":0},{"$f":"zápis!T82","v":0},{"$f":"zápis!Z82","v":681},{"$f":"zápis!AF82","v":0},{"$f":"zápis!AL82","v":0},{"$f":"zápis!AR82","v":0},681,{"$f":"zápis!AT82","v":5},136.19999999999999]
["Řepy","Sehnal Ivan",{"$f":"zápis!H78","v":631},{"$f":"zápis!N78","v":665},{"$f":"zápis!T78","v":680},{"$f":"zápis!Z78","v":761},{"$f":"zápis!AF78","v":722},{"$f":"zápis!AL78","v":612},{"$f":"zápis!AR78","v":658},4729,{"$f":"zápis!AT78","v":35},135.11428571428573]
["Řepy","Tichý Hugo",{"$f":"zápis!H85","v":705},{"$f":"zápis!N85","v":636},{"$f":"zápis!T85","v":711},{"$f":"zápis!Z85","v":618},{"$f":"zápis!AF85","v":0},{"$f":"zápis!AL85","v":597},{"$f":"zápis!AR85","v":0},3267,{"$f":"zápis!AT85","v":25},130.68]
["Řepy","Křikavová Miroslava",{"$f":"zápis!H94","v":0},{"$f":"zápis!N94","v":0},{"$f":"zápis!T94","v":0},{"$f":"zápis!Z94","v":0},{"$f":"zápis!AF94","v":640},{"$f":"zápis!AL94","v":0},{"$f":"zápis!AR94","v":0},640,{"$f":"zápis!AT94","v":5},128]
["Řepy","Plecháček Miroslav",{"$f":"zápis!H79","v":653},{"$f":"zápis!N79","v":608},{"$f":"zápis!T79","v":0},{"$f":"zápis!Z79","v":0},{"$f":"zápis!AF79","v":0},{"$f":"zápis!AL79","v":0},{"$f":"zápis!AR79","v":0},1261,{"$f":"zápis!AT79","v":10},126.1]
["Řepy","Růžička Václav",{"$f":"zápis!H90","v":0},{"$f":"zápis!N90","v":0},{"$f":"zápis!T90","v":0},{"$f":"zápis!Z90","v":619},{"$f":"zápis!AF90","v":0},{"$f":"zápis!AL90","v":598},{"$f":"zápis!AR90","v":586},1803,{"$f":"zápis!AT90","v":15},120.2]
["Řepy","Křikava Miroslav",{"$f":"zápis!H86","v":572},{"$f":"zápis!N86","v":548},{"$f":"zápis!T86","v":536},{"$f":"zápis!Z86","v":651},{"$f":"zápis!AF86","v":619},{"$f":"zápis!AL86","v":626},{"$f":"zápis!AR86","v":644},4196,{"$f":"zápis!AT86","v":35},119.88571428571429]
["Řepy","Dvořák Petr",{"$f":"zápis!H87","v":0},{"$f":"zápis!N87","v":0},{"$f":"zápis!T87","v":0},{"$f":"zápis!Z87","v":0},{"$f":"zápis!AF87","v":524},{"$f":"zápis!AL87","v":0},{"$f":"zápis!AR87","v":0},524,{"$f":"zápis!AT87","v":5},104.8]
["Řepy","Brejcha Jaroslav st.",{"$f":"zápis!H95","v":0},{"$f":"zápis!N95","v":0},{"$f":"zápis!T95","v":0},{"$f":"zápis!Z95","v":0},{"$f":"zápis!AF95","v":0},{"$f":"zápis!AL95","v":0},{"$f":"zápis!AR95","v":0}]
["Řepy","Fidler Slávek",{"$f":"zápis!H89","v":0},{"$f":"zápis!N89","v":0},{"$f":"zápis!T89","v":0},{"$f":"zápis!Z89","v":0},{"$f":"zápis!AF89","v":0},{"$f":"zápis!AL89","v":0},{"$f":"zápis!AR89","v":0}]
["Řepy","Orlík Rostislav",{"$f":"zápis!H93","v":0},{"$f":"zápis!N93","v":0},{"$f":"zápis!T93","v":0},{"$f":"zápis!Z93","v":0},{"$f":"zápis!AF93","v":0},{"$f":"zápis!AL93","v":0},{"$f":"zápis!AR93","v":0}]
["Řepy","Piešťanský Josef",{"$f":"zápis!H92","v":0},{"$f":"zápis!N92","v":0},{"$f":"zápis!T92","v":0},{"$f":"zápis!Z92","v":0},{"$f":"zápis!AF92","v":0},{"$f":"zápis!AL92","v":0},{"$f":"zápis!AR92","v":0}]
["Řepy","Šindelář Karel",{"$f":"zápis!H91","v":0},{"$f":"zápis!N91","v":0},{"$f":"zápis!T91","v":0},{"$f":"zápis!Z91","v":0},{"$f":"zápis!AF91","v":0},{"$f":"zápis!AL91","v":0},{"$f":"zápis!AR91","v":0}]
["Vršovice","Krupa Jozef",{"$f":"zápis!H99","v":799},{"$f":"zápis!N99","v":891},{"$f":"zápis!T99","v":760},{"$f":"zápis!Z99","v":883},{"$f":"zápis!AF99","v":959},{"$f":"zápis!AL99","v":847},{"$f":"zápis!AR99","v":860},{"$f":"SUM(C81:I81)","v":5999},{"$f":"zápis!AT99","v":35},{"$f":"IF(K81=0,\"\",J81/K81)","v":171.4}]
["Vršovice","Greman Milan",{"$f":"zápis!H118","v":0},{"$f":"zápis!N118","v":0},{"$f":"zápis!T118","v":0},{"$f":"zápis!Z118","v":840},{"$f":"zápis!AF118","v":0},{"$f":"zápis!AL118","v":0},{"$f":"zápis!AR118","v":0},840,{"$f":"zápis!AT118","v":5},168]
["Vršovice","Podhola Martin",{"$f":"zápis!H110","v":0},{"$f":"zápis!N110","v":896},{"$f":"zápis!T110","v":824},{"$f":"zápis!Z110","v":0},{"$f":"zápis!AF110","v":826},{"$f":"zápis!AL110","v":0},{"$f":"zápis!AR110","v":757},3303,{"$f":"zápis!AT110","v":20},165.15]
["Vršovice","Holkup Jan",{"$f":"zápis!H111","v":755},{"$f":"zápis!N111","v":790},{"$f":"zápis!T111","v":0},{"$f":"zápis!Z111","v":0},{"$f":"zápis!AF111","v":912},{"$f":"zápis!AL111","v":823},{"$f":"zápis!AR111","v":802},4082,{"$f":"zápis!AT111","v":25},163.28]
["Vršovice","Věchtík Antonín",{"$f":"zápis!H109","v":830},{"$f":"zápis!N109","v":0},{"$f":"zápis!T109","v":0},{"$f":"zápis!Z109","v":0},{"$f":"zápis!AF109","v":0},{"$f":"zápis!AL109","v":0},{"$f":"zápis!AR109","v":766},1596,{"$f":"zápis!AT109","v":10},159.6]
["Vršovice","Skružná Pavla",{"$f":"zápis!H103","v":616},{"$f":"zápis!N103","v":738},{"$f":"zápis!T103","v":811},{"$f":"zápis!Z103","v":0},{"$f":"zápis!AF103","v":795},{"$f":"zápis!AL103","v":0},{"$f":"zápis!AR103","v":647},3607,{"$f":"zápis!AT103","v":25},144.28]
["Vršovice","Krupová Martina",{"$f":"zápis!H101","v":0},{"$f":"zápis!N101","v":662},{"$f":"zápis!T101","v":0},{"$f":"zápis!Z101","v":725},{"$f":"zápis!AF101","v":0},{"$f":"zápis!AL101","v":755},{"$f":"zápis!AR101","v":0},2142,{"$f":"zápis!AT101","v":15},142.80000000000001]
["Vršovice","Bošek Jan",{"$f":"zápis!H116","v":0},{"$f":"zápis!N116","v":710},{"$f":"zápis!T116","v":673},{"$f":"zápis!Z116","v":675},{"$f":"zápis!AF116","v":723},{"$f":"zápis!AL116","v":773},{"$f":"zápis!AR116","v":0},3554,{"$f":"zápis!AT116","v":25},142.16]
["Vršovice","Kučera Miroslav",{"$f":"zápis!H113","v":0},{"$f":"zápis!N113","v":0},{"$f":"zápis!T113","v":665},{"$f":"zápis!Z113","v":724},{"$f":"zápis!AF113","v":0},{"$f":"zápis!AL113","v":0},{"$f":"zápis!AR113","v":0},1389,{"$f":"zápis!AT113","v":10},138.9]
["Vršovice","Kazda Jan",{"$f":"zápis!H105","v":655},{"$f":"zápis!N105","v":656},{"$f":"zápis!T105","v":676},{"$f":"zápis!Z105","v":700},{"$f":"zápis!AF105","v":0},{"$f":"zápis!AL105","v":694},{"$f":"zápis!AR105","v":682},4063,{"$f":"zápis!AT105","v":30},135.43333333333334]
["Vršovice","Kovář Jaroslav",{"$f":"zápis!H114","v":673},{"$f":"zápis!N114","v":0},{"$f":"zápis!T114","v":726},{"$f":"zápis!Z114","v":569},{"$f":"zápis!AF114","v":688},{"$f":"zápis!AL114","v":596},{"$f":"zápis!AR114","v":0},3252,{"$f":"zápis!AT114","v":25},130.08000000000001]
["Vršovice","Pospíšil Lukáš",{"$f":"zápis!H100","v":611},{"$f":"zápis!N100","v":683},{"$f":"zápis!T100","v":573},{"$f":"zápis!Z100","v":583},{"$f":"zápis!AF100","v":697},{"$f":"zápis!AL100","v":0},{"$f":"zápis!AR100","v":575},3722,{"$f":"zápis!AT100","v":30},124.06666666666666]
["Vršovice","Aunický František",{"$f":"zápis!H104","v":560},{"$f":"zápis!N104","v":604},{"$f":"zápis!T104","v":605},{"$f":"zápis!Z104","v":705},{"$f":"zápis!AF104","v":619},{"$f":"zápis!AL104","v":593},{"$f":"zápis!AR104","v":640},4326,{"$f":"zápis!AT104","v":35},123.6]
["Vršovice","Pavlíček Rudolf",{"$f":"zápis!H117","v":0},{"$f":"zápis!N117","v":0},{"$f":"zápis!T117","v":0},{"$f":"zápis!Z117","v":0},{"$f":"zápis!AF117","v":564},{"$f":"zápis!AL117","v":623},{"$f":"zápis!AR117","v":619},1806,{"$f":"zápis!AT117","v":15},120.4]
["Vršovice","Veselý Vlastimil",{"$f":"zápis!H108","v":589},{"$f":"zápis!N108","v":0},{"$f":"zápis!T108","v":0},{"$f":"zápis!Z108","v":0},{"$f":"zápis!AF108","v":0},{"$f":"zápis!AL108","v":0},{"$f":"zápis!AR108","v":0},589,{"$f":"zápis!AT108","v":5},117.8]
["Vršovice","Fay Vlastimil",{"$f":"zápis!H115","v":571},{"$f":"zápis!N115","v":603},{"$f":"zápis!T115","v":611},{"$f":"zápis!Z115","v":601},{"$f":"zápis!AF115","v":539},{"$f":"zápis!AL115","v":598},{"$f":"zápis!AR115","v":0},3523,{"$f":"zápis!AT115","v":30},117.43333333333334]
["Vršovice","Hyková Lucie",{"$f":"zápis!H107","v":0},{"$f":"zápis!N107","v":0},{"$f":"zápis!T107","v":0},{"$f":"zápis!Z107","v":0},{"$f":"zápis!AF107","v":0},{"$f":"zápis!AL107","v":333},{"$f":"zápis!AR107","v":400},733,{"$f":"zápis!AT107","v":10},73.3]
["Vršovice","Krupa Martin",{"$f":"zápis!H102","v":0},{"$f":"zápis!N102","v":0},{"$f":"zápis!T102","v":0},{"$f":"zápis!Z102","v":0},{"$f":"zápis!AF102","v":0},{"$f":"zápis!AL102","v":0},{"$f":"zápis!AR102","v":0}]
["Vršovice","Pokorný Josef",{"$f":"zápis!H112","v":0},{"$f":"zápis!N112","v":0},{"$f":"zápis!T112","v":0},{"$f":"zápis!Z112","v":0},{"$f":"zápis!AF112","v":0},{"$f":"zápis!AL112","v":0},{"$f":"zápis!AR112","v":0}]
["Vršovice","Tůma Antonín",{"$f":"zápis!H106","v":0},{"$f":"zápis!N106","v":0},{"$f":"zápis!T106","v":0},{"$f":"zápis!Z106","v":0},{"$f":"zápis!AF106","v":0},{"$f":"zápis!AL106","v":0},{"$f":"zápis!AR106","v":0}]
["Vršovice","Vrzal Pavel",{"$f":"zápis!H119","v":0},{"$f":"zápis!N119","v":0},{"$f":"zápis!T119","v":0},{"$f":"zápis!Z119","v":0},{"$f":"zápis!AF119","v":0},{"$f":"zápis!AL119","v":0},{"$f":"zápis!AR119","v":0}]
[]
[]
[null,null,null,null,null,null,null,null,null,null,null,null,null,null," "]

{"sheet":"stat. celkem","index":2,"n_rows":53,"n_cols":194,"rows_kept":53,"cut":false,"hidden":false,"merged":[[0,179,2,179],[0,180,0,193],[1,180,2,181],[1,183,2,184],[1,186,2,187],[1,189,2,190],[1,192,2,193],[1,166,2,167],[1,154,2,155],[1,157,2,158],[0,153,2,153],[0,50,0,63],[0,76,0,89],[0,102,0,115],[0,128,0,141],[1,163,2,164],[1,62,2,63],[1,76,2,77],[1,79,2,80],[1,82,2,83],[1,114,2,115],[1,108,2,109],[1,111,2,112],[0,23,2,23],[0,49,2,49],[0,75,2,75],[0,101,2,101],[1,102,2,103],[1,105,2,106],[1,33,2,34],[1,36,2,37],[1,50,2,51],[1,53,2,54],[1,160,2,161],[1,131,2,132],[1,134,2,135],[1,137,2,138],[1,140,2,141],[1,85,2,86],[1,88,2,89],[0,127,2,127],[1,128,2,129],[0,154,0,167],[1,56,2,57],[1,59,2,60],[0,24,0,37],[1,24,2,25],[1,27,2,28],[1,30,2,31],[0,1,0,16],[23,10,23,15],[19,10,19,15],[2,10,2,12],[2,14,2,16],[15,10,15,15],[11,10,11,15],[7,10,7,15],[3,10,3,15],[27,10,27,15],[1,1,2,2],[1,4,2,5],[1,7,2,8],[1,10,1,16],[4,18,6,18]]}
[null,"        ZE VŠECH TURNAJŮ   2013                                                            jednotlivé turnaje          ",null,null,null,null,null,null,null,null,null,null,null,null,null,null,null,null,null,null,null,null,null,"ZPĚT","2013-01-19",null,null,null,null,null,null,null,null,null,null,null,null,null,null,null,null,null,null,null,null,null,null,null,null,"ZPĚT","9.2.2013   KLÍČOV",null,null,null,null,null,null,null,null,null,null,null,null,null,null,null,null,null,null,null,null,null,null,null,null,"ZPĚT","9.3.2013   ŘEPY",null,null,null,null,null,null,null,null,null,null,null,null,null,null,null,null,null,null,null,null,null,null,null,null,"ZPĚT","27.4.2013   HOSTIVAŘ",null,null,null,null,null,null,null,null,null,null,null,null,null,null,null,null,null,null,null,null,null,null,null,null,"ZPĚT","12.10.2013   KAČEROV",null,null,null,null,null,null,null,null,null,null,null,null,null,null,null,null,null,null,null,null,null,null,null,null,"ZPĚT","9.11.2013   VRŠOVICE",null,null,null,null,null,null,null,null,null,null,null,null,null,null,null,null,null,null,null,null,null,null,null,null,"ZPĚT","8.12.2013   POHÁR GENERÁLNÍHO ŘEDITELE - DP"]
[null,"25                                      nejvyšších náhozů",null,null,"25                                      nejnižších náhozů",null,null,"25                                      nejvyšších průměrů",null,"turnaje","umístnění v jednotlivých turnajích",null,null,null,null,null,null,null,null,null,null,null,null,null,"nejvyšší nához jednotlivce",null,null,"nejnižší nához jednotlivce",null,null,"25                                      nejvyšších náhozů",null,null,"25                                      nejnižších náhozů",null,null,"25                                      nejvyšších náhozů            na turnaj",null,null,null,null,null,null,null,null,null,null,null,null,null,"nejvyšší nához jednotlivce",null,null,"nejnižší nához jednotlivce",null,null,"25                                      nejvyšších náhozů",null,null,"25                                      nejnižších náhozů",null,null,"25                                      nejvyšších náhozů            na turnaj",null,null,null,null,null,null,null,null,null,null,null,null,null,"nejvyšší nához jednotlivce",null,null,"nejnižší nához jednotlivce",null,null,"25                                      nejvyšších náhozů",null,null,"25                                      nejnižších náhozů",null,null,"25                                      nejvyšších náhozů            na turnaj",null,null,null,null,null,null,null,null,null,null,null,null,null,"nejvyšší nához jednotlivce",null,null,"nejnižší nához jednotlivce",null,null,"25                                      nejvyšších náhozů",null,null,"25                                      nejnižších náhozů",null,null,"25                                      nejvyšších náhozů            na turnaj",null,null,null,null,null,null,null,null,null,null,null,null,null,"nejvyšší nához jednotlivce",null,null,"nejnižší nához jednotlivce",null,null,"25                                      nejvyšších náhozů",null,null,"25                                      nejnižších náhozů",null,null,"25                                      nejvyšších náhozů            na turnaj",null,null,null,null,null,null,null,null,null,null,null,null,null,"nejvyšší nához jednotlivce",null,null,"nejnižší nához jednotlivce",null,null,"25                                      nejvyšších náhozů",null,null,"25                                      nejnižších náhozů",null,null,"25                                      nejvyšších náhozů            na turnaj",null,null,null,null,null,null,null,null,null,null,null,null,null,"nejvyšší nához jednotlivce",null,null,"nejnižší nához jednotlivce",null,null,"25                                      nejvyšších náhozů",null,null,"25                                      nejnižších náhozů",null,null,"25                                      nejvyšších náhozů            na turnaj"]
[null,null,null," ",null,null,null,null,null,"jednotlivci","družstva",null,null,null,"jednotlivci",null,null,null,null,null,null,null,null,null,null,null,null,null,null,null,null,null," ",null,null,null,null,null,null,null,null,null,null,null,null,null,null,null,null,null,null,null,null,null,null,null,null,null," ",null,null,null,null,null,null,null,null,null,null,null,null,null,null,null,null,null,null,null,null,null,null,null,null,null," ",null,null,null,null,null,null,null,null,null,null,null,null,null,null,null,null,null,null,null,null,null,null,null,null,null," ",null,null,null,null,null,null,null,null,null,null,null,null,null,null,null,null,null,null,null,null,null,null,null,null,null," ",null,null,null,null,null,null,null,null,null,null,null,null,null,null,null,null,null,null,null,null,null,null,null,null,null," ",null,null,null,null,null,null,null,null,null,null,null,null,null,null,null,null,null,null,null,null,null,null,null,null,null," "]
[null,"Mašát Petr",243,null,"Hyková Lucie",49,null,"Šafařík Luděk",962,null,"PV-OSZO DP-A    19.1.2013",null,null,null,null,null,"klikni",null,null,null,null,null,null,null,"Šafařík Luděk",231,null,"Kutina Pavel",75,null,"Šafařík Luděk",231,null,"Kutina Pavel",75,null,"Šafařík Luděk",928,null,null,null,null,null,null,null,null,null,null,null,null,"Lazur Vladimír",227,null,"Řehák Jaroslav",81,null,"Lazur Vladimír",227,null,"Řehák Jaroslav",81,null,"Lazur Vladimír",945,null,null,null,null,null,null,null,null,null,null,null,null,"Kocúr Jaroslav",232,null,"Svítil Pavel",68,null,"Kocúr Jaroslav",232,null,"Svítil Pavel",68,null,"Kocúr Jaroslav",960,null,null,null,null,null,null,null,null,null,null,null,null,"Mašát Petr",243,null,"Svítil Pavel",66,null,"Mašát Petr",243,null,"Svítil Pavel",66,null,"Pospíšil Václav",901,null,null,null,null,null,null,null,null,null,null,null,null,"Holkup Jan",235,null,"Čermák Tomáš",78,null,"Holkup Jan",235,null,"Čermák Tomáš",78,null,"Krupa Jozef",959,null,null,null,null,null,null,null,null,null,null,null,null,"Holkup Jan",228,null,"Hyková Lucie",49,null,"Holkup Jan",228,null,"Hyková Lucie",49,null,"Šafařík Luděk",962,null,null,null,null,null,null,null,null,null,null,null,null,"Lazur Vladimír",223,null,"Hyková Lucie",60,null,"Lazur Vladimír",223,null,"Hyková Lucie",60,null,"Froněk Martin",893]
[null,"Holkup Jan",235,null,"Hyková Lucie",60,null,"Kocúr Jaroslav",960,null,"1. místo","Kačerov",4005,null,"1. místo","Šafařík Luděk",928,null,null,null,null,null,null,null,"Ondřich František",217,null,"Kalošová Dagmar",79,null,"Ondřich František",217,null,"Kalošová Dagmar",79,null,"Mašát Petr",895,null,null,null,null,null,null,null,null,null,null,null,null,"Šafařík Luděk",223,null,"Křikava Miroslav",84,null,"Lazur Vladimír",223,null,"Křikava Miroslav",84,null,"Kocůr Jaroslav",915,null,null,null,null,null,null,null,null,null,null,null,null,"Stejskal Martin",228,null,"Vychnerová Michala",84,null,"Stejskal Martin",228,null,"Vychnerová Michala",84,null,"Šafařík Luděk",897,null,null,null,null,null,null,null,null,null,null,null,null,"German Milan",221,null,"Kalošová Dagmar",69,null,"German Milan",221,null,"Kalošová Dagmar",69,null,"Šafařík Luděk",883,null,null,null,null,null,null,null,null,null,null,null,null,"Křápek Roman",223,null,"Dvořák Petr",79,null,"Křápek Roman",223,null,"Dvořák Petr",79,null,"Holkup Jan",912,null,null,null,null,null,null,null,null,null,null,null,null,"Šafařík Luděk",213,null,"Aunický František",76,null,"Šafařík Luděk",213,null,"Hyková Lucie",56,null,"Lazur Vladimír",901,null,null,null,null,null,null,null,null,null,null,null,null,"Kocůr Jaroslav",210,null,"Pipek Pavel",78,null,"Kocůr Jaroslav",210,null,"Hyková Lucie",74,null,"Novotný Lukáš",888]
[null,"Kocúr Jaroslav",232,null,"Svítil Pavel",66,null,"Krupa Jozef",959,null,"2. místo","Hostivař",3883,null,"2. místo","Mašát Petr",895,null,null,null,null,null,null,null,"Tomášek Zdeněk",208,null,"Fay Vlastimil",83,null,"Tomášek Zdeněk",208,null,"Fay Vlastimil",83,null,"Pospíšil Václav",881,null,null,null,null,null,null,null,null,null,null,null,null,"Pospíšil Václav",218,null,"Bergerová Marcela",85,null,"Šafařík Luděk",223,null,"Bergerová Marcela",85,null,"Šafařík Luděk",905,null,null,null,null,null,null,null,null,null,null,null,null,"Mašát Petr",205,null,"Šafář Ladislav",92,null,"Kocúr Jaroslav",211,null,"Svítil Pavel",85,null,"Ondřich František",895,null,null,null,null,null,null,null,null,null,null,null,null,"Kročil Tomáš",218,null,"Hájek Mojmír",75,null,"Kročil Tomáš",218,null,"Hájek Mojmír",75,null,"Krupa Jozef",883,null,null,null,null,null,null,null,null,null,null,null,null,"Krupa Jozef",205,null,"Šafrová Martina",81,null,"Krupa Jozef",205,null,"Šafrová Martina",81,null,"Ondřich František",858,null,null,null,null,null,null,null,null,null,null,null,null,"Lazur Vladimír",212,null,"Katolický Zdeněk",80,null,"Pecka Jiří",212,null,"Hyková Lucie",65,null,"Kalfiřt Petr",894,null,null,null,null,null,null,null,null,null,null,null,null,"Hübner Jiří",208,null,"Aunický František",83,null,"Hübner Jiří",208,null,"Pipek Pavel",78,null,"Lazur Vladimír",863]
[null,"Šafařík Luděk",231,null,"Svítil Pavel",68,null,"Lazur Vladimír",945,null,"3. místo","Řepy",3852,null,"3. místo","Pospíšil Václav",881,null,null,null,null,null,null,null,"Pospíšil Václav",205,null,"Táborský František",86,null,"Věchtík Antonín",205,null,"Kalošová Dagmar",85,null,"Novotný Lukáš",860,null,null,null,null,null,null,null,null,null,null,null,null,"Kročil Tomáš",207,null,"Sehnal Ivan",86,null,"Pospíšil Václav",218,null,"Bergerová Marcela",85,null,"Podhola Martin",896,null,null,null,null,null,null,null,null,null,null,null,null,"Ondřich František",205,null,"Řehák Jaroslav",93,null,"Mašát Petr",205,null,"Šafář Ladislav",92,null,"Mašát Petr",859,null,null,null,null,null,null,null,null,null,null,null,null,"Berger Michal",212,null,"Růžička Václav",75,null,"Berger Michal",212,null,"Růžička Václav",75,null,"Mašát Petr",854,null,null,null,null,null,null,null,null,null,null,null,null,"Kocúr Jaroslav",204,null,"Kolár Pavel",90,null,"Kocúr Jaroslav",204,null,"Kolár Pavel",90,null,"Kocúr Jaroslav",854,null,null,null,null,null,null,null,null,null,null,null,null,"Pecka Jiří",212,null,"Pipek Pavel",88,null,"Lazur Vladimír",212,null,"Aunický František",76,null,"Kocúr Jaroslav",889,null,null,null,null,null,null,null,null,null,null,null,null,"Novotný Lukáš",203,null,"Lazurová Jiřina",86,null,"Novotný Lukáš",203,null,"Hyková Lucie",82,null,"Krupa Jozef",860]
[null,"Stejskal Martin",228,null,"Svítil Pavel",68,null,"Šafařík Luděk",928,null,"KLÍČOV    9.2.2013",null,null,null,null,null,"klikni",null,null,null,null,null,null,null,"Věchtík Antonín",205,null,"Křikava Miroslav",88,null,"Pospíšil Václav",205,null,"Táborský František",86,null,"Lazur Ladislav",847,null,null,null,null,null,null,null,null,null,null,null,null,"Pecka Jiří",205,null,"Kalošová Dagmar",89,null,"Kročil Tomáš",207,null,"Sehnal Ivan",86,null,"Krupa Josef",891,null,null,null,null,null,null,null,null,null,null,null,null,"Šafařík Luděk",205,null,"Kutina Pavel",97,null,"Šafařík Luděk",205,null,"Řehák Jaroslav",93,null,"Stejskal Martin",846,null,null,null,null,null,null,null,null,null,null,null,null,"Šafařík Luděk",212,null,"Vychnerová Michaela",79,null,"Šafařík Luděk",212,null,"Vychnerová Michaela",79,null,"Carvan Pavel",842,null,null,null,null,null,null,null,null,null,null,null,null,"Ondřich František",194,null,"Novotná Petra",91,null,"Krupa Jozef",201,null,"Novotná Petra",91,null,"Křápek Roman",834,null,null,null,null,null,null,null,null,null,null,null,null,"Kalfiřt Petr",211,null,"Čermák Tomáš",89,null,"Kalfiřt Petr",211,null,"Katolický Zdeněk",80,null,"Ondřich František",863,null,null,null,null,null,null,null,null,null,null,null,null,"Ondřich František",200,null,"Kazda Jan",86,null,"Ondřich František",200,null,"Aunický František",83,null,"Kocůr Jaroslav",850]
[null,"Holkup Jan",228,null,"Kalošová Dagmar",69,null,"Kocůr Jaroslav",915,null,"1. místo","Vršovice",3998,null,"1. místo","Lazur Vladimír",945,null,null,null,null,null,null,null,"Krupa Jozef",201,null,"Čermák Tomáš",89,null,"Krupa Jozef",201,null,"Kutina Pavel",86,null,"Věchtík Antonín",830,null,null,null,null,null,null,null,null,null,null,null,null,"Douša Adam",197,null,"Mottl Pavel",96,null,"Pecka Jiří",205,null,"Křikava Miroslav",88,null,"Pospíšil Václav",876,null,null,null,null,null,null,null,null,null,null,null,null,"Alba Vladimír",202,null,"Kollár Pavel",97,null,"Ondřich František",205,null,"Kutina Pavel",97,null,"Mottl Pavel",838,null,null,null,null,null,null,null,null,null,null,null,null,"Carvan Pavel",200,null,"Bergerová Marcela",82,null,"Carvan Pavel",200,null,"Svítil Pavel",82,null,"Sladovník Miloslav",842,null,null,null,null,null,null,null,null,null,null,null,null,"Troller Pavel",192,null,"Neshyba Jaroslav",92,null,"Krupa Jozef",199,null,"Neshyba Jaroslav",92,null,"Podhola Martin",826,null,null,null,null,null,null,null,null,null,null,null,null,"Táborský Lukáš",210,null,"Kovář Jaroslav",90,null,"Táborský Lukáš",210,null,"Hyková Lucie",81,null,"Pecka Jiří",854,null,null,null,null,null,null,null,null,null,null,null,null,"Froněk Martin",199,null,"Růžička Václav",87,null,"Froněk Martin",199,null,"Lazurová Jiřina",86,null,"Pospíšil Václav",844]
[null,"Lazur Vladimír",227,null,"Hyková Lucie",74,null,"Holkup Jan",912,null,"2. místo","Řepy",3991,null,"2. místo","Kocúr Jaroslav",915,null,null,null,null,null,null,null,"Mašát Petr",192,null,"Kollár Pavel",89,null,"Šafařík Luděk",200,null,"Křikava Miroslav",88,null,"Tomášek Zdeněk",825,null,null,null,null,null,null,null,null,null,null,null,null,"Kocůr Jaroslav",196,null,"Lazurová Jiřina",96,null,"Lazur Vladimír",197,null,"Kalošová Dagmar",89,null,"Carvan Pavel",860,null,null,null,null,null,null,null,null,null,null,null,null,"Mottl Pavel",201,null,"Křikava Miroslav",98,null,"Alba Vladimír",202,null,"Kollár Pavel",97,null,"Pecka Jiří",831,null,null,null,null,null,null,null,null,null,null,null,null,"Kalfiřt Petr",194,null,"Pospíšil Lukáš",87,null,"Kalfiřt Petr",194,null,"Bergerová Marcela",82,null,"German Milan",840,null,null,null,null,null,null,null,null,null,null,null,null,"Kalfiřt Petr",192,null,"Pavlíček Rudolf",97,null,"Ondřich František",194,null,"Dvořák Petr",93,null,"Kalfiřt Petr",822,null,null,null,null,null,null,null,null,null,null,null,null,"Kocúr Jaroslav",203,null,"Táborský Lukáš",92,null,"Kocúr Jaroslav",203,null,"Hyková Lucie",82,null,"Krupa Jozef",847,null,null,null,null,null,null,null,null,null,null,null,null,"Šafařík Luděk",193,null,"Táborský František",92,null,"Novotný Lukáš",194,null,"Kazda Jan",86,null,"Šafařík Luděk",833]
[null,"Lazur Vladimír",223,null,"Kutina Pavel",75,null,"Šafařík Luděk",905,null,"3. místo","Hostivař",3969,null,"3. místo","Šafařík Luděk",905,null,null,null,null,null,null,null,"Pecka Jiří",192,null,"Řehák František",89,null,"Krupa Jozef",200,null,"Kollár Pavel",89,null,"Pecka Jiří",814,null,null,null,null,null,null,null,null,null,null,null,null,"Kalfiřt Petr",195,null,"Táborský František",100,null,"Douša Adam",197,null,"Mottl Pavel",96,null,"Novotný Lukáš",833,null,null,null,null,null,null,null,null,null,null,null,null,"Jelínek Jan",190,null,"Novotná Jana",100,null,"Mottl Pavel",201,null,"Křikava Miroslav",98,null,"Lazur Ladislav",831,null,null,null,null,null,null,null,null,null,null,null,null,"Mottl Pavel",193,null,"Kollár Pavel",89,null,"Mottl Pavel",193,null,"Pospíšil Lukáš",87,null,"Kalfiřt Petr",807,null,null,null,null,null,null,null,null,null,null,null,null,"Šafařík Luděk",191,null,"Novotná Jana",97,null,"Troller Pavel",192,null,"Pavlíček Rudolf",97,null,"Šafařík Luděk",805,null,null,null,null,null,null,null,null,null,null,null,null,"Jelínek Jan",201,null,"Tichý Hugo",93,null,"Šafařík Luděk",202,null,"Pipek Pavel",88,null,"Pospíšil Václav",834,null,null,null,null,null,null,null,null,null,null,null,null,"Krupa Jozef",190,null,"Pelikán Stanislav",95,null,"Šafařík Luděk",193,null,"Hyková Lucie",87,null,"Jelínek Jan",816]
[null,"Šafařík Luděk",223,null,"Hájek Mojmír",75,null,"Pospíšil Václav",901,null,"ŘEPY    9.3.2013",null,null,null,null,null,"klikni",null,null,null,null,null,null,null,"Novotný Lukáš",189,null,"Pospíšil Lukáš",91,null,"Věchtík Antonín",193,null,"Řehák František",89,null,"Krupa Jozef",799,null,null,null,null,null,null,null,null,null,null,null,null,"Podhola Martin",194,null,"Troller Pavel",105,null,"Kocůr Jaroslav",196,null,"Lazurová Jiřina",96,null,"Pecka Jiří",831,null,null,null,null,null,null,null,null,null,null,null,null,"Hájek Mojmír",189,null,"Šafář Bohumil",100,null,"Šafařík Luděk",199,null,"Vychnerová Michala",98,null,"Podhola Martin",824,null,null,null,null,null,null,null,null,null,null,null,null,"Pospíšil Václav",192,null,"Novotná Petra",91,null,"Pospíšil Václav",192,null,"Kollár Pavel",89,null,"Kročil Tomáš",791,null,null,null,null,null,null,null,null,null,null,null,null,"Brejcha Jaroslav",187,null,"Tomášek Zdenek",98,null,"Kalfiřt Petr",192,null,"Neshyba Jaroslav",97,null,"Kročil Tomáš",802,null,null,null,null,null,null,null,null,null,null,null,null,"Alba Vladimír",195,null,"Pavlíček Rudolf",94,null,"Jelínek Jan",201,null,"Pipek Pavel",88,null,"Holkup Jan",823,null,null,null,null,null,null,null,null,null,null,null,null,"Carvan Pavel",185,null,"Skružná Pavla",95,null,"Krupa Jozef",190,null,"Růžička Václav",87,null,"Carvan Pavel",810]
[null,"Křápek Roman",223,null,"Růžička Václav",75,null,"Lazur Vladimír",901,null,"1. místo","Řepy",4006,null,"1. místo","Kocúr Jaroslav",960,null,null,null,null,null,null,null,"Kročil Tomáš",188,null,"Aunický František",97,null,"Pospíšil Václav",192,null,"Čermák Tomáš",89,null,"Ondřich František",796,null,null,null,null,null,null,null,null,null,null,null,null,"Krupa Josef",189,null,"Plecháček Miroslav",107,null,"Kalfiřt Petr",195,null,"Kalošová Dagmar",98,null,"Mašát Petr",826,null,null,null,null,null,null,null,null,null,null,null,null,"Sehnal Ivan",187,null,"Kučera Miroslav",100,null,"Ondřich František",197,null,"Křikava Miroslav",98,null,"Pospíšil Václav",814,null,null,null,null,null,null,null,null,null,null,null,null,"Krupa Jozef",190,null,"Štarková Tereza",92,null,"Carvan Pavel",191,null,"Novotná Petra",91,null,"Douša Adam",785,null,null,null,null,null,null,null,null,null,null,null,null,"Křemenák Petr",186,null,"Štěpán Radek",98,null,"Šafařík Luděk",191,null,"Novotná Jana",97,null,"Křemenák Petr",801,null,null,null,null,null,null,null,null,null,null,null,null,"Ondřich František",193,null,"Fay Vlastimil",94,null,"Lazur Vladimír",197,null,"Čermák Tomáš",89,null,"Alba Vladimír",814,null,null,null,null,null,null,null,null,null,null,null,null,"Pospíšil Václav",184,null,"Mottl Pavel",99,null,"Lazur Vladimír",185,null,"Táborský František",92,null,"Ondřich František",809]
[null,"Lazur Vladimír",223,null,"Aunický František",76,null,"Šafařík Luděk",897,null,"2. místo","Kačerov",3876,null,"2. místo","Šafařík Luděk",897,null,null,null,null,null,null,null,"Lazur Ladislav",187,null,"Šafář Vladimír",98,null,"Mašát Petr",192,null,"Pospíšil Lukáš",91,null,"Kročil Tomáš",786,null,null,null,null,null,null,null,null,null,null,null,null,"Sehnal Ivan",187,null,"Brejcha Jaroslav",107,null,"Pospíšil Václav",194,null,"Kalošová Dagmar",99,null,"Ondřich František",815,null,null,null,null,null,null,null,null,null,null,null,null,"Novotný Lukáš",185,null,"Sehnal Ivan",103,null,"Mottl Pavel",197,null,"Kollár Pavel",99,null,"Skružná Pavla",811,null,null,null,null,null,null,null,null,null,null,null,null,"Sehnal Ivan",186,null,"Pipek Pavel",94,null,"Krupa Jozef",190,null,"Hájek Mojmír",91,null,"Štěpán Radek",779,null,null,null,null,null,null,null,null,null,null,null,null,"Alba Vladimír",186,null,"Katolický Zdenek",99,null,"Kocúr Jaroslav",187,null,"Štěpán Radek",98,null,"Skružná Pavla",795,null,null,null,null,null,null,null,null,null,null,null,null,"Carvan Pavel",192,null,"Růžička Václav",100,null,"Alba Vladimír",195,null,"Kovář Jaroslav",90,null,"Novotný Lukáš",814,null,null,null,null,null,null,null,null,null,null,null,null,"Kročil Tomáš",183,null,"Kutina Pavel",99,null,"Carvan Pavel",185,null,"Táborský František",94,null,"Hübner Jiří",803]
[null,"German Milan",221,null,"Čermák Tomáš",78,null,"Podhola Martin",896,null,"3. místo","Klíčov",3794,null,"3. místo","Ondřich Fr.",895,null,null,null,null,null,null,null,"Kocúr Jaroslav",185,null,"Veselý Vlastimil",99,null,"Pecka Jiří",192,null,"Kutina Pavel",92,null,"Alba Vladimír",777,null,null,null,null,null,null,null,null,null,null,null,null,"Skružná Pavla",186,null,"Aunický František",107,null,"Podhola Martin",194,null,"Kalošová Dagmar",99,null,"Kročil Tomáš",806,null,null,null,null,null,null,null,null,null,null,null,null,"Podhola Martin",184,null,"Pospíšil Lukáš",103,null,"Stejskal Martin",196,null,"Kollár Pavel",99,null,"Novotný Lukáš",793,null,null,null,null,null,null,null,null,null,null,null,null,"Sladovník Miloslav",186,null,"Táborský František",97,null,"Pospíšil Václav",187,null,"Vychnerová Michaela",92,null,"Mottl Pavel",773,null,null,null,null,null,null,null,null,null,null,null,null,"Turek Stanislav",185,null,"Fay Vlastimil",99,null,"Holkup Jan",187,null,"Tomášek Zdenek",98,null,"Lazur Vladimír",794,null,null,null,null,null,null,null,null,null,null,null,null,"Novotný Lukáš",188,null,"Mysliveček Jaroslav",102,null,"Ondřich František",193,null,"Táborský Lukáš",92,null,"Froněk Martin",778,null,null,null,null,null,null,null,null,null,null,null,null,"Pecka Jiří",181,null,"Turek Stanislav",100,null,"Pospíšil Václav",184,null,"Skružná Pavla",95,null,"Holkup Jan",802]
[null,"Pospíšil Václav",218,null,"Pipek Pavel",78,null,"Mašát Petr",895,null,"HOSTIVAŘ     27.4.2013",null,null,null,null,null,"klikni",null,null,null,null,null,null,null,"Mysliveček  Jaroslav",176,null,"Brejcha Jaroslav",102,null,"Novotný Lukáš",189,null,"Aunický František",97,null,"Holkup Jan",755,null,null,null,null,null,null,null,null,null,null,null,null,"Šafář Ladislav",185,null,"Kolář Ladislav",109,null,"Podhola Martin",193,null,"Táborský František",100,null,"Kalfiřt Petr",796,null,null,null,null,null,null,null,null,null,null,null,null,"Kalfiřt Petr",183,null,"Hájek Mojmír",104,null,"Jelínek Jan",190,null,"Křikava Miroslav",99,null,"Alba Vladimír",770,null,null,null,null,null,null,null,null,null,null,null,null,"Štěpán Radek",184,null,"Řehák Jaroslav",98,null,"Sehnal Ivan",186,null,"Štarková Tereza",92,null,"Sehnal Ivan",761,null,null,null,null,null,null,null,null,null,null,null,null,"Podhola Martin",185,null,"Sladovník Miloslav",102,null,"Brejcha Jaroslav",187,null,"Katolický Zdenek",99,null,"Jelínek Jan",782,null,null,null,null,null,null,null,null,null,null,null,null,"Krupa Jozef",182,null,"Táborský František",102,null,"Carvan Pavel",192,null,"Tichý Hugo",93,null,"Jelínek Jan",775,null,null,null,null,null,null,null,null,null,null,null,null,"Troller Pavel",181,null,"Radová Petra",101,null,"Kročil Tomáš",183,null,"Pelikán Stanislav",95,null,"Kročil Tomáš",796]
[null,"Kročil Tomáš",218,null,"Kalošová Dagmar",79,null,"Ondřich František",895,null,"1. místo","Řepy",4045,null,"1. místo","Pospíšil Václav",901,null,null,null,null,null,null,null,"Sladovník Miloš",172,null,"Kalfiřt Petr",102,null,"Šafařík Luděk",188,null,"Táborský František",98,null,"Carvan Pavel",752,null,null,null,null,null,null,null,null,null,null,null,null,"Tomášek Zdeněk",184,null,"Šafář Ladislav",109,null,"Krupa Josef",189,null,"Řehák Jaroslav",103,null,"Holkup Jan",790,null,null,null,null,null,null,null,null,null,null,null,null,"Skružná Pavla",182,null,"Jelínek Jan",104,null,"Hájek Mojmír",189,null,"Šafář Bohumil",100,null,"Jelínek Jan",770,null,null,null,null,null,null,null,null,null,null,null,null,"Křikava Miroslav",182,null,"Berger Michal",99,null,"Sladovník Miloslav",186,null,"Štarková Tereza",93,null,"Mysliveček Jaroslav",754,null,null,null,null,null,null,null,null,null,null,null,null,"Štěpán Radek",183,null,"Křikavová Miroslava",103,null,"Křemenák Petr",186,null,"Novotná Jana",99,null,"Alba Vladimír",776,null,null,null,null,null,null,null,null,null,null,null,null,"Štěpán Radek",182,null,"Křápek Roman",105,null,"Kocúr Jaroslav",192,null,"Pavlíček Rudolf",94,null,"Bošek Jan",773,null,null,null,null,null,null,null,null,null,null,null,null,"Jelínek Jan",180,null,"Štěpán Radek",103,null,"Troller Pavel",181,null,"Hyková Lucie",97,null,"Růžička Ladislav",792]
[null,"Ondřich František",217,null,"Vychnerová Michaela",79,null,"Kalfiřt Petr",894,null,"2. místo","Vršovice",3847,null,"2. místo","Šafařík Luděk",883,null,null,null,null,null,null,null,"Alba Vladimír",171,null,"Plecháček Miroslav",103,null,"Pospíšil Václav",188,null,"Šafář Vladimír",98,null,"Kocúr Jaroslav",744,null,null,null,null,null,null,null,null,null,null,null,null,"Carvan Pavel",184,null,"Žalud Miroslav",110,null,"Sehnal Ivan",187,null,"Křikava Miroslav",103,null,"Mysliveček Jaroslav",768,null,null,null,null,null,null,null,null,null,null,null,null,"Pospíšil Václav",180,null,"Aunický František",105,null,"Kocúr Jaroslav",187,null,"Kučera Miroslav",100,null,"Kalfiřt Petr",768,null,null,null,null,null,null,null,null,null,null,null,null,"Kazda Jan",181,null,"Kovář Jaroslav",100,null,"Štěpán Radek",184,null,"Štarková Tereza",93,null,"Brejcha Jaroslav",753,null,null,null,null,null,null,null,null,null,null,null,null,"Kročil Tomáš",183,null,"Mysliveček Jaroslav",105,null,"Alba Vladimír",186,null,"Fay Vlastimil",99,null,"Pospíšil Václav",766,null,null,null,null,null,null,null,null,null,null,null,null,"Pospíšil Václav",181,null,"Mašát Petr",106,null,"Lazur Vladimír",191,null,"Fay Vlastimil",94,null,"Carvan Pavel",762,null,null,null,null,null,null,null,null,null,null,null,null,"Pipek Pavel",178,null,"Křápek Roman",104,null,"Froněk Martin",181,null,"Pelikán Stanislav",98,null,"Pecka Jiří",790]
[null,"Šafařík Luděk",213,null,"Dvořák Petr",79,null,"Froněk Martin",893,null,"3. místo","Kačerov",3808,null,"3. místo","Krupa Jozef",883,null,null,null,null,null,null,null,"Carvan Pavel",171,null,"Douša Adam",103,null,"Kročil Tomáš",188,null,"Veselý Vlastimil",99,null,"Růžička Ladislav",744,null,null,null,null,null,null,null,null,null,null,null,null,"Ondřich František",183,null,"Skružná Pavla",110,null,"Skružná Pavla",186,null,"Troller Pavel",105,null,"Douša Adam",766,null,null,null,null,null,null,null,null,null,null,null,null,"Tichý Hugo",180,null,"Fay Vlastimil",105,null,"Sehnal Ivan",187,null,"Novotná Jana",100,null,"Berger Michal",767,null,null,null,null,null,null,null,null,null,null,null,null,"Mysliveček Jaroslav",179,null,"Křikava Miroslav",100,null,"Křikava Miroslav",182,null,"Pipek Pavel",94,null,"Alba Vladimír",738,null,null,null,null,null,null,null,null,null,null,null,null,"Pospíšil Václav",183,null,"Šafář Ladislav",105,null,"Turek Stanislav",185,null,"Dvořák Petr",100,null,"Troller Pavel",757,null,null,null,null,null,null,null,null,null,null,null,null,"Brož Stanislav",181,null,"Kutina Pavel",107,null,"Alba Vladimír",188,null,"Pavlíček Rudolf",94,null,"Krupová Martina",755,null,null,null,null,null,null,null,null,null,null,null,null,"Táborský Lukáš",176,null,"Brož Stanislav",105,null,"Pecka Jiří",181,null,"Mottl Pavel",99,null,"Věchtík Antoním",766]
[null,"Berger Michal",212,null,"Katolický Zdeněk",80,null,"Krupa Josef",891,null,"KAČEROV     12.10.2013",null,null,null,null,null,"klikni",null,null,null,null,null,null,null,"Křemenák Petr",171,null,"Skružná Pavla",103,null,"Tomášek Zdeněk",188,null,"Pospíšil Lukáš",100,null,"Hübner Jiří",737,null,null,null,null,null,null,null,null,null,null,null,null,"Holkup Jan",182,null,"Křápek Roman",111,null,"Šafář Ladislav",185,null,"Plecháček Miroslav",107,null,"Šafář Bohumil",751,null,null,null,null,null,null,null,null,null,null,null,null,"Pecka Jiří",179,null,"Čermák Tomáš",106,null,"Mašát Petr",186,null,"Kutina Pavel",101,null,"Krupa Jozef",760,null,null,null,null,null,null,null,null,null,null,null,null,"Hübner Jiří",179,null,"Šafář Ladislav",102,null,"Kazda Jan",181,null,"Svítil Pavel",96,null,"Krupová Martina",725,null,null,null,null,null,null,null,null,null,null,null,null,"Pospíšil Lukáš",182,null,"Křikava Miroslav",106,null,"Podhola Martin",185,null,"Fay Vlastimil",102,null,"Pecka Jiří",751,null,null,null,null,null,null,null,null,null,null,null,null,"Hübner Jiří",178,null,"Turek Stanislav",108,null,"Novotný Lukáš",188,null,"Růžička Václav",100,null,"Berger Michal",730,null,null,null,null,null,null,null,null,null,null,null,null,"Mysliveček Jaroslav",173,null,"Pavlíček Rudolf",106,null,"Krupa Jozef",180,null,"Kutina Pavel",99,null,"Kalfiřt Petr",761]
[null,"Šafařík Luděk",212,null,"Řehák Jaroslav",81,null,"Kocúr Jaroslav",889,null,"1. místo","Vršovice",4180,null,"1. místo","Krupa Jozef",959,null,null,null,null,null,null,null,"Hübner Jiří",170,null,"Krupka Jakub",103,null,"Lazur Ladislav",187,null,"Kalošová Dagmar",100,null,"Jelínek Jan",727,null,null,null,null,null,null,null,null,null,null,null,null,"Novotný Lukáš",180,null,"Fay Vlastimil",111,null,"Kocůr Jaroslav",185,null,"Brejcha Jaroslav",107,null,"Skružná Pavla",738,null,null,null,null,null,null,null,null,null,null,null,null,"Tomášek Zdeněk",179,null,"Brož Stanislav",107,null,"Novotný Lukáš",185,null,"Řehák Jaroslav",103,null,"Kročil Tomáš",742,null,null,null,null,null,null,null,null,null,null,null,null,"Kučera Miroslav",178,null,"Fay Vlastimil",103,null,"Kalfiřt Petr",181,null,"Táborský František",97,null,"Hübner Jiří",725,null,null,null,null,null,null,null,null,null,null,null,null,"Skružná Pavla",181,null,"Kovář Jaroslav",107,null,"Kročil Tomáš",183,null,"Sladovník Miloslav",102,null,"Tomášek Zdenek",725,null,null,null,null,null,null,null,null,null,null,null,null,"Aunický František",177,null,"Sehnal Ivan",110,null,"Ondřich František",187,null,"Aunický František",101,null,"Kročil Tomáš",728,null,null,null,null,null,null,null,null,null,null,null,null,"Holkup Jan",173,null,"Křikava Miroslav",107,null,"Jelínek Jan",180,null,"Turek Stanislav",100,null,"Podhola Martin",757]
[null,"Lazur Vladimír",212,null,"Šafrová Martina",81,null,"Novotný Lukáš",888,null,"2. místo","Klíčov",3798,null,"2. místo","Holkup Jan",912,null,null,null,null,null,null,null,"Pospíšil Lukáš",170,null,"Křápek Roman",107,null,"Kocúr Jaroslav",185,null,"Táborský František",101,null,"Sladovník Miloš",720,null,null,null,null,null,null,null,null,null,null,null,null,"Mašát Petr",178,null,"Sladovník Miloslav",112,null,"Tomášek Zdeněk",184,null,"Aunický František",107,null,"Tomášek Zdeněk",728,null,null,null,null,null,null,null,null,null,null,null,null,"Lazur Ladislav",178,null,"Mysliveček  Jaroslav",107,null,"Podhola Martin",184,null,"Pospíšil Lukáš",103,null,"Brož Stanislav",742,null,null,null,null,null,null,null,null,null,null,null,null,"Krupová Martina",173,null,"Mysliveček Jaroslav",105,null,"Sehnal Ivan",181,null,"Pipek Pavel",97,null,"Kučera Miroslav",724,null,null,null,null,null,null,null,null,null,null,null,null,"Růžička Ladislav",178,null,"Alba Vladimír",107,null,"Štěpán Radek",183,null,"Křikavová Miroslava",103,null,"Bošek Jan",723,null,null,null,null,null,null,null,null,null,null,null,null,"Troller Pavel",177,null,"Křikava Miroslav",111,null,"Šafařík Luděk",186,null,"Mysliveček Jaroslav",102,null,"Brož Stanislav",723,null,null,null,null,null,null,null,null,null,null,null,null,"Radová Petra",172,null,"Táborský Lukáš",108,null,"Krupa Jozef",179,null,"Kutina Pavel",100,null,"Sladovník Miloslav",755]
[null,"Pecka Jiří",212,null,"Svítil Pavel",82,null,"Šafařík Luděk",883,null,"3. místo","Hostivař",3713,null,"3. místo","Ondřich Fr.",858,null,null,null,null,null,null,null,"Douša Adam",169,null,"Novotná Petra",107,null,"Mašát Petr",184,null,"Kollár Pavel",101,null,"Radová Petra",718,null,null,null,null,null,null,null,null,null,null,null,null,"Sladovník Miloslav",177,null,"Novotná Petra",114,null,"Carvan Pavel",184,null,"Bergerová Marcela",107,null,"Jelínek Jan",719,null,null,null,null,null,null,null,null,null,null,null,null,"Bošek Jan",177,null,"Kazda Jan",111,null,"Kalfiřt Petr",183,null,"Sehnal Ivan",103,null,"Tomášek Zdeněk",733,null,null,null,null,null,null,null,null,null,null,null,null,"Růžička Václav",173,null,"Hübner Jiří",105,null,"Krupa Jozef",180,null,"Bergerová Marcela",98,null,"Tomášek Zdeněk",723,null,null,null,null,null,null,null,null,null,null,null,null,"Pecka Jiří",178,null,"Aunický František",108,null,"Pospíšil Václav",183,null,"Šafář Ladislav",105,null,"Sehnal Ivan",722,null,null,null,null,null,null,null,null,null,null,null,null,"Turek Stanislav",170,null,"Hübner Jiří",111,null,"Šafařík Luděk",186,null,"Táborský František",102,null,"Štěpán Radek",716,null,null,null,null,null,null,null,null,null,null,null,null,"Berger Michal",172,null,"Pospíšil Lukáš",109,null,"Šafařík Luděk",179,null,"Radová Petra",101,null,"Troller Pavel",742]
[null,"Kocúr Jaroslav",211,null,"Bergerová Marcela",82,null,"Krupa Jozef",883,null,"VRŠOVICE     9.11.2013",null,null,null,null,null,"klikni",null,null,null,null,null,null,null,"Holkup Jan",168,null,"Křemenák Petr",109,null,"Mašát Petr",184,null,"Brejcha Jaroslav",102,null,"Křemenák Petr",707,null,null,null,null,null,null,null,null,null,null,null,null,"Troller Pavel",175,null,"Tichý Hugo",114,null,"Krupa Josef",183,null,"Táborský František",109,null,"Bošek Jan",710,null,null,null,null,null,null,null,null,null,null,null,null,"Krupa Jozef",174,null,"Stejskal Martin",112,null,"Skružná Pavla",182,null,"Jelínek Jan",104,null,"Sladovník Miloš",727,null,null,null,null,null,null,null,null,null,null,null,null,"Douša Adam",170,null,"Jelínek Jan",106,null,"German Milan",180,null,"Řehák Jaroslav",98,null,"Aunický František",705,null,null,null,null,null,null,null,null,null,null,null,null,"Mysliveček Jaroslav",176,null,"Carvan Pavel",110,null,"Krupa Jozef",183,null,"Novotná Jana",105,null,"Turek Stanislav",721,null,null,null,null,null,null,null,null,null,null,null,null,"Kollár Pavel",170,null,"Kolár Vladimír",112,null,"Kalfiřt Petr",184,null,"Tichý Hugo",103,null,"Troller Pavel",701,null,null,null,null,null,null,null,null,null,null,null,null,"Kazda Jan",171,null,"Kollár Pavel",113,null,"Lazur Vladimír",179,null,"Lazurová Jiřina",102,null,"Berger Michal",729]
[null,"Kalfiřt Petr",211,null,"Hyková Lucie",82,null,"Pospíšil Václav",881,null,"1. místo","Řepy",4043,null,"1. místo","Šafařík Luděk",962,null,null,null,null,null,null,null,"Růžička Ladislav",166,null,"Mysliveček  Jaroslav",112,null,"Novotný Lukáš",178,null,"Kalfiřt Petr",102,null,"Tichý Hugo",705,null,null,null,null,null,null,null,null,null,null,null,null,"Brož Stanislav",172,null,"Kročil Tomáš",115,null,"Kocůr Jaroslav",183,null,"Kolář Ladislav",109,null,"Šafář Ladislav",708,null,null,null,null,null,null,null,null,null,null,null,null,"Lazurová Jiřina",171,null,"Kovář Jaroslav",113,null,"Podhola Martin",180,null,"Hájek Mojmír",104,null,"Kovář Jaroslav",726,null,null,null,null,null,null,null,null,null,null,null,null,"Jelínek Jan",168,null,"Kučera Miroslav",106,null,"Šafařík Luděk",179,null,"Berger Michal",99,null,"Berger Michal",703,null,null,null,null,null,null,null,null,null,null,null,null,"Jelínek Jan",175,null,"Mottl Pavel",110,null,"Pospíšil Lukáš",182,null,"Fay Vlastimil",105,null,"Brejcha Jaroslav",718,null,null,null,null,null,null,null,null,null,null,null,null,"Pavlíček Rudolf",170,null,"Šafář Ladislav",115,null,"Krupa Jozef",182,null,"Růžička Václav",103,null,"Kollár Pavel",695,null,null,null,null,null,null,null,null,null,null,null,null,"Alba Vladimír",170,null,"Douša Adam",115,null,"Novotný Lukáš",178,null,"Aunický František",102,null,"Alba Vladimír",722]
[null,"Táborský Lukáš",210,null,"Fay Vlastimil",83,null,"Pospíšil Václav",876,null,"2. místo","Klíčov",3979,null,"2. místo","Lazur Vladimír",901,null,null,null,null,null,null,null,"Kalfiřt Petr",166,null,"Hübner Jiří",113,null,"Mysliveček  Jaroslav",176,null,"Plecháček Miroslav",103,null,"Mysliveček  Jaroslav",702,null,null,null,null,null,null,null,null,null,null,null,null,"Mysliveček Jaroslav",172,null,"Kutina Pavel",116,null,"Ondřich František",183,null,"Šafář Ladislav",109,null,"Alba Vladimír",701,null,null,null,null,null,null,null,null,null,null,null,null,"Carvan Pavel",170,null,"Alba Vladimír",116,null,"Tichý Hugo",180,null,"Vychnerová Michala",104,null,"Froněk Martin",720,null,null,null,null,null,null,null,null,null,null,null,null,"Brejcha Jaroslav",168,null,"Aunický František",110,null,"Hübner Jiří",179,null,"Táborský František",99,null,"Kazda Jan",700,null,null,null,null,null,null,null,null,null,null,null,null,"Carvan Pavel",172,null,"Douša Adam",112,null,"Skružná Pavla",181,null,"Mysliveček Jaroslav",105,null,"Radová Petra",717,null,null,null,null,null,null,null,null,null,null,null,null,"Bošek Jan",169,null,"Štěpán Radek",119,null,"Štěpán Radek",182,null,"Křápek Roman",105,null,"Táborský Lukáš",695,null,null,null,null,null,null,null,null,null,null,null,null,"Růžička Ladislav",170,null,"Mysliveček Jaroslav",115,null,"Kročil Tomáš",178,null,"Turek Stanislav",103,null,"Mysliveček Jaroslav",717]
[null,"Kocůr Jaroslav",210,null,"Aunický František",83,null,"Ondřich František",863,null,"3. místo","Hostivař",3935,null,"3. místo","Kalfiřt Petr",894,null,null,null,null,null,null,null,"Jelínek Jan",165,null,"Troller Pavel",114,null,"Lazur Ladislav",176,null,"Douša Adam",103,null,"Troller Pavel",691,null,null,null,null,null,null,null,null,null,null,null,null,"Bošek Jan",170,null,"Krupová Martina",120,null,"Holkup Jan",182,null,"Bergerová Marcela",109,null,"Sladovník Miloslav",693,null,null,null,null,null,null,null,null,null,null,null,null,"Berger Michal",170,null,"Lazurová Jiřina",116,null,"Pospíšil Václav",180,null,"Aunický František",105,null,"Tichý Hugo",711,null,null,null,null,null,null,null,null,null,null,null,null,"Tomášek Zdeněk",166,null,"Tichý Hugo",110,null,"Mysliveček Jaroslav",179,null,"Křikava Miroslav",100,null,"Radová Petra",688,null,null,null,null,null,null,null,null,null,null,null,null,"Hübner Jiří",171,null,"Sehnal Ivan",113,null,"Lazur Vladimír",181,null,"Šafrová Martina",106,null,"Růžička Ladislav",717,null,null,null,null,null,null,null,null,null,null,null,null,"Krupová Martina",167,null,"Mottl Pavel",120,null,"Brož Stanislav",181,null,"Mašát Petr",106,null,"Kazda Jan",694,null,null,null,null,null,null,null,null,null,null,null,null,"Aunický František",170,null,"Křemenák Petr",116,null,"Pipek Pavel",178,null,"Štěpán Radek",103,null,"Táborský Lukáš",697]
[null,"Tomášek Zdeněk",208,null,"Křikava Miroslav",84,null,"Lazur Vladimír",863,null,"POHÁR GENERÁLNÍHO ŘEDITELE",null,null,null,null,null,"klikni",null,null,null,null,null,null,null,"Plecháček Miroslav",160,null,"Táborský Lukáš",115,null,"Novotný Lukáš",175,null,"Skružná Pavla",103,null,"Kalfiřt Petr",680,null,null,null,null,null,null,null,null,null,null,null,null,"Pospíšil Lukáš",161,null,"Alba Vladimír",121,null,"Šafařík Luděk",181,null,"Skružná Pavla",110,null,"Brož Stanislav",693,null,null,null,null,null,null,null,null,null,null,null,null,"Kazda Jan",170,null,"Brejcha Jaroslav",117,null,"Šafařík Luděk",179,null,"Fay Vlastimil",105,null,"Carvan Pavel",705,null,null,null,null,null,null,null,null,null,null,null,null,"Brož Stanislav",165,null,"Sehnal Ivan",111,null,"Pospíšil Václav",179,null,"Kovář Jaroslav",100,null,"Kutina Pavel",682,null,null,null,null,null,null,null,null,null,null,null,null,"Tomášek Zdenek",171,null,"Řehák Jaroslav",116,null,"Lazur Vladimír",179,null,"Křikava Miroslav",106,null,"Lazurová Jiřina",704,null,null,null,null,null,null,null,null,null,null,null,null,"Berger Michal",164,null,"Brož Stanislav",120,null,"Pospíšil Václav",181,null,"Kutina Pavel",107,null,"Brejcha Jaroslav",691,null,null,null,null,null,null,null,null,null,null,null,null,"Turek Stanislav",168,null,"Alba Vladimír",116,null,"Hübner Jiří",177,null,"Pipek Pavel",104,null,"Křemenák Petr",687]
[null,"Hübner Jiří",208,null,"Vychnerová Michala",84,null,null,null,null,"1. místo","Řepy",4105,null,"1. místo","Froněk Martin",893,null,null,null,null,null,null,null,"Tichý Hugo",157,null,"Sehnal Ivan",116,null,null,null,null,"Krupka Jakub",103,null,null,null,null,null,null,null,null,null,null,null,null,null,null,null,"Šafář Bohumil",159,null,"Radová Petra",121,null,null,null,null,"Aunický František",110,null,null,null,null,null,null,null,null,null,null,null,null,null,null,null,"Kročil Tomáš",169,null,"Radová Petra",117,null,"Pecka Jiří",179,null,null,null,null,null,null,null,null,null,null,null,null,null,null,null,null,null,null,"Aunický František",161,null,"Brož Stanislav",111,null,null,null,null,"Štarková Tereza",100,null,null,null,null,null,null,null,null,null,null,null,null,null,null,null,"Lazur Vladimír",171,null,"Hübner Jiří",117,null,null,null,null,null,null,null,null,null,null,null,null,null,null,null,null,null,null,null,null,null,"Kročil Tomáš",163,null,"Troller Pavel",120,null,null,null,null,null,null,null,null,null,null,null,null,null,null,null,null,null,null,null,null,null,"Podhola Martin",168,null,"Mašát Petr",116,null,"Froněk Martin",177]
[null,"Pecka Jiří",205,null,null,null,null,null,null,null,"2. místo","Hostivař",3972,null,"2. místo","Novotný Lukáš",888,null,null,null,null,null,null,null,"Kazda Jan",157,null,"Kazda Jan",116,null,null,null,null,null,null,null,null,null,null,null,null,null,null,null,null,null,null,null,null,null,"Brejcha Jaroslav",158,null,"Brož Stanislav",121,null,null,null,null,"Žalud Miroslav",110,null,null,null,null,null,null,null,null,null,null,null,null,null,null,null,"Kovář Jaroslav",169,null,"Tomášek Zdeněk",117,null,"Šafařík Luděk",179,null,null,null,null,null,null,null,null,null,null,null,null,null,null,null,null,null,null,"Alba Vladimír",161,null,"Kutina Pavel",112,null,null,null,null,null,null,null,null,null,null,null,null,null,null,null,null,null,null,null,null,null,"Sehnal Ivan",167,null,"Turek Stanislav",118,null,null,null,null,null,null,null,null,null,null,null,null,null,null,null,null,null,null,null,null,null,"Mysliveček Jaroslav",162,null,"Radová Petra",121,null,null,null,null,null,null,null,null,null,null,null,null,null,null,null,null,null,null,null,null,null,"Křemenák Petr",165,null,"Sehnal Ivan ing.",120]
[null,"Mašát Petr",205,null,null,null,null,null,null,null,"3. místo","Klíčov",3868,null,"3. místo","Lazur Vladimír",863,null,null,null,null,null,null,null,"Táborský Lukáš",157,null,"Mottl Pavel",117,null,null,null,null,null,null,null,null,null,null,null,null,null,null,null,null,null,null,null,null,null,"Jelínek Jan",158,null,"Pospíšil Lukáš",121,null,null,null,null,"Plecháček Miroslav",110,null,null,null,null,null,null,null,null,null,null,null,null,null,null,null,"Křemenák Petr",168,null,"Tichý Hugo",118,null,"Tomášek Zdeněk",179,null,null,null,null,null,null,null,null,null,null,null,null,null,null,null,null,null,null,"Pipek Pavel",160,null,"Křemenák Petr",113,null,null,null,null,null,null,null,null,null,null,null,null,null,null,null,null,null,null,null,null,null,"Lazurová Jiřina",166,null,"Lazurová Jiřina",119,null,null,null,null,null,null,null,null,null,null,null,null,null,null,null,null,null,null,null,null,null,"Froněk Martin",161,null,"Kazda Jan",121,null,null,null,null,null,null,null,null,null,null,null,null,null,null,null,null,null,null,null,null,null,"Kalfiřt Petr",164,null,"Šafář Ladislav",121]
[null,"Šafařík Luděk",205,null,null,null,null,null,null,null,null,null,null,null,null,null,null,null,null,null,null,null,null,null,"Troller Pavel",156,null,"Kovář Jaroslav",119,null,null,null,null,null,null,null,null,null,null,null,null,null,null,null,null,null,null,null,null,null,"Alba Vladimír",154,null,"Kazda Jan",123,null,null,null,null,null,null,null,null,null,null,null,null,null,null,null,null,null,null,null,null,null,"Brož Stanislav",168,null,"Bošek Jan",118,null,null,null,null,null,null,null,null,null,null,null,null,null,null,null,null,null,null,null,null,null,"Kutina Pavel",155,null,"Čermák Tomáš",114,null,null,null,null,null,null,null,null,null,null,null,null,null,null,null,null,null,null,null,null,null,"Kovář Jaroslav",164,null,"Lazur Vladimír",121,null,null,null,null,null,null,null,null,null,null,null,null,null,null,null,null,null,null,null,null,null,"Kazda Jan",159,null,"Kollár Pavel",122,null,null,null,null,null,null,null,null,null,null,null,null,null,null,null,null,null,null,null,null,null,"Věchtík Antoním",164,null,"Hübner Jiří",123]
[null,"Ondřich František",205,null,null,null,null,null,null,null,null,null,null,null,null,null,null,null,null,null,null,null,null,null,"Radová Petra",155,null,"Krupa Jozef",119,null,null,null,null,null,null,null,null,null,null,null,null,null,null,null,null,null,null,null,null,null,"Krupová Martina",153,null,"Bošek Jan",123,null,null,null,null,null,null,null,null,null,null,null,null,null,null,null,null,null,null,null,null,null,"Radová Petra",167,null,"Mottl Pavel",119,null,null,null,null,null,null,null,null,null,null,null,null,null,null,null,null,null,null,null,null,null,"Vychnerová Michaela",153,null,"Bošek Jan",117,null,null,null,null,null,null,null,null,null,null,null,null,null,null,null,null,null,null,null,null,null,"Kolár Pavel",163,null,"Růžička Ladislav",122,null,null,null,null,null,null,null,null,null,null,null,null,null,null,null,null,null,null,null,null,null,"Brejcha Jaroslav",155,null,"Růžička Ladislav",123,null,null,null,null,null,null,null,null,null,null,null,null,null,null,null,null,null,null,null,null,null,"Pelikán Stanislav",163,null,"Podhola Martin",124]
[null,"Krupa Jozef",205,null,null,null,null,null,null,null,null,null,null,null,null,null,null,null,null,null,null,null,null,null,"Křápek Roman",155,null,"Brož Stanislav",122,null,null,null,null,null,null,null,null,null,null,null,null,null,null,null,null,null,null,null,null,null,"Radová Petra",152,null,"Lokvenc Jiří",126,null,null,null,null,null,null,null,null,null,null,null,null,null,null,null,null,null,null,null,null,null,"Šafář Bohumil",164,null,"Douša Adam",119,null,null,null,null,null,null,null,null,null,null,null,null,null,null,null,null,null,null,null,null,null,"Radová Petra",152,null,"Kazda Jan",118,null,null,null,null,null,null,null,null,null,null,null,null,null,null,null,null,null,null,null,null,null,"Radová Petra",161,null,"Křápek Roman",123,null,null,null,null,null,null,null,null,null,null,null,null,null,null,null,null,null,null,null,null,null,"Radová Petra",155,null,"Lokvenc Jiří",123,null,null,null,null,null,null,null,null,null,null,null,null,null,null,null,null,null,null,null,null,null,"Sladovník Miloslav",162,null,"Kročil Tomáš",125]
[null,null,null,null,null,null,null,null,null,null,null,null,null,null,null,null,null,null,null,null,null,null,null,null,"Brejcha Jaroslav",153,null,"Věchtík Antonín",123,null,null,null,null,null,null,null,null,null,null,null,null,null,null,null,null,null,null,null,null,null,"Lokvenc Jiří",150,null,"Douša Adam",128,null,null,null,null,null,null,null,null,null,null,null,null,null,null,null,null,null,null,null,null,null,"Froněk Martin",162,null,"Novotná Petra",123,null,null,null,null,null,null,null,null,null,null,null,null,null,null,null,null,null,null,null,null,null,"Hájek Mojmír",151,null,"Číhal František",118,null,null,null,null,null,null,null,null,null,null,null,null,null,null,null,null,null,null,null,null,null,"Sladovník Miloslav",161,null,"Pospíšil Lukáš",123,null,null,null,null,null,null,null,null,null,null,null,null,null,null,null,null,null,null,null,null,null,"Kutina Pavel",151,null,"Alba Vladimír",127,null,null,null,null,null,null,null,null,null,null,null,null,null,null,null,null,null,null,null,null,null,"Křikava Miroslav",161,null,"Troller Pavel",128]
[null,null,null,null,null,null,null,null,null,null,null,null,null,null,null,null,null,null,null,null,null,null,null,null,"Kovář Jaroslav",152,null,"Kročil Tomáš",124,null,null,null,null,null,null,null,null,null,null,null,null,null,null,null,null,null,null,null,null,null,"Tichý Hugo",149,null,"Jelínek Jan",128,null,null,null,null,null,null,null,null,null,null,null,null,null,null,null,null,null,null,null,null,null,"Sladovník Miloš",159,null,"Křemenák Petr",124,null,null,null,null,null,null,null,null,null,null,null,null,null,null,null,null,null,null,null,null,null,"Číhal František",151,null,"Ondřich František",118,null,null,null,null,null,null,null,null,null,null,null,null,null,null,null,null,null,null,null,null,null,"Douša Adam",160,null,"Kutina Pavel",124,null,null,null,null,null,null,null,null,null,null,null,null,null,null,null,null,null,null,null,null,null,"Mašát Petr",149,null,"Carvan Pavel",127,null,null,null,null,null,null,null,null,null,null,null,null,null,null,null,null,null,null,null,null,null,"Mottl Pavel",160,null,"Brejcha Jaroslav",128]
[null,null,null,null,null,null,null,null,null,null,null,null,null,null,null,null,null,null,null,null,null,null,null,null,"Šafář Vladimír",146,null,"Alba Vladimír",125,null,null,null,null,null,null,null,null,null,null,null,null,null,null,null,null,null,null,null,null,null,"Křikava Miroslav",145,null,"Berger Michal",129,null,null,null,null,null,null,null,null,null,null,null,null,null,null,null,null,null,null,null,null,null,"Brejcha Jaroslav",158,null,"Sladovník Miloš",126,null,null,null,null,null,null,null,null,null,null,null,null,null,null,null,null,null,null,null,null,null,"Ondřich František",147,null,"Brejcha Jaroslav",123,null,null,null,null,null,null,null,null,null,null,null,null,null,null,null,null,null,null,null,null,null,"Řehák Jaroslav",158,null,"Brejcha Jaroslav",126,null,null,null,null,null,null,null,null,null,null,null,null,null,null,null,null,null,null,null,null,null,"Katolický Zdeněk",149,null,"Brejcha Jaroslav",127,null,null,null,null,null,null,null,null,null,null,null,null,null,null,null,null,null,null,null,null,null,"Křápek Roman",160,null,"Lazur Vladimír",128]
[null,null,null,null,null,null,null,null,null,null,null,null,null,null,null,null,null,null,null,null,null,null,null,null,"Brož Stanislav",144,null,"Jelínek Jan",126,null,null,null,null,null,null,null,null,null,null,null,null,null,null,null,null,null,null,null,null,null,"Křápek Roman",145,null,"Kalfiřt Petr",131,null,null,null,null,null,null,null,null,null,null,null,null,null,null,null,null,null,null,null,null,null,"Kutina Pavel",154,null,"Carvan Pavel",127,null,null,null,null,null,null,null,null,null,null,null,null,null,null,null,null,null,null,null,null,null,"Bošek Jan",146,null,"Krupová Martina",124,null,null,null,null,null,null,null,null,null,null,null,null,null,null,null,null,null,null,null,null,null,"Bošek Jan",154,null,"Bošek Jan",127,null,null,null,null,null,null,null,null,null,null,null,null,null,null,null,null,null,null,null,null,null,"Křikava Miroslav",148,null,"Kročil Tomáš",132,null,null,null,null,null,null,null,null,null,null,null,null,null,null,null,null,null,null,null,null,null,"Skružná Pavla",158,null,"Berger Michal",132]
[null,null,null,null,null,null,null,null,null,null,null,null,null,null,null,null,null,null,null,null,null,null,null,null,"Mottl Pavel",143,null,"Ondřich František",127,null,null,null,null,null,null,null,null,null,null,null,null,null,null,null,null,null,null,null,null,null,"Berger Michal",144,null,"Tomášek Zdeněk",132,null,null,null,null,null,null,null,null,null,null,null,null,null,null,null,null,null,null,null,null,null,"Douša Adam",153,null,"Kalfiřt Petr",130,null,null,null,null,null,null,null,null,null,null,null,null,null,null,null,null,null,null,null,null,null,"Křemenák Petr",144,null,"Mottl Pavel",124,null,null,null,null,null,null,null,null,null,null,null,null,null,null,null,null,null,null,null,null,null,"Novotná Jana",150,null,"Křemenák Petr",127,null,null,null,null,null,null,null,null,null,null,null,null,null,null,null,null,null,null,null,null,null,"Táborský František",147,null,"Berger Michal",132,null,null,null,null,null,null,null,null,null,null,null,null,null,null,null,null,null,null,null,null,null,"Mašát Petr",156,null,"Kalfiřt Petr",134]
[null,null,null,null,null,null,null,null,null,null,null,null,null,null,null,null,null,null,null,null,null,null,null,null,"Kollár Pavel",141,null,"Tomášek Zdeněk",128,null,null,null,null,null,null,null,null,null,null,null,null,null,null,null,null,null,null,null,null,null,"Novotná Petra",141,null,"Šafář Bohumil",135,null,null,null,null,null,null,null,null,null,null,null,null,null,null,null,null,null,null,null,null,null,"Mysliveček  Jaroslav",150,null,"Berger Michal",131,null,null,null,null,null,null,null,null,null,null,null,null,null,null,null,null,null,null,null,null,null,"Tichý Hugo",144,null,"Douša Adam",124,null,null,null,null,null,null,null,null,null,null,null,null,null,null,null,null,null,null,null,null,null,"Šafář Ladislav",149,null,"Radová Petra",128,null,null,null,null,null,null,null,null,null,null,null,null,null,null,null,null,null,null,null,null,null,"Mottl Pavel",146,null,"Jelínek Jan",134,null,null,null,null,null,null,null,null,null,null,null,null,null,null,null,null,null,null,null,null,null,"Sehnal Ivan ing.",154,null,"Pecka Jiří",135]
[null,null,null,null,null,null,null,null,null,null,null,null,null,null,null,null,null,null,null,null,null,null,null,null,"Skružná Pavla",141,null,"Růžička Ladislav",128,null,null,null,null,null,null,null,null,null,null,null,null,null,null,null,null,null,null,null,null,null,"Kutina Pavel",141,null,"Ondřich František",138,null,null,null,null,null,null,null,null,null,null,null,null,null,null,null,null,null,null,null,null,null,"Kučera Miroslav",148,null,"Froněk Martin",135,null,null,null,null,null,null,null,null,null,null,null,null,null,null,null,null,null,null,null,null,null,"Čermák Tomáš",143,null,"Radová Petra",125,null,null,null,null,null,null,null,null,null,null,null,null,null,null,null,null,null,null,null,null,null,"Křikavová Miroslava",149,null,"Troller Pavel",128,null,null,null,null,null,null,null,null,null,null,null,null,null,null,null,null,null,null,null,null,null,"Křápek Roman",145,null,"Krupová Martina",134,null,null,null,null,null,null,null,null,null,null,null,null,null,null,null,null,null,null,null,null,null,"Štěpán Radek",150,null,"Ondřich František",138]
[null,null,null,null,null,null,null,null,null,null,null,null,null,null,null,null,null,null,null,null,null,null,null,null,"Novotná Petra",140,null,"Holkup Jan",128,null,null,null,null,null,null,null,null,null,null,null,null,null,null,null,null,null,null,null,null,null,"Aunický František",141,null,"Mysliveček Jaroslav",139,null,null,null,null,null,null,null,null,null,null,null,null,null,null,null,null,null,null,null,null,null,"Novotná Jana",147,null,"Šafařík Luděk",135,null,null,null,null,null,null,null,null,null,null,null,null,null,null,null,null,null,null,null,null,null,"Šafář Ladislav",140,null,"Kalfiřt Petr",131,null,null,null,null,null,null,null,null,null,null,null,null,null,null,null,null,null,null,null,null,null,"Aunický František",146,null,"Pecka Jiří",128,null,null,null,null,null,null,null,null,null,null,null,null,null,null,null,null,null,null,null,null,null,"Růžička Václav",144,null,"Holkup Jan",135,null,null,null,null,null,null,null,null,null,null,null,null,null,null,null,null,null,null,null,null,null,"Brož Stanislav",150,null,"Růžička Ladislav",141]
[null,null,null,null,null,null,null,null,null,null,null,null,null,null,null,null,null,null,null,null,null,null,null,null,"Táborský František",140,null,"Kocúr Jaroslav",133,null,null,null,null,null,null,null,null,null,null,null,null,null,null,null,null,null,null,null,null,null,"Kolář Ladislav",139,null,"Holkup Jan",139,null,null,null,null,null,null,null,null,null,null,null,null,null,null,null,null,null,null,null,null,null,"Novotná Petra",147,null,"Podhola Martin",135,null,null,null,null,null,null,null,null,null,null,null,null,null,null,null,null,null,null,null,null,null,"Pospíšil Lukáš",135,null,"Alba Vladimír",131,null,null,null,null,null,null,null,null,null,null,null,null,null,null,null,null,null,null,null,null,null,"Kutina Pavel",143,null,"Pospíšil Václav",128,null,null,null,null,null,null,null,null,null,null,null,null,null,null,null,null,null,null,null,null,null,"Růžička Ladislav",142,null,"Novotný Lukáš",138,null,null,null,null,null,null,null,null,null,null,null,null,null,null,null,null,null,null,null,null,null,"Kutina Pavel",148,null,"Sladovník Miloslav",143]
[null,null,null,null,null,null,null,null,null,null,null,null,null,null,null,null,null,null,null,null,null,null,null,null,"Krupka Jakub",139,null,"Tichý Hugo",133,null,null,null,null,null,null,null,null,null,null,null,null,null,null,null,null,null,null,null,null,null,"Žalud Miroslav",139,null,"Pecka Jiří",144,null,null,null,null,null,null,null,null,null,null,null,null,null,null,null,null,null,null,null,null,null,"Řehák Jaroslav",135,null,"Krupa Jozef",136,null,null,null,null,null,null,null,null,null,null,null,null,null,null,null,null,null,null,null,null,null,"Kollár Pavel",131,null,"Tomášek Zdeněk",131,null,null,null,null,null,null,null,null,null,null,null,null,null,null,null,null,null,null,null,null,null,"Mottl Pavel",141,null,"Skružná Pavla",142,null,null,null,null,null,null,null,null,null,null,null,null,null,null,null,null,null,null,null,null,null,"Kolár Vladimír",140,null,"Bošek Jan",141,null,null,null,null,null,null,null,null,null,null,null,null,null,null,null,null,null,null,null,null,null,"Kollár Pavel",144,null,"Krupa Jozef",144]
[null,null,null,null,null,null,null,null,null,null,null,null,null,null,null,null,null,null,null,null,null,null,null,null,"Fay Vlastimil",138,null,"Carvan Pavel",133,null,null,null,null,null,null,null,null,null,null,null,null,null,null,null,null,null,null,null,null,null,"Kazda Jan",139,null,"Novotný Lukáš",147,null,null,null,null,null,null,null,null,null,null,null,null,null,null,null,null,null,null,null,null,null,"Fay Vlastimil",134,null,"Kročil Tomáš",139,null,null,null,null,null,null,null,null,null,null,null,null,null,null,null,null,null,null,null,null,null,"Kalošová Dagmar",131,null,"Štěpán Radek",136,null,null,null,null,null,null,null,null,null,null,null,null,null,null,null,null,null,null,null,null,null,"Neshyba Jaroslav",140,null,"Kročil Tomáš",143,null,null,null,null,null,null,null,null,null,null,null,null,null,null,null,null,null,null,null,null,null,"Sehnal Ivan",139,null,"Pecka Jiří",141,null,null,null,null,null,null,null,null,null,null,null,null,null,null,null,null,null,null,null,null,null,"Brejcha Jaroslav",143,null,"Holkup Jan",144]
[null,null,null,null,null,null,null,null,null,null,null,null,null,null,null,null,null,null,null,null,null,null,null,null,"Sehnal Ivan",137,null,"Sladovník Miloš",134,null,null,null,null,null,null,null,null,null,null,null,null,null,null,null,null,null,null,null,null,null,"Plecháček Miroslav",136,null,"Lazur Vladimír",147,null,null,null,null,null,null,null,null,null,null,null,null,null,null,null,null,null,null,null,null,null,"Šafář Ladislav",131,null,"Novotný Lukáš",141,null,null,null,null,null,null,null,null,null,null,null,null,null,null,null,null,null,null,null,null,null,"Fay Vlastimil",131,null,"German Milan",137,null,null,null,null,null,null,null,null,null,null,null,null,null,null,null,null,null,null,null,null,null,"Dvořák Petr",140,null,"Podhola Martin",144,null,null,null,null,null,null,null,null,null,null,null,null,null,null,null,null,null,null,null,null,null,"Tichý Hugo",138,null,"Ondřich František",145,null,null,null,null,null,null,null,null,null,null,null,null,null,null,null,null,null,null,null,null,null,"Douša Adam",137,null,"Věchtík Antoním",145]
[null,null,null,null,null,null,null,null,null,null,null,null,null,null,null,null,null,null,null,null,null,null,null,null,"Čermák Tomáš",135,null,"Radová Petra",139,null,null,null,null,null,null,null,null,null,null,null,null,null,null,null,null,null,null,null,null,null,"Lazurová Jiřina",136,null,"Pospíšil Václav",150,null,null,null,null,null,null,null,null,null,null,null,null,null,null,null,null,null,null,null,null,null,"Křikava Miroslav",126,null,"Pospíšil Václav",143,null,null,null,null,null,null,null,null,null,null,null,null,null,null,null,null,null,null,null,null,null,"Novotná Petra",130,null,"Carvan Pavel",137,null,null,null,null,null,null,null,null,null,null,null,null,null,null,null,null,null,null,null,null,null,"Čermák Tomáš",139,null,"Šafařík Luděk",145,null,null,null,null,null,null,null,null,null,null,null,null,null,null,null,null,null,null,null,null,null,"Šafář Ladislav",138,null,"Lazur Vladimír",145,null,null,null,null,null,null,null,null,null,null,null,null,null,null,null,null,null,null,null,null,null,"Šafář Ladislav",137,null,"Kocůr Jaroslav",147]
[null,null,null,null,null,null,null,null,null,null,null,null,null,null,null,null,null,null,null,null,null,null,null,null,"Veselý Vlastimil",134,null,"Pospíšil Václav",140,null,null,null,null,null,null,null,null,null,null,null,null,null,null,null,null,null,null,null,null,null,"Řehák Jaroslav",135,null,"Mašát Petr",151,null,null,null,null,null,null,null,null,null,null,null,null,null,null,null,null,null,null,null,null,null,"Aunický František",126,null,"Mašát Petr",145,null,null,null,null,null,null,null,null,null,null,null,null,null,null,null,null,null,null,null,null,null,"Svítil Pavel",129,null,"Kročil Tomáš",138,null,null,null,null,null,null,null,null,null,null,null,null,null,null,null,null,null,null,null,null,null,"Novotná Petra",139,null,"Jelínek Jan",145,null,null,null,null,null,null,null,null,null,null,null,null,null,null,null,null,null,null,null,null,null,"Fay Vlastimil",134,null,"Pospíšil Václav",146,null,null,null,null,null,null,null,null,null,null,null,null,null,null,null,null,null,null,null,null,null,"Pavlíček Rudolf",137,null,"Carvan Pavel",147]
[null,null,null,null,null,null,null,null,null,null,null,null,null,null,null,null,null,null,null,null,null,null,null,null,"Křikava Miroslav",130,null,"Pecka Jiří",144,null,null,null,null,null,null,null,null,null,null,null,null,null,null,null,null,null,null,null,null,null,"Mottl Pavel",134,null,"Carvan Pavel",156,null,null,null,null,null,null,null,null,null,null,null,null,null,null,null,null,null,null,null,null,null,"Pospíšil Lukáš",122,null,"Skružná Pavla",148,null,null,null,null,null,null,null,null,null,null,null,null,null,null,null,null,null,null,null,null,null,"Kovář Jaroslav",127,null,"Mašát Petr",143,null,null,null,null,null,null,null,null,null,null,null,null,null,null,null,null,null,null,null,null,null,"Křikava Miroslav",136,null,"Holkup Jan",146,null,null,null,null,null,null,null,null,null,null,null,null,null,null,null,null,null,null,null,null,null,"Čermák Tomáš",133,null,"Froněk Martin",150,null,null,null,null,null,null,null,null,null,null,null,null,null,null,null,null,null,null,null,null,null,"Růžička Václav",134,null,"Pospíšil Václav",148]
[null,null,null,null,null,null,null,null,null,null,null,null,null,null,null,null,null,null,null,null,null,null,null,null,"Řehák František",128,null,"Novotný Lukáš",148,null,null,null,null,null,null,null,null,null,null,null,null,null,null,null,null,null,null,null,null,null,"Fay Vlastimil",131,null,"Šafařík Luděk",156,null,null,null,null,null,null,null,null,null,null,null,null,null,null,null,null,null,null,null,null,null,"Čermák Tomáš",120,null,"Lazur Ladislav",151,null,null,null,null,null,null,null,null,null,null,null,null,null,null,null,null,null,null,null,null,null,"Řehák Jaroslav",126,null,"Šafařík Luděk",145,null,null,null,null,null,null,null,null,null,null,null,null,null,null,null,null,null,null,null,null,null,"Fay Vlastimil",124,null,"Kocúr Jaroslav",148,null,null,null,null,null,null,null,null,null,null,null,null,null,null,null,null,null,null,null,null,null,"Kovář Jaroslav",133,null,"Kocúr Jaroslav",160,null,null,null,null,null,null,null,null,null,null,null,null,null,null,null,null,null,null,null,null,null,"Lazurová Jiřina",132,null,"Jelínek Jan",149]
[null,null,null,null,null,null,null,null,null,null,null,null,null,null,null,null,null,null,null,null,null,null,null,null,"Kalošová Dagmar",127,null,"Šafařík Luděk",153,null,null,null,null,null,null,null,null,null,null,null,null,null,null,null,null,null,null,null,null,null,"Táborský František",123,null,"Podhola Martin",161,null,null,null,null,null,null,null,null,null,null,null,null,null,null,null,null,null,null,null,null,null,"Kollár Pavel",119,null,"Kocúr Jaroslav",154,null,null,null,null,null,null,null,null,null,null,null,null,null,null,null,null,null,null,null,null,null,"Táborský František",123,null,"Sladovník Miloslav",159,null,null,null,null,null,null,null,null,null,null,null,null,null,null,null,null,null,null,null,null,null,"Pavlíček Rudolf",123,null,"Ondřich František",154,null,null,null,null,null,null,null,null,null,null,null,null,null,null,null,null,null,null,null,null,null,"Lokvenc Jiří",133,null,"Krupa Jozef",160,null,null,null,null,null,null,null,null,null,null,null,null,null,null,null,null,null,null,null,null,null,"Táborský František",128,null,"Šafařík Luděk",149]
[null,null,null,null,null,null,null,null,null,null,null,null,null,null,null,null,null,null,null,null,null,null,null,null,"Aunický František",126,null,"Lazur Ladislav",159,null,null,null,null,null,null,null,null,null,null,null,null,null,null,null,null,null,null,null,null,null,"Bergerová Marcela",118,null,"Krupa Josef",170,null,null,null,null,null,null,null,null,null,null,null,null,null,null,null,null,null,null,null,null,null,"Vychnerová Michala",114,null,"Pecka Jiří",156,null,null,null,null,null,null,null,null,null,null,null,null,null,null,null,null,null,null,null,null,null,"Bergerová Marcela",118,null,"Krupa Jozef",166,null,null,null,null,null,null,null,null,null,null,null,null,null,null,null,null,null,null,null,null,null,"Katolický Zdenek",119,null,"Kalfiřt Petr",156,null,null,null,null,null,null,null,null,null,null,null,null,null,null,null,null,null,null,null,null,null,"Pipek Pavel",128,null,"Kalfiřt Petr",164,null,null,null,null,null,null,null,null,null,null,null,null,null,null,null,null,null,null,null,null,null,"Pospíšil Lukáš",119,null,"Novotný Lukáš",154]
[null,null,null,null,null,null,null,null,null,null,null,null,null,null,null,null,null,null,null,null,null,null,null,null,"Kutina Pavel",115,null,"Mašát Petr",165,null,null,null,null,null,null,null,null,null,null,null,null,null,null,null,null,null,null,null,null,null,"Kalošová Dagmar",113,null,"Kocůr Jaroslav",172,null,null,null,null,null,null,null,null,null,null,null,null,null,null,null,null,null,null,null,null,null,"Svítil Pavel",113,null,"Ondřich František",159,null,null,null,null,null,null,null,null,null,null,null,null,null,null,null,null,null,null,null,null,null,"Štarková Tereza",109,null,"Pospíšil Václav",168,null,null,null,null,null,null,null,null,null,null,null,null,null,null,null,null,null,null,null,null,null,"Šafrová Martina",115,null,"Krupa Jozef",171,null,null,null,null,null,null,null,null,null,null,null,null,null,null,null,null,null,null,null,null,null,"Hyková Lucie",82,null,"Šafařík Luděk",175,null,null,null,null,null,null,null,null,null,null,null,null,null,null,null,null,null,null,null,null,null,"Hyková Lucie",97,null,"Froněk Martin",163]

{"sheet":"turnaje","index":3,"n_rows":71,"n_cols":200,"rows_kept":71,"cut":false,"hidden":false,"merged":[[17,156,22,156],[23,155,28,155],[23,156,28,156],[41,155,46,155],[59,155,64,155],[59,156,64,156],[53,156,58,156],[53,155,58,155],[21,9,22,9],[11,170,16,170],[17,170,22,170],[23,170,28,170],[29,170,34,170],[35,170,40,170],[29,132,34,132],[11,155,16,155],[11,156,16,156],[17,155,22,155],[4,173,4,175],[0,153,3,153],[18,1,19,2],[18,3,19,3],[4,155,4,156],[4,166,4,167],[5,155,10,155],[5,156,10,156],[18,9,19,9],[17,132,22,132],[65,179,70,179],[65,180,70,180],[65,194,70,194],[59,131,64,131],[59,132,64,132],[59,146,64,146],[59,179,64,179],[59,107,64,107],[59,194,64,194],[59,108,64,108],[59,122,64,122],[59,74,64,74],[59,83,64,83],[59,84,64,84],[59,98,64,98],[59,170,64,170],[53,194,58,194],[59,15,64,15],[59,16,64,16],[59,28,64,28],[59,37,64,37],[59,38,64,38],[59,50,64,50],[59,59,64,59],[59,180,64,180],[59,60,64,60],[53,132,58,132],[53,146,58,146],[53,179,58,179],[53,180,58,180],[53,107,58,107],[53,108,58,108],[53,122,58,122],[53,131,58,131],[53,170,58,170],[53,74,58,74],[53,83,58,83],[53,84,58,84],[53,98,58,98],[53,38,58,38],[53,50,58,50],[53,59,58,59],[53,60,58,60],[53,15,58,15],[53,16,58,16],[53,28,58,28],[53,37,58,37],[47,146,52,146],[47,179,52,179],[47,83,52,83],[47,84,52,84],[47,98,52,98],[47,107,52,107],[47,180,52,180],[47,194,52,194],[47,108,52,108],[47,122,52,122],[47,131,52,131],[47,132,52,132],[47,170,52,170],[47,156,52,156],[47,155,52,155],[41,194,46,194],[47,15,52,15],[47,16,52,16],[47,28,52,28],[47,37,52,37],[47,38,52,38],[47,50,52,50],[47,59,52,59],[47,60,52,60],[47,74,52,74],[41,132,46,132],[41,146,46,146],[41,179,46,179],[41,180,46,180],[41,107,46,107],[41,108,46,108],[41,122,46,122],[41,131,46,131],[41,170,46,170],[41,156,46,156],[41,74,46,74],[41,83,46,83],[41,84,46,84],[41,98,46,98],[41,38,46,38],[41,50,46,50],[41,59,46,59],[41,60,46,60],[41,15,46,15],[41,16,46,16],[41,28,46,28],[41,37,46,37],[35,146,40,146],[35,179,40,179],[35,83,40,83],[35,84,40,84],[35,98,40,98],[35,107,40,107],[35,180,40,180],[35,194,40,194],[35,108,40,108],[35,122,40,122],[35,131,40,131],[35,132,40,132],[35,156,40,156],[35,155,40,155],[29,194,34,194],[35,15,40,15],[35,16,40,16],[35,28,40,28],[35,37,40,37],[35,38,40,38],[35,50,40,50],[35,59,40,59],[35,60,40,60],[35,74,40,74],[29,146,34,146],[29,179,34,179],[29,180,34,180],[29,107,34,107],[29,108,34,108],[29,122,34,122],[29,131,34,131],[29,155,34,155],[29,156,34,156],[29,74,34,74],[29,83,34,83],[29,84,34,84],[29,98,34,98],[29,38,34,38],[29,50,34,50],[29,59,34,59],[29,60,34,60],[29,15,34,15],[29,16,34,16],[29,28,34,28],[29,37,34,37],[23,146,28,146],[23,179,28,179],[23,83,28,83],[23,84,28,84],[23,98,28,98],[23,107,28,107],[23,180,28,180],[23,194,28,194],[23,108,28,108],[23,122,28,122],[23,131,28,131],[23,132,28,132],[23,74,28,74],[11,15,16,15],[12,5,13,6],[11,16,16,16],[17,16,22,16],[17,15,22,15],[23,50,28,50],[23,59,28,59],[23,60,28,60],[15,9,16,9],[17,194,22,194],[22,1,23,2],[23,15,28,15],[23,16,28,16],[23,28,28,28],[23,37,28,37],[23,38,28,38],[17,37,22,37],[17,38,22,38],[16,3,17,3],[17,146,22,146],[17,179,22,179],[17,180,22,180],[11,194,16,194],[12,1,13,2],[12,3,13,3],[14,1,15,2],[14,3,15,3],[16,1,17,2],[17,107,22,107],[11,28,16,28],[11,37,16,37],[11,38,16,38],[11,50,16,50],[17,74,22,74],[11,107,16,107],[5,180,10,180],[5,131,10,131],[5,132,10,132],[11,84,16,84],[11,74,16,74],[11,83,16,83],[11,122,16,122],[11,131,16,131],[11,132,16,132],[11,146,16,146],[17,108,22,108],[17,122,22,122],[17,131,22,131],[17,28,22,28],[17,50,22,50],[17,59,22,59],[17,60,22,60],[17,83,22,83],[17,84,22,84],[17,98,22,98],[5,194,10,194],[6,1,7,2],[6,3,7,3],[8,1,9,2],[8,3,9,3],[10,1,11,2],[10,3,11,3],[11,179,16,179],[11,180,16,180],[5,122,10,122],[11,108,16,108],[11,98,16,98],[5,59,10,59],[5,74,10,74],[11,59,16,59],[11,60,16,60],[5,179,10,179],[5,60,10,60],[5,83,10,83],[5,84,10,84],[5,98,10,98],[5,107,10,107],[5,108,10,108],[5,146,10,146],[5,170,10,170],[5,15,10,15],[5,16,10,16],[5,28,10,28],[5,37,10,37],[4,107,4,108],[4,31,4,33],[4,77,4,79],[4,101,4,103],[5,38,10,38],[5,50,10,50],[4,15,4,16],[4,26,4,27],[4,37,4,38],[4,48,4,49],[4,59,4,60],[4,94,4,95],[2,107,2,127],[0,13,3,13],[0,129,3,129],[0,35,3,35],[0,57,3,57],[0,105,3,105],[4,149,4,151],[4,70,4,71],[4,83,4,84],[4,118,4,119],[4,131,4,132],[2,1,3,8],[2,15,2,33],[2,37,2,55],[2,59,2,79],[2,83,2,103],[0,177,3,177],[0,81,3,81],[2,131,2,151],[4,197,4,199],[4,53,4,55],[2,179,2,199],[4,142,4,143],[4,190,4,191],[4,179,4,180],[4,125,4,127]]}
[null,null,null,null,null,null,null,null,null,null,null,null,null,"ZPĚT",null,null,null,null,null,null,null,null,null,null,null,null,null,null,null,null,null,null,null,null,null,"ZPĚT",null,null,null,null,null,null,null,null,null,null,null,null,null,null,null,null,null,null,null,null,null,"ZPĚT",null,null,null,null,null,null,null,null,null,null,null,null,null,null,null,null,null,null,null,null,null,null,null,"ZPĚT",null,null,null,null,null,null,null,null,null,null,null,null,null,null,null,null,null,null,null,null,null,null,null,"ZPĚT",null,null,null,null,null,null,null,null,null,null,null,null,null,null,null,null,null,null,null,null,null,null,null,"ZPĚT",null,null,null,null,null,null,null,null,null,null,null,null,null,null,null,null,null,null,null,null,null,null,null,"ZPĚT",null,null,null,null,null,null,null,null,null,null,null,null,null,null,null,null,null,null,null,null,null,null,null,"ZPĚT"]
[]
[null,"JEDNOTLIVÉ TURNAJE V ROCE 2013",null,null,null,null,null,null,null,null,null,null,null,null,null,"SPORTOVNÍ TURNAJ V BOWLINGU O POHÁR PV-OSZO DP-A PRAHA  - 19. LEDNA 2013",null,null,null,null,null,null,null,null,null,null,null,null,null,null,null,null,null,null,null,null,null,"Sportovní turnaj v Bowlingu o pohár ZV-OS Klíčov dne 9. 2. 2013",null,null,null,null,null,null,null,null,null,null,null,null,null,null,null,null,null,null,null,null,null,"Sportovní turnaj v Bowlingu o pohár ZV-OS Řepy dne 9. 3. 2013",null,null,null,null,null,null,null,null,null,null,null,null,null,null,null,null,null,null,null,null,null,null,null,"Sportovní turnaj v Bowlingu o pohár ZV-OS Hostivař dne 27. 4. 2013",null,null,null,null,null,null,null,null,null,null,null,null,null,null,null,null,null,null,null,null,null,null,null,"Sportovní turnaj v Bowlingu o pohár ZV-OS Kačerov dne 12.10. 2013",null,null,null,null,null,null,null,null,null,null,null,null,null,null,null,null,null,null,null,null,null,null,null,"Sportovní turnaj v Bowlingu o pohár ZV-OS Vršovice dne 9.11. 2013",null,null,null,null,null,null,null,null,null,null,null,null,null,null,null,null,null,null,null,null,null,null,null,null,null,null,null,null,null,null,null,null,null,null,null,null,null,null,null,null,null,null,null,null,null,null,null,"Sportovní turnaj v Bowlingu o pohár ___ dne _. _. 2013"]
[]
[null,null,null,null,null,null,null,null,null,null,null,null,null,null,null,"Garáž",null,"Jméno","I.","II.","III.","IV.","V.","Body",null,null,"Jednotlivci.",null,"Družstva.",null,null,"pořadí jednotlivců",null,null,null,null,null,"Garáž",null,"Jméno","I.","II.","III.","IV.","V.","Body",null,null,"Jednotlivci.",null,"Družstva.",null,null,"pořadí jednotlivců",null,null,null,null,null,"Garáž",null,"Jméno","I.","II.","III.","IV.","V.","Body",null,null,"Jednotlivci.",null,null,null,"Družstva.",null,null,"pořadí jednotlivců",null,null,null,null,null,"Garáž",null,"Jméno","I.","II.","III.","IV.","V.","Body",null,null,"Jednotlivci.",null,null,null,"Družstva.",null,null,"pořadí jednotlivců",null,null,null,null,null,"Garáž",null,"Jméno","I.","II.","III.","IV.","V.","Body",null,null,"Jednotlivci.",null,null,null,"Družstva.",null,null,"pořadí jednotlivců",null,null,null,null,null,"Garáž",null,"Jméno","I.","II.","III.","IV.","V.","Body",null,null,"Jednotlivci.",null,null,null,"Družstva.",null,null,"pořadí jednotlivců",null,null,null,null,null,"Garáž",null,"Jméno","I.","II.","III.","IV.","V.","Body",null,null,"Jednotlivci.",null,null,null,"Družstva.",null,null,"pořadí jednotlivců",null,null,null,null,null,"Garáž",null,"Jméno","I.","II.","III.","IV.","V.","Body",null,null,"Jednotlivci.",null,null,null,"Družstva.",null,null,"pořadí jednotlivců"]
[null,null,null,null,null,null,null,null,null,null,null,null,null,null,{"$f":"IF(S6=\"\",\"\",AA6)","v":43},1,"ŘEPY I.","KŘIKAVA MIROSLAV",116,130,127,88,111,{"$f":"SUM(S6:W6)","v":572},{"$f":"MAX(S6:W6)","v":130},{"$f":"SUM(X6*1000)+Y6+0.5","v":572130.5},{"$f":"IF(S6=\"\",\"\",RANK(Z6,Z6:Z65,0))","v":43},null,{"$f":"RANK(AB11,AB11:AB65,0)","v":6},null,{"$f":"COUNT(S6:S10,S12:S16,S18:S22,S24:S28,S30:S34,S36:S40,S42:S46,S48:S52,S54:S58,S60:S64)","v":50},1,{"$f":"IF(AE6<1,\"\",VLOOKUP(1,O6:AA65,4,FALSE))","v":"ŠAFAŘÍK LUDĚK"},{"$f":"IF(AE6<1,\"\",VLOOKUP(1,O6:AA65,10,FALSE))","v":928},null,null,{"$f":"IF(AO6=\"\",\"\",AW6)","v":38},1,"KLÍČOV I.","KOLÁŘ LADISLAV",139,135,109,119,119,{"$f":"SUM(AO6:AS6)","v":621},{"$f":"MAX(AO6:AS6)","v":139},{"$f":"SUM(AT6*1000)+AU6+0.5","v":621139.5},{"$f":"IF(AO6=\"\",\"\",RANK(AV6,AV6:AV65,0))","v":38},null,{"$f":"RANK(AX11,AX11:AX65,0)","v":5},null,{"$f":"COUNT(AO6:AO10,AO12:AO16,AO18:AO22,AO24:AO28,AO30:AO34,AO36:AO40,AO42:AO46,AO48:AO52,AO54:AO58,AO60:AO64)","v":50},1,{"$f":"IF(BA6<1,\"\",VLOOKUP(1,AK6:AW65,4,FALSE))","v":"LAZUR VLADIMÍR"},{"$f":"IF(BA6<1,\"\",VLOOKUP(1,AK6:AW65,10,FALSE))","v":945},null,null,{"$f":"IF(BK6=\"\",\"\",BS6)","v":17},1,"VRŠOVICE I.","KRUPA JOZEF",136,159,138,174,153,{"$f":"SUM(BK6:BO6)","v":760},{"$f":"MAX(BK6:BO6)","v":174},{"$f":"SUM(BP6*1000)+BQ6+0.5","v":760174.5},{"$f":"IF(BK6=\"\",\"\",RANK(BR6,BR6:BR65,0))","v":17},null,null,null,{"$f":"IF(BK6=\"\",\"\",RANK(BV11,BV11:BV65,0))","v":5},null,{"$f":"COUNT(BK6:BK10,BK12:BK16,BK18:BK22,BK24:BK28,BK30:BK34,BK36:BK40,BK42:BK46,BK48:BK52,BK54:BK58,BK60:BK64)","v":50},1,{"$f":"IF(BY6<1,\"\",VLOOKUP(1,BG6:BS65,4,FALSE))","v":"KOCŮR JAROSLAV"},{"$f":"IF(BY6<1,\"\",VLOOKUP(1,BG6:BS65,10,FALSE))","v":960},null,null,{"$f":"IF(CI6=\"\",\"\",CQ6)","v":43},1,"HOSTIVAŘ I.","KOLLÁR PAVEL",116,89,107,115,131,{"$f":"SUM(CI6:CM6)","v":558},{"$f":"MAX(CI6:CM6)","v":131},{"$f":"SUM(CN6*1000)+CO6+0.5","v":558131.5},{"$f":"IF(CI6=\"\",\"\",RANK(CP6,CP6:CP65,0))","v":43},null,null,null,{"$f":"IF(CI6=\"\",\"\",RANK(CT11,CT11:CT65,0))","v":5},null,{"$f":"COUNT(CI6:CI10,CI12:CI16,CI18:CI22,CI24:CI28,CI30:CI34,CI36:CI40,CI42:CI46,CI48:CI52,CI54:CI58,CI60:CI64)","v":50},1,{"$f":"IF(CW6<1,\"\",VLOOKUP(1,CE6:CQ65,4,FALSE))","v":"POSPÍŠIL VÁCLAV"},{"$f":"IF(CW6<1,\"\",VLOOKUP(1,CE6:CQ65,10,FALSE))","v":901},null,null,{"$f":"IF(DG6=\"\",\"\",DO6)","v":26},1,"KAČEROV I.","Hübner Jiří",136,154,125,117,171,{"$f":"SUM(DG6:DK6)","v":703},{"$f":"MAX(DG6:DK6)","v":171},{"$f":"SUM(DL6*1000)+DM6+0.5","v":703171.5},{"$f":"IF(DG6=\"\",\"\",RANK(DN6,DN6:DN65,0))","v":26},null,null,null,{"$f":"IF(DG6=\"\",\"\",RANK(DR11,DR11:DR65,0))","v":4},null,{"$f":"COUNT(DG6:DG10,DG12:DG16,DG18:DG22,DG24:DG28,DG30:DG34,DG36:DG40,DG42:DG46,DG48:DG52,DG54:DG58,DG60:DG64)","v":50},1,{"$f":"IF(DU6<1,\"\",VLOOKUP(1,DC6:DO65,4,FALSE))","v":"Krupa Jozef"},{"$f":"IF(DU6<1,\"\",VLOOKUP(1,DC6:DO65,10,FALSE))","v":959},null,null,{"$f":"IF(EE6=\"\",\"\",EM6)","v":39},1,"ŘEPY I.","Křikava Miroslav",116,111,131,120,148,{"$f":"SUM(EE6:EI6)","v":626},{"$f":"MAX(EE6:EI6)","v":148},{"$f":"SUM(EJ6*1000)+EK6+0.5","v":626148.5},{"$f":"IF(EE6=\"\",\"\",RANK(EL6,EL6:EL65,0))","v":39},null,null,null,{"$f":"IF(EE6=\"\",\"\",RANK(EP11,EP11:EP65,0))","v":9},null,{"$f":"COUNT(EE6:EE10,EE12:EE16,EE18:EE22,EE24:EE28,EE30:EE34,EE36:EE40,EE42:EE46,EE48:EE52,EE54:EE58,EE60:EE64)","v":50},1,{"$f":"IF(ES6<1,\"\",VLOOKUP(1,EA6:EM65,4,FALSE))","v":"Šafařík Luděk"},{"$f":"IF(ES6<1,\"\",VLOOKUP(1,EA6:EM65,10,FALSE))","v":962},null,null,{"$f":"IF(FC6=\"\",\"\",FK6)","v":15},1,"KLÍČOV I.","Pecka Jiří",146,135,181,163,165,{"$f":"SUM(FC6:FG6)","v":790},{"$f":"MAX(FC6:FG6)","v":181},{"$f":"SUM(FH6*1000)+FI6+0.5","v":790181.5},{"$f":"IF(FC6=\"\",\"\",RANK(FJ6,FJ6:FJ65,0))","v":15},null,null,null,{"$f":"IF(FC6=\"\",\"\",RANK(FN11,FN11:FN65,0))","v":3},null,{"$f":"COUNT(FC6:FC10,FC12:FC16,FC18:FC22,FC24:FC28,FC30:FC34,FC36:FC40,FC42:FC46,FC48:FC52,FC54:FC58,FC60:FC64)","v":50},1,{"$f":"IF(FQ6<1,\"\",VLOOKUP(1,EY6:FL65,4,FALSE))","v":"Froněk Martin"},{"$f":"IF(FQ6<1,\"\",VLOOKUP(1,EY6:FL65,10,FALSE))","v":893},null,null,{"$f":"IF(GA6=\"\",\"\",GI6)","v":3},1,"ŘEPY I.",null,1,1,1,null,null,{"$f":"SUM(GA6:GE6)","v":3},{"$f":"MAX(GA6:GE6)","v":1},{"$f":"SUM(GF6*1000)+GG6+0.5","v":3001.5},{"$f":"IF(GA6=\"\",\"\",RANK(GH6,GH6:GH70,0))","v":3},null,null,null,{"$f":"IF(GA6=\"\",\"\",RANK(GL11,GL11:GL71,0))","v":3},null,{"$f":"COUNT(GA6:GA10,GA12:GA16,GA18:GA22,GA24:GA28,GA30:GA34,GA36:GA40,GA42:GA46,GA48:GA52,GA54:GA58,GA60:GA64,GA66:GA70)","v":3},1,{"$f":"IF(GO6<1,\"\",VLOOKUP(1,FW6:GI70,4,FALSE))","v":0},{"$f":"IF(GO6<1,\"\",VLOOKUP(1,FW6:GI70,10,FALSE))","v":3}]
[null,"PV OSZO",null,"19.1.",null,null,null,null,null,null,null,null,null,null,{"$f":"IF(S7=\"\",\"\",AA7)","v":34},null,null,"SEHNAL IVAN",137,116,134,122,122,{"$f":"SUM(S7:W7)","v":631},137,{"$f":"SUM(X7*1000)+Y7+0.49","v":631137.49},{"$f":"IF(S7=\"\",\"\",RANK(Z7,Z6:Z65,0))","v":34},null,null,null,null,{"$f":"SUM(AF6+1)","v":2},{"$f":"IF(AE6<2,\"\",VLOOKUP(2,O6:AA65,4,FALSE))","v":"MAŠÁT PETR"},{"$f":"IF(AE6<2,\"\",VLOOKUP(2,O6:AA65,10,FALSE))","v":895},null,null,{"$f":"IF(AO7=\"\",\"\",AW7)","v":9},null,null,"PECKA JIŘÍ",166,144,148,168,205,{"$f":"SUM(AO7:AS7)","v":831},205,{"$f":"SUM(AT7*1000)+AU7+0.49","v":831205.49},{"$f":"IF(AO7=\"\",\"\",RANK(AV7,AV6:AV65,0))","v":9},null,null,null,null,{"$f":"SUM(BB6+1)","v":2},{"$f":"IF(BA6<2,\"\",VLOOKUP(2,AK6:AW65,4,FALSE))","v":"KOCŮR JAROSLAV"},{"$f":"IF(BA6<2,\"\",VLOOKUP(2,AK6:AW65,10,FALSE))","v":915},null,null,{"$f":"IF(BK7=\"\",\"\",BS7)","v":9},null,null,"PODHOLA MARTIN",135,180,184,157,168,{"$f":"SUM(BK7:BO7)","v":824},184,{"$f":"SUM(BP7*1000)+BQ7+0.49","v":824184.49},{"$f":"IF(BK7=\"\",\"\",RANK(BR7,BR6:BR65,0))","v":9},null,null,null,null,null,null,{"$f":"SUM(BZ6+1)","v":2},{"$f":"IF(BY6<2,\"\",VLOOKUP(2,BG6:BS65,4,FALSE))","v":"ŠAFAŘÍK LUDĚK"},{"$f":"IF(BY6<2,\"\",VLOOKUP(2,BG6:BS65,10,FALSE))","v":897},null,null,{"$f":"IF(CI7=\"\",\"\",CQ7)","v":22},null,null,"BERGER MICHAL",123,129,140,212,99,{"$f":"SUM(CI7:CM7)","v":703},212,{"$f":"SUM(CN7*1000)+CO7+0.49","v":703212.49},{"$f":"IF(CI7=\"\",\"\",RANK(CP7,CP6:CP65,0))","v":22},null,null,null,null,null,null,{"$f":"SUM(CX6+1)","v":2},{"$f":"IF(CW6<2,\"\",VLOOKUP(2,CE6:CQ65,4,FALSE))","v":"ŠAFAŘÍK LUDĚK"},{"$f":"IF(CW6<2,\"\",VLOOKUP(2,CE6:CQ65,10,FALSE))","v":883},null,null,{"$f":"IF(DG7=\"\",\"\",DO7)","v":18},null,null,"Tomášek Zdenek",128,169,171,98,159,{"$f":"SUM(DG7:DK7)","v":725},171,{"$f":"SUM(DL7*1000)+DM7+0.49","v":725171.49},{"$f":"IF(DG7=\"\",\"\",RANK(DN7,DN6:DN65,0))","v":18},null,null,null,null,null,null,{"$f":"SUM(DV6+1)","v":2},{"$f":"IF(DU6<2,\"\",VLOOKUP(2,DC6:DO65,4,FALSE))","v":"Holkup Jan"},{"$f":"IF(DU6<2,\"\",VLOOKUP(2,DC6:DO65,10,FALSE))","v":912},null,null,{"$f":"IF(EE7=\"\",\"\",EM7)","v":29},null,null,"Mottl Pavel",127,139,146,120,141,{"$f":"SUM(EE7:EI7)","v":673},146,{"$f":"SUM(EJ7*1000)+EK7+0.49","v":673146.49},{"$f":"IF(EE7=\"\",\"\",RANK(EL7,EL6:EL65,0))","v":29},null,null,null,null,null,null,{"$f":"SUM(ET6+1)","v":2},{"$f":"IF(ES6<2,\"\",VLOOKUP(2,EA6:EM65,4,FALSE))","v":"Lazur Vladimír"},{"$f":"IF(ES6<2,\"\",VLOOKUP(2,EA6:EM65,10,FALSE))","v":901},null,null,{"$f":"IF(FC7=\"\",\"\",FK7)","v":25},null,null,"Křemenák Petr",121,165,137,116,148,{"$f":"SUM(FC7:FG7)","v":687},165,{"$f":"SUM(FH7*1000)+FI7+0.49","v":687165.49},{"$f":"IF(FC7=\"\",\"\",RANK(FJ7,FJ6:FJ65,0))","v":25},null,null,null,null,null,null,{"$f":"SUM(FR6+1)","v":2},{"$f":"IF(FQ6<2,\"\",VLOOKUP(2,EY6:FL65,4,FALSE))","v":"Novotný Lukáš"},{"$f":"IF(FQ6<2,\"\",VLOOKUP(2,EY6:FL65,10,FALSE))","v":888},null,null,{"$f":"IF(GA7=\"\",\"\",GI7)","v":""},null,null,null,null,null,null,null,null,{"$f":"SUM(GA7:GE7)","v":0},0,{"$f":"SUM(GF7*1000)+GG7+0.49","v":0.49},{"$f":"IF(GA7=\"\",\"\",RANK(GH7,GH6:GH70,0))","v":""},null,null,null,null,null,null,{"$f":"SUM(GP6+1)","v":2},{"$f":"IF(GO6<2,\"\",VLOOKUP(2,FW6:GI70,4,FALSE))","v":0},{"$f":"IF(GO6<2,\"\",VLOOKUP(2,FW6:GI70,10,FALSE))","v":3}]
[null,null,null,null,null,null,null,null,null,null,null,null,null,null,{"$f":"IF(S8=\"\",\"\",AA8)","v":19},null,null,"SLADOVNÍK MILOSLAV",134,135,139,172,140,{"$f":"SUM(S8:W8)","v":720},172,{"$f":"SUM(X8*1000)+Y8+0.48","v":720172.48},{"$f":"IF(S8=\"\",\"\",RANK(Z8,Z6:Z65,0))","v":19},null,null,null,null,{"$f":"SUM(AF7+1)","v":3},{"$f":"IF(AE6<3,\"\",VLOOKUP(3,O6:AA65,4,FALSE))","v":"POSPÍŠIL VÁCLAV"},{"$f":"IF(AE6<3,\"\",VLOOKUP(3,O6:AA65,10,FALSE))","v":881},null,null,{"$f":"IF(AO8=\"\",\"\",AW8)","v":8},null,null,"NOVOTNÝ LUKÁŠ",164,179,180,147,163,{"$f":"SUM(AO8:AS8)","v":833},180,{"$f":"SUM(AT8*1000)+AU8+0.48","v":833180.48},{"$f":"IF(AO8=\"\",\"\",RANK(AV8,AV6:AV65,0))","v":8},null,null,null,null,{"$f":"SUM(BB7+1)","v":3},{"$f":"IF(BA6<3,\"\",VLOOKUP(3,AK6:AW65,4,FALSE))","v":"ŠAFAŘÍK LUDĚK"},{"$f":"IF(BA6<3,\"\",VLOOKUP(3,AK6:AW65,10,FALSE))","v":905},null,null,{"$f":"IF(BK8=\"\",\"\",BS8)","v":36},null,null,"KUČERA MIROSLAV",100,138,148,145,134,{"$f":"SUM(BK8:BO8)","v":665},148,{"$f":"SUM(BP8*1000)+BQ8+0.48","v":665148.48},{"$f":"IF(BK8=\"\",\"\",RANK(BR8,BR6:BR65,0))","v":36},null,null,null,null,null,null,{"$f":"SUM(BZ7+1)","v":3},{"$f":"IF(BY6<3,\"\",VLOOKUP(3,BG6:BS65,4,FALSE))","v":"ONDŘICH FRANTIŠEK"},{"$f":"IF(BY6<3,\"\",VLOOKUP(3,BG6:BS65,10,FALSE))","v":895},null,null,{"$f":"IF(CI8=\"\",\"\",CQ8)","v":14},null,null,"MYSLIVEČEK JAROSLAV",153,151,105,179,166,{"$f":"SUM(CI8:CM8)","v":754},179,{"$f":"SUM(CN8*1000)+CO8+0.48","v":754179.48},{"$f":"IF(CI8=\"\",\"\",RANK(CP8,CP6:CP65,0))","v":14},null,null,null,null,null,null,{"$f":"SUM(CX7+1)","v":3},{"$f":"IF(CW6<3,\"\",VLOOKUP(3,CE6:CQ65,4,FALSE))","v":"KRUPA JOZEF"},{"$f":"IF(CW6<3,\"\",VLOOKUP(3,CE6:CQ65,10,FALSE))","v":883},null,null,{"$f":"IF(DG8=\"\",\"\",DO8)","v":21},null,null,"Turek Stanislav",143,185,122,118,153,{"$f":"SUM(DG8:DK8)","v":721},185,{"$f":"SUM(DL8*1000)+DM8+0.48","v":721185.48},{"$f":"IF(DG8=\"\",\"\",RANK(DN8,DN6:DN65,0))","v":21},null,null,null,null,null,null,{"$f":"SUM(DV7+1)","v":3},{"$f":"IF(DU6<3,\"\",VLOOKUP(3,DC6:DO65,4,FALSE))","v":"Ondřich František"},{"$f":"IF(DU6<3,\"\",VLOOKUP(3,DC6:DO65,10,FALSE))","v":858},null,null,{"$f":"IF(EE8=\"\",\"\",EM8)","v":43},null,null,"Růžička Václav",144,112,139,100,103,{"$f":"SUM(EE8:EI8)","v":598},144,{"$f":"SUM(EJ8*1000)+EK8+0.48","v":598144.48},{"$f":"IF(EE8=\"\",\"\",RANK(EL8,EL6:EL65,0))","v":43},null,null,null,null,null,null,{"$f":"SUM(ET7+1)","v":3},{"$f":"IF(ES6<3,\"\",VLOOKUP(3,EA6:EM65,4,FALSE))","v":"Kalfiřt Petr"},{"$f":"IF(ES6<3,\"\",VLOOKUP(3,EA6:EM65,10,FALSE))","v":894},null,null,{"$f":"IF(FC8=\"\",\"\",FK8)","v":2},null,null,"Novotný Lukáš",194,154,178,159,203,{"$f":"SUM(FC8:FG8)","v":888},203,{"$f":"SUM(FH8*1000)+FI8+0.48","v":888203.48},{"$f":"IF(FC8=\"\",\"\",RANK(FJ8,FJ6:FJ65,0))","v":2},null,null,null,null,null,null,{"$f":"SUM(FR7+1)","v":3},{"$f":"IF(FQ6<3,\"\",VLOOKUP(3,EY6:FL65,4,FALSE))","v":"Lazur Vladimír"},{"$f":"IF(FQ6<3,\"\",VLOOKUP(3,EY6:FL65,10,FALSE))","v":863},null,null,{"$f":"IF(GA8=\"\",\"\",GI8)","v":""},null,null,null,null,null,null,null,null,{"$f":"SUM(GA8:GE8)","v":0},0,{"$f":"SUM(GF8*1000)+GG8+0.48","v":0.48},{"$f":"IF(GA8=\"\",\"\",RANK(GH8,GH6:GH71,0))","v":""},null,null,null,null,null,null,{"$f":"SUM(GP7+1)","v":3},{"$f":"IF(GO6<3,\"\",VLOOKUP(3,FW6:GI70,4,FALSE))","v":0},{"$f":"IF(GO6<3,\"\",VLOOKUP(3,FW6:GI70,10,FALSE))","v":3}]
[null,"KLÍČOV",null,"9.2.",null,null,null,null,null,null,null,null,null,null,{"$f":"IF(S9=\"\",\"\",AA9)","v":22},null,null,"TICHÝ HUGO",134,157,147,133,134,{"$f":"SUM(S9:W9)","v":705},157,{"$f":"SUM(X9*1000)+Y9+0.47","v":705157.47},{"$f":"IF(S9=\"\",\"\",RANK(Z9,Z6:Z65,0))","v":22},null,null,null,null,4,{"$f":"IF(AE6<4,\"\",VLOOKUP(4,O6:AA65,4,FALSE))","v":"NOVOTNÝ LUKÁŠ"},{"$f":"IF(AE6<4,\"\",VLOOKUP(4,O6:AA65,10,FALSE))","v":860},null,null,{"$f":"IF(AO9=\"\",\"\",AW9)","v":13},null,null,"KALFIŘT PETR",170,137,195,163,131,{"$f":"SUM(AO9:AS9)","v":796},195,{"$f":"SUM(AT9*1000)+AU9+0.47","v":796195.47},{"$f":"IF(AO9=\"\",\"\",RANK(AV9,AV6:AV65,0))","v":13},null,null,null,null,4,{"$f":"IF(BA6<4,\"\",VLOOKUP(4,AK6:AW65,4,FALSE))","v":"PODHOLA MARTIN"},{"$f":"IF(BA6<4,\"\",VLOOKUP(4,AK6:AW65,10,FALSE))","v":896},null,null,{"$f":"IF(BK9=\"\",\"\",BS9)","v":11},null,null,"SKRUŽNÁ PAVLA",153,182,168,148,160,{"$f":"SUM(BK9:BO9)","v":811},182,{"$f":"SUM(BP9*1000)+BQ9+0.47","v":811182.47},{"$f":"IF(BK9=\"\",\"\",RANK(BR9,BR6:BR65,0))","v":11},null,null,null,null,null,null,4,{"$f":"IF(BY6<4,\"\",VLOOKUP(4,BG6:BS65,4,FALSE))","v":"MAŠÁT PETR"},{"$f":"IF(BY6<4,\"\",VLOOKUP(4,BG6:BS65,10,FALSE))","v":859},null,null,{"$f":"IF(CI9=\"\",\"\",CQ9)","v":28},null,null,"JELÍNEK JAN",114,144,168,134,106,{"$f":"SUM(CI9:CM9)","v":666},168,{"$f":"SUM(CN9*1000)+CO9+0.47","v":666168.47},{"$f":"IF(CI9=\"\",\"\",RANK(CP9,CP6:CP65,0))","v":28},null,null,null,null,null,null,4,{"$f":"IF(CW6<4,\"\",VLOOKUP(4,CE6:CQ65,4,FALSE))","v":"MAŠÁT PETR"},{"$f":"IF(CW6<4,\"\",VLOOKUP(4,CE6:CQ65,10,FALSE))","v":854},null,null,{"$f":"IF(DG9=\"\",\"\",DO9)","v":3},null,null,"Ondřich František",166,154,194,176,168,{"$f":"SUM(DG9:DK9)","v":858},194,{"$f":"SUM(DL9*1000)+DM9+0.47","v":858194.47},{"$f":"IF(DG9=\"\",\"\",RANK(DN9,DN6:DN65,0))","v":3},null,null,null,null,null,null,4,{"$f":"IF(DU6<4,\"\",VLOOKUP(4,DC6:DO65,4,FALSE))","v":"Kocúr Jaroslav"},{"$f":"IF(DU6<4,\"\",VLOOKUP(4,DC6:DO65,10,FALSE))","v":854},null,null,{"$f":"IF(EE9=\"\",\"\",EM9)","v":42},null,null,"Sehnal Ivan",129,113,121,139,110,{"$f":"SUM(EE9:EI9)","v":612},139,{"$f":"SUM(EJ9*1000)+EK9+0.47","v":612139.47},{"$f":"IF(EE9=\"\",\"\",RANK(EL9,EL6:EL65,0))","v":42},null,null,null,null,null,null,4,{"$f":"IF(ES6<4,\"\",VLOOKUP(4,EA6:EM65,4,FALSE))","v":"Kocúr Jaroslav"},{"$f":"IF(ES6<4,\"\",VLOOKUP(4,EA6:EM65,10,FALSE))","v":889},null,null,{"$f":"IF(FC9=\"\",\"\",FK9)","v":17},null,null,"Kalfiřt Petr",164,164,163,136,134,{"$f":"SUM(FC9:FG9)","v":761},164,{"$f":"SUM(FH9*1000)+FI9+0.47","v":761164.47},{"$f":"IF(FC9=\"\",\"\",RANK(FJ9,FJ6:FJ65,0))","v":17},null,null,null,null,null,null,4,{"$f":"IF(FQ6<4,\"\",VLOOKUP(4,EY6:FL65,4,FALSE))","v":"Krupa Jozef"},{"$f":"IF(FQ6<4,\"\",VLOOKUP(4,EY6:FL65,10,FALSE))","v":860},null,null,{"$f":"IF(GA9=\"\",\"\",GI9)","v":""},null,null,null,null,null,null,null,null,{"$f":"SUM(GA9:GE9)","v":0},0,{"$f":"SUM(GF9*1000)+GG9+0.47","v":0.47},{"$f":"IF(GA9=\"\",\"\",RANK(GH9,GH6:GH70,0))","v":""},null,null,null,null,null,null,4,{"$f":"IF(GO6<4,\"\",VLOOKUP(4,FW6:GI70,4,FALSE))","v":""},{"$f":"IF(GO6<4,\"\",VLOOKUP(4,FW6:GI70,10,FALSE))","v":""}]
[null,null,null,null,null,null,null,null,null,null,null,null,null,null,{"$f":"IF(S10=\"\",\"\",AA10)","v":31},null,null,"PLECHÁČEK MIROSLAV",103,134,160,121,135,{"$f":"SUM(S10:W10)","v":653},160,{"$f":"SUM(X10*1000)+Y10+0.46","v":653160.46},{"$f":"IF(S10=\"\",\"\",RANK(Z10,Z6:Z65,0))","v":31},null,null,null,null,5,{"$f":"IF(AE6<5,\"\",VLOOKUP(5,O6:AA65,4,FALSE))","v":"LAZUR VLADIMÍR"},{"$f":"IF(AE6<5,\"\",VLOOKUP(5,O6:AA65,10,FALSE))","v":847},null,null,{"$f":"IF(AO10=\"\",\"\",AW10)","v":33},null,null,"TROLLER PAVEL",122,105,175,111,125,{"$f":"SUM(AO10:AS10)","v":638},175,{"$f":"SUM(AT10*1000)+AU10+0.46","v":638175.46},{"$f":"IF(AO10=\"\",\"\",RANK(AV10,AV6:AV65,0))","v":33},null,null,null,null,5,{"$f":"IF(BA6<5,\"\",VLOOKUP(5,AK6:AW65,4,FALSE))","v":"KRUPA JOSEF"},{"$f":"IF(BA6<5,\"\",VLOOKUP(5,AK6:AW65,10,FALSE))","v":891},null,null,{"$f":"IF(BK10=\"\",\"\",BS10)","v":44},null,null,"POSPÍŠIL LUKÁŠ",103,122,113,122,113,{"$f":"SUM(BK10:BO10)","v":573},122,{"$f":"SUM(BP10*1000)+BQ10+0.46","v":573122.46},{"$f":"IF(BK10=\"\",\"\",RANK(BR10,BR6:BR65,0))","v":44},null,null,null,null,null,null,5,{"$f":"IF(BY6<5,\"\",VLOOKUP(5,BG6:BS65,4,FALSE))","v":"STEJSKAL MARTIN"},{"$f":"IF(BY6<5,\"\",VLOOKUP(5,BG6:BS65,10,FALSE))","v":846},null,null,{"$f":"IF(CI10=\"\",\"\",CQ10)","v":2},null,null,"ŠAFAŘÍK LUDĚK",145,170,179,212,177,{"$f":"SUM(CI10:CM10)","v":883},212,{"$f":"SUM(CN10*1000)+CO10+0.46","v":883212.46},{"$f":"IF(CI10=\"\",\"\",RANK(CP10,CP6:CP65,0))","v":2},null,null,null,null,null,null,5,{"$f":"IF(CW6<5,\"\",VLOOKUP(5,CE6:CQ65,4,FALSE))","v":"CARVAN PAVEL"},{"$f":"IF(CW6<5,\"\",VLOOKUP(5,CE6:CQ65,10,FALSE))","v":842},null,null,{"$f":"IF(DG10=\"\",\"\",DO10)","v":30},null,null,"Carvan Pavel",114,110,156,172,131,{"$f":"SUM(DG10:DK10)","v":683},172,{"$f":"SUM(DL10*1000)+DM10+0.46","v":683172.46},{"$f":"IF(DG10=\"\",\"\",RANK(DN10,DN6:DN65,0))","v":30},null,null,null,null,null,null,5,{"$f":"IF(DU6<5,\"\",VLOOKUP(5,DC6:DO65,4,FALSE))","v":"Křápek Roman"},{"$f":"IF(DU6<5,\"\",VLOOKUP(5,DC6:DO65,10,FALSE))","v":834},null,null,{"$f":"IF(EE10=\"\",\"\",EM10)","v":45},null,null,"Tichý Hugo",131,103,138,93,132,{"$f":"SUM(EE10:EI10)","v":597},138,{"$f":"SUM(EJ10*1000)+EK10+0.46","v":597138.46},{"$f":"IF(EE10=\"\",\"\",RANK(EL10,EL6:EL65,0))","v":45},null,null,null,null,null,null,5,{"$f":"IF(ES6<5,\"\",VLOOKUP(5,EA6:EM65,4,FALSE))","v":"Ondřich František"},{"$f":"IF(ES6<5,\"\",VLOOKUP(5,EA6:EM65,10,FALSE))","v":863},null,null,{"$f":"IF(FC10=\"\",\"\",FK10)","v":20},null,null,"Troller Pavel",181,128,139,158,136,{"$f":"SUM(FC10:FG10)","v":742},181,{"$f":"SUM(FH10*1000)+FI10+0.46","v":742181.46},{"$f":"IF(FC10=\"\",\"\",RANK(FJ10,FJ6:FJ65,0))","v":20},null,null,null,null,null,null,5,{"$f":"IF(FQ6<5,\"\",VLOOKUP(5,EY6:FL65,4,FALSE))","v":"Kocůr Jaroslav"},{"$f":"IF(FQ6<5,\"\",VLOOKUP(5,EY6:FL65,10,FALSE))","v":850},null,null,{"$f":"IF(GA10=\"\",\"\",GI10)","v":""},null,null,null,null,null,null,null,null,{"$f":"SUM(GA10:GE10)","v":0},0,{"$f":"SUM(GF10*1000)+GG10+0.46","v":0.46},{"$f":"IF(GA10=\"\",\"\",RANK(GH10,GH6:GH70,0))","v":""},null,null,null,null,null,null,5,{"$f":"IF(GO6<5,\"\",VLOOKUP(5,FW6:GI70,4,FALSE))","v":""},{"$f":"IF(GO6<5,\"\",VLOOKUP(5,FW6:GI70,10,FALSE))","v":""}]
[null,"ŘEPY",null,"9.3.",null,null,null,null,null,null,null,null,null,null,null,null,null,null,{"$f":"SUM(S6:S10)","v":624},{"$f":"SUM(T6:T10)","v":672},{"$f":"SUM(U6:U10)","v":707},{"$f":"SUM(V6:V10)","v":636},{"$f":"SUM(W6:W10)","v":642},null,707,null,null,{"$f":"SUM(S11:W11)","v":3281},null,null,null,6,{"$f":"IF(AE6<6,\"\",VLOOKUP(6,O6:AA65,4,FALSE))","v":"VĚCHTÍK ANTONÍN"},{"$f":"IF(AE6<6,\"\",VLOOKUP(6,O6:AA65,10,FALSE))","v":830},null,null,null,null,null,null,{"$f":"SUM(AO6:AO10)","v":761},{"$f":"SUM(AP6:AP10)","v":700},{"$f":"SUM(AQ6:AQ10)","v":807},{"$f":"SUM(AR6:AR10)","v":708},{"$f":"SUM(AS6:AS10)","v":743},null,807,null,null,{"$f":"SUM(AO11:AS11)","v":3719},null,null,null,6,{"$f":"IF(BA6<6,\"\",VLOOKUP(6,AK6:AW65,4,FALSE))","v":"POSPÍŠIL VÁCLAV"},{"$f":"IF(BA6<6,\"\",VLOOKUP(6,AK6:AW65,10,FALSE))","v":876},null,null,null,null,null,null,{"$f":"SUM(BK6:BK10)","v":627},{"$f":"SUM(BL6:BL10)","v":781},{"$f":"SUM(BM6:BM10)","v":751},{"$f":"SUM(BN6:BN10)","v":746},{"$f":"SUM(BO6:BO10)","v":728},null,781,null,null,{"$f":"SUM(BK11:BO11)","v":3633},{"$f":"MAX(BK11:BO11)","v":781},{"$f":"IF(BK6=\"\",\"\",SUM(BT11*10000)+BU11)","v":36330781},null,null,null,6,{"$f":"IF(BY6<6,\"\",VLOOKUP(6,BG6:BS65,4,FALSE))","v":"MOTTL PAVEL"},{"$f":"IF(BY6<6,\"\",VLOOKUP(6,BG6:BS65,10,FALSE))","v":838},null,null,null,null,null,null,{"$f":"SUM(CI6:CI10)","v":651},{"$f":"SUM(CJ6:CJ10)","v":683},{"$f":"SUM(CK6:CK10)","v":699},{"$f":"SUM(CL6:CL10)","v":852},{"$f":"SUM(CM6:CM10)","v":679},null,852,null,null,{"$f":"SUM(CI11:CM11)","v":3564},{"$f":"MAX(CI11:CM11)","v":852},{"$f":"IF(CI6=\"\",\"\",SUM(CR11*1000)+CS11)","v":3564852},null,null,null,6,{"$f":"IF(CW6<6,\"\",VLOOKUP(6,CE6:CQ65,4,FALSE))","v":"SLADOVNÍK MILOSLAV"},{"$f":"IF(CW6<6,\"\",VLOOKUP(6,CE6:CQ65,10,FALSE))","v":842},null,null,null,null,null,null,{"$f":"SUM(DG6:DG10)","v":687},{"$f":"SUM(DH6:DH10)","v":772},{"$f":"SUM(DI6:DI10)","v":768},{"$f":"SUM(DJ6:DJ10)","v":681},{"$f":"SUM(DK6:DK10)","v":782},null,782,null,null,{"$f":"SUM(DG11:DK11)","v":3690},{"$f":"MAX(DG11:DK11)","v":782},{"$f":"IF(DG6=\"\",\"\",SUM(DP11*1000)+DQ11)","v":3690782},null,null,null,6,{"$f":"IF(DU6<6,\"\",VLOOKUP(6,DC6:DO65,4,FALSE))","v":"Podhola Martin"},{"$f":"IF(DU6<6,\"\",VLOOKUP(6,DC6:DO65,10,FALSE))","v":826},null,null,null,null,null,null,{"$f":"SUM(EE6:EE10)","v":647},{"$f":"SUM(EF6:EF10)","v":578},{"$f":"SUM(EG6:EG10)","v":675},{"$f":"SUM(EH6:EH10)","v":572},{"$f":"SUM(EI6:EI10)","v":634},null,675,null,null,{"$f":"SUM(EE11:EI11)","v":3106},{"$f":"MAX(EE11:EI11)","v":675},{"$f":"IF(EE6=\"\",\"\",SUM(EN11*1000)+EO11)","v":3106675},null,null,null,6,{"$f":"IF(ES6<6,\"\",VLOOKUP(6,EA6:EM65,4,FALSE))","v":"Pecka Jiří"},{"$f":"IF(ES6<6,\"\",VLOOKUP(6,EA6:EM65,10,FALSE))","v":854},null,null,null,null,null,null,{"$f":"SUM(FC6:FC10)","v":806},{"$f":"SUM(FD6:FD10)","v":746},{"$f":"SUM(FE6:FE10)","v":798},{"$f":"SUM(FF6:FF10)","v":732},{"$f":"SUM(FG6:FG10)","v":786},null,806,null,null,{"$f":"SUM(FC11:FG11)","v":3868},{"$f":"MAX(FC11:FG11)","v":806},{"$f":"IF(FC6=\"\",\"\",SUM(FL11*1000)+FM11)","v":3868806},null,null,null,6,{"$f":"IF(FQ6<6,\"\",VLOOKUP(6,EY6:FL65,4,FALSE))","v":"Pospíšil Václav"},{"$f":"IF(FQ6<6,\"\",VLOOKUP(6,EY6:FL65,10,FALSE))","v":844},null,null,null,null,null,null,{"$f":"SUM(GA6:GA10)","v":1},{"$f":"SUM(GB6:GB10)","v":1},{"$f":"SUM(GC6:GC10)","v":1},{"$f":"SUM(GD6:GD10)","v":0},{"$f":"SUM(GE6:GE10)","v":0},null,1,null,null,{"$f":"SUM(GA11:GE11)","v":3},{"$f":"MAX(GA11:GE11)","v":1},{"$f":"IF(GA6=\"\",\"\",SUM(GJ11*1000)+GK11)","v":3001},null,null,null,6,{"$f":"IF(GO6<6,\"\",VLOOKUP(6,FW6:GI70,4,FALSE))","v":""},{"$f":"IF(GO6<6,\"\",VLOOKUP(6,FW6:GI70,10,FALSE))","v":""}]
[null,null,null,null,null,null,null,null,null,null,null,null,null,null,{"$f":"IF(S12=\"\",\"\",AA12)","v":15},2,"ŘEPY II.","KOCŮR JAROSLAV",146,137,143,185,133,{"$f":"SUM(S12:W12)","v":744},185,{"$f":"SUM(X12*1000)+Y12+0.45","v":744185.45},{"$f":"IF(S12=\"\",\"\",RANK(Z12,Z6:Z65,0))","v":15},null,{"$f":"RANK(AB17,AB11:AB65,0)","v":3},null,null,7,{"$f":"IF(AE6<7,\"\",VLOOKUP(7,O6:AA65,4,FALSE))","v":"TOMÁŠEK ZDENĚK"},{"$f":"IF(AE6<7,\"\",VLOOKUP(7,O6:AA65,10,FALSE))","v":825},null,null,{"$f":"IF(AO12=\"\",\"\",AW12)","v":47},2,"KLÍČOV II.","TÁBORSKÝ FRANTIŠEK",109,119,123,112,100,{"$f":"SUM(AO12:AS12)","v":563},123,{"$f":"SUM(AT12*1000)+AU12+0.45","v":563123.44999999995},{"$f":"IF(AO12=\"\",\"\",RANK(AV12,AV6:AV65,0))","v":47},null,{"$f":"RANK(AX17,AX11:AX65,0)","v":8},null,null,7,{"$f":"IF(BA6<7,\"\",VLOOKUP(7,AK6:AW65,4,FALSE))","v":"CARVAN PAVEL"},{"$f":"IF(BA6<7,\"\",VLOOKUP(7,AK6:AW65,10,FALSE))","v":860},null,null,{"$f":"IF(BK12=\"\",\"\",BS12)","v":40},2,"VRŠOVICEII.","AUNICKÝ FRANTIŠEK",125,126,123,126,105,{"$f":"SUM(BK12:BO12)","v":605},126,{"$f":"SUM(BP12*1000)+BQ12+0.45","v":605126.44999999995},{"$f":"IF(BK12=\"\",\"\",RANK(BR12,BR6:BR65,0))","v":40},null,null,null,{"$f":"IF(BK12=\"\",\"\",RANK(BV17,BV11:BV65,0))","v":8},null,null,7,{"$f":"IF(BY6<7,\"\",VLOOKUP(7,BG6:BS65,4,FALSE))","v":"PECKA JIŘÍ"},{"$f":"IF(BY6<7,\"\",VLOOKUP(7,BG6:BS65,10,FALSE))","v":831},null,null,{"$f":"IF(CI12=\"\",\"\",CQ12)","v":47},2,"HOSTIVAŘ II.","KALOŠOVÁ DAGMAR",102,69,105,126,131,{"$f":"SUM(CI12:CM12)","v":533},131,{"$f":"SUM(CN12*1000)+CO12+0.45","v":533131.44999999995},{"$f":"IF(CI12=\"\",\"\",RANK(CP12,CP6:CP65,0))","v":47},null,null,null,{"$f":"IF(CI12=\"\",\"\",RANK(CT17,CT11:CT65,0))","v":9},null,null,7,{"$f":"IF(CW6<7,\"\",VLOOKUP(7,CE6:CQ65,4,FALSE))","v":"GERMAN MILAN"},{"$f":"IF(CW6<7,\"\",VLOOKUP(7,CE6:CQ65,10,FALSE))","v":840},null,null,{"$f":"IF(DG12=\"\",\"\",DO12)","v":34},2,"KAČEROV II.","Douša Adam",149,112,113,135,160,{"$f":"SUM(DG12:DK12)","v":669},160,{"$f":"SUM(DL12*1000)+DM12+0.45","v":669160.44999999995},{"$f":"IF(DG12=\"\",\"\",RANK(DN12,DN6:DN65,0))","v":34},null,null,null,{"$f":"IF(DG12=\"\",\"\",RANK(DR17,DR11:DR65,0))","v":8},null,null,7,{"$f":"IF(DU6<7,\"\",VLOOKUP(7,DC6:DO65,4,FALSE))","v":"Kalfiřt Petr"},{"$f":"IF(DU6<7,\"\",VLOOKUP(7,DC6:DO65,10,FALSE))","v":822},null,null,{"$f":"IF(EE12=\"\",\"\",EM12)","v":4},2,"ŘEPY II.","Kocúr Jaroslav",167,160,167,203,192,{"$f":"SUM(EE12:EI12)","v":889},203,{"$f":"SUM(EJ12*1000)+EK12+0.45","v":889203.45},{"$f":"IF(EE12=\"\",\"\",RANK(EL12,EL6:EL65,0))","v":4},null,null,null,{"$f":"IF(EE12=\"\",\"\",RANK(EP17,EP11:EP65,0))","v":1},null,null,7,{"$f":"IF(ES6<7,\"\",VLOOKUP(7,EA6:EM65,4,FALSE))","v":"Krupa Jozef"},{"$f":"IF(ES6<7,\"\",VLOOKUP(7,EA6:EM65,10,FALSE))","v":847},null,null,{"$f":"IF(FC12=\"\",\"\",FK12)","v":37},2,"KLÍČOV II.","Štěpán Radek",123,132,103,134,150,{"$f":"SUM(FC12:FG12)","v":642},150,{"$f":"SUM(FH12*1000)+FI12+0.45","v":642150.44999999995},{"$f":"IF(FC12=\"\",\"\",RANK(FJ12,FJ6:FJ65,0))","v":37},null,null,null,{"$f":"IF(FC12=\"\",\"\",RANK(FN17,FN11:FN65,0))","v":9},null,null,7,{"$f":"IF(FQ6<7,\"\",VLOOKUP(7,EY6:FL65,4,FALSE))","v":"Šafařík Luděk"},{"$f":"IF(FQ6<7,\"\",VLOOKUP(7,EY6:FL65,10,FALSE))","v":833},null,null,{"$f":"IF(GA12=\"\",\"\",GI12)","v":2},2,"ŘEPY II.",null,2,1,null,null,null,{"$f":"SUM(GA12:GE12)","v":3},2,{"$f":"SUM(GF12*1000)+GG12+0.45","v":3002.45},{"$f":"IF(GA12=\"\",\"\",RANK(GH12,GH6:GH70,0))","v":2},null,null,null,{"$f":"IF(GA12=\"\",\"\",RANK(GL17,GL11:GL71,0))","v":2},null,null,7,{"$f":"IF(GO6<7,\"\",VLOOKUP(7,FW6:GI70,4,FALSE))","v":""},{"$f":"IF(GO6<7,\"\",VLOOKUP(7,FW6:GI70,10,FALSE))","v":""}]
[null,"HOSTIVAŘ",null,"27.4.",null,null,null,null,null,null,null,null,null,null,{"$f":"IF(S13=\"\",\"\",AA13)","v":27},null,null,"MOTTL PAVEL",143,117,137,138,129,{"$f":"SUM(S13:W13)","v":664},143,{"$f":"SUM(X13*1000)+Y13+0.44","v":664143.43999999994},{"$f":"IF(S13=\"\",\"\",RANK(Z13,Z6:Z65,0))","v":27},null,null,null,null,8,{"$f":"IF(AE6<8,\"\",VLOOKUP(8,O6:AA65,4,FALSE))","v":"PECKA JIŘÍ"},{"$f":"IF(AE6<8,\"\",VLOOKUP(8,O6:AA65,10,FALSE))","v":814},null,null,{"$f":"IF(AO13=\"\",\"\",AW13)","v":35},null,null,"NOVOTNÁ PETRA",123,123,135,141,114,{"$f":"SUM(AO13:AS13)","v":636},141,{"$f":"SUM(AT13*1000)+AU13+0.44","v":636141.43999999994},{"$f":"IF(AO13=\"\",\"\",RANK(AV13,AV6:AV65,0))","v":35},null,null,null,null,8,{"$f":"IF(BA6<8,\"\",VLOOKUP(8,AK6:AW65,4,FALSE))","v":"NOVOTNÝ LUKÁŠ"},{"$f":"IF(BA6<8,\"\",VLOOKUP(8,AK6:AW65,10,FALSE))","v":833},null,null,{"$f":"IF(BK13=\"\",\"\",BS13)","v":32},null,null,"KAZDA JAN",170,136,138,121,111,{"$f":"SUM(BK13:BO13)","v":676},170,{"$f":"SUM(BP13*1000)+BQ13+0.44","v":676170.44},{"$f":"IF(BK13=\"\",\"\",RANK(BR13,BR6:BR65,0))","v":32},null,null,null,null,null,null,8,{"$f":"IF(BY6<8,\"\",VLOOKUP(8,BG6:BS65,4,FALSE))","v":"LAZUR VLADIMÍR"},{"$f":"IF(BY6<8,\"\",VLOOKUP(8,BG6:BS65,10,FALSE))","v":831},null,null,{"$f":"IF(CI13=\"\",\"\",CQ13)","v":48},null,null,"BERGEROVÁ MARCELA",98,106,118,82,107,{"$f":"SUM(CI13:CM13)","v":511},118,{"$f":"SUM(CN13*1000)+CO13+0.44","v":511118.44},{"$f":"IF(CI13=\"\",\"\",RANK(CP13,CP6:CP65,0))","v":48},null,null,null,null,null,null,8,{"$f":"IF(CW6<8,\"\",VLOOKUP(8,CE6:CQ65,4,FALSE))","v":"KALFIŘT PETR"},{"$f":"IF(CW6<8,\"\",VLOOKUP(8,CE6:CQ65,10,FALSE))","v":807},null,null,{"$f":"IF(DG13=\"\",\"\",DO13)","v":46},null,null,"Katolický Zdenek",99,119,109,116,114,{"$f":"SUM(DG13:DK13)","v":557},119,{"$f":"SUM(DL13*1000)+DM13+0.44","v":557119.43999999994},{"$f":"IF(DG13=\"\",\"\",RANK(DN13,DN6:DN65,0))","v":46},null,null,null,null,null,null,8,{"$f":"IF(DU6<8,\"\",VLOOKUP(8,DC6:DO65,4,FALSE))","v":"Šafařík Luděk"},{"$f":"IF(DU6<8,\"\",VLOOKUP(8,DC6:DO65,10,FALSE))","v":805},null,null,{"$f":"IF(EE13=\"\",\"\",EM13)","v":10},null,null,"Alba Vladimír",188,162,127,195,142,{"$f":"SUM(EE13:EI13)","v":814},195,{"$f":"SUM(EJ13*1000)+EK13+0.44","v":814195.44},{"$f":"IF(EE13=\"\",\"\",RANK(EL13,EL6:EL65,0))","v":10},null,null,null,null,null,null,8,{"$f":"IF(ES6<8,\"\",VLOOKUP(8,EA6:EM65,4,FALSE))","v":"Pospíšil Václav"},{"$f":"IF(ES6<8,\"\",VLOOKUP(8,EA6:EM65,10,FALSE))","v":834},null,null,{"$f":"IF(FC13=\"\",\"\",FK13)","v":49},null,null,"Táborský František",119,128,111,92,94,{"$f":"SUM(FC13:FG13)","v":544},128,{"$f":"SUM(FH13*1000)+FI13+0.44","v":544128.43999999994},{"$f":"IF(FC13=\"\",\"\",RANK(FJ13,FJ6:FJ65,0))","v":49},null,null,null,null,null,null,8,{"$f":"IF(FQ6<8,\"\",VLOOKUP(8,EY6:FL65,4,FALSE))","v":"Jelínek Jan"},{"$f":"IF(FQ6<8,\"\",VLOOKUP(8,EY6:FL65,10,FALSE))","v":816},null,null,{"$f":"IF(GA13=\"\",\"\",GI13)","v":""},null,null,null,null,null,null,null,null,{"$f":"SUM(GA13:GE13)","v":0},0,{"$f":"SUM(GF13*1000)+GG13+0.44","v":0.44},{"$f":"IF(GA13=\"\",\"\",RANK(GH13,GH6:GH70,0))","v":""},null,null,null,null,null,null,8,{"$f":"IF(GO6<8,\"\",VLOOKUP(8,FW6:GI70,4,FALSE))","v":""},{"$f":"IF(GO6<8,\"\",VLOOKUP(8,FW6:GI70,10,FALSE))","v":""}]
[null,null,null,null,null,null,null,null,null,null,null,null,null,null,{"$f":"IF(S14=\"\",\"\",AA14)","v":12},null,null,"ALBA VLADIMÍR",171,125,154,156,171,{"$f":"SUM(S14:W14)","v":777},171,{"$f":"SUM(X14*1000)+Y14+0.43","v":777171.43},{"$f":"IF(S14=\"\",\"\",RANK(Z14,Z6:Z65,0))","v":12},null,null,null,null,9,{"$f":"IF(AE6<9,\"\",VLOOKUP(9,O6:AA65,4,FALSE))","v":"KRUPA JOZEF"},{"$f":"IF(AE6<9,\"\",VLOOKUP(9,O6:AA65,10,FALSE))","v":799},null,null,{"$f":"IF(AO14=\"\",\"\",AW14)","v":28},null,null,"LOKVENC JIŘÍ",133,138,139,150,126,{"$f":"SUM(AO14:AS14)","v":686},150,{"$f":"SUM(AT14*1000)+AU14+0.43","v":686150.43},{"$f":"IF(AO14=\"\",\"\",RANK(AV14,AV6:AV65,0))","v":28},null,null,null,null,9,{"$f":"IF(BA6<9,\"\",VLOOKUP(9,AK6:AW65,4,FALSE))","v":"PECKA JIŘÍ"},{"$f":"IF(BA6<9,\"\",VLOOKUP(9,AK6:AW65,10,FALSE))","v":831},null,null,{"$f":"IF(BK14=\"\",\"\",BS14)","v":33},null,null,"BOŠEK JAN",118,130,124,177,124,{"$f":"SUM(BK14:BO14)","v":673},177,{"$f":"SUM(BP14*1000)+BQ14+0.43","v":673177.43},{"$f":"IF(BK14=\"\",\"\",RANK(BR14,BR6:BR65,0))","v":33},null,null,null,null,null,null,9,{"$f":"IF(BY6<9,\"\",VLOOKUP(9,BG6:BS65,4,FALSE))","v":"PODHOLA MARTIN"},{"$f":"IF(BY6<9,\"\",VLOOKUP(9,BG6:BS65,10,FALSE))","v":824},null,null,{"$f":"IF(CI14=\"\",\"\",CQ14)","v":34},null,null,"ČERMÁK TOMÁŠ",117,125,132,143,114,{"$f":"SUM(CI14:CM14)","v":631},143,{"$f":"SUM(CN14*1000)+CO14+0.43","v":631143.43000000005},{"$f":"IF(CI14=\"\",\"\",RANK(CP14,CP6:CP65,0))","v":34},null,null,null,null,null,null,9,{"$f":"IF(CW6<9,\"\",VLOOKUP(9,CE6:CQ65,4,FALSE))","v":"KROČIL TOMÁŠ"},{"$f":"IF(CW6<9,\"\",VLOOKUP(9,CE6:CQ65,10,FALSE))","v":791},null,null,{"$f":"IF(DG14=\"\",\"\",DO14)","v":22},null,null,"Brejcha Jaroslav",126,130,135,140,187,{"$f":"SUM(DG14:DK14)","v":718},187,{"$f":"SUM(DL14*1000)+DM14+0.43","v":718187.43},{"$f":"IF(DG14=\"\",\"\",RANK(DN14,DN6:DN65,0))","v":22},null,null,null,null,null,null,9,{"$f":"IF(DU6<9,\"\",VLOOKUP(9,DC6:DO65,4,FALSE))","v":"Kročil Tomáš"},{"$f":"IF(DU6<9,\"\",VLOOKUP(9,DC6:DO65,10,FALSE))","v":802},null,null,{"$f":"IF(EE14=\"\",\"\",EM14)","v":12},null,null,"Froněk Martin",161,160,150,151,156,{"$f":"SUM(EE14:EI14)","v":778},161,{"$f":"SUM(EJ14*1000)+EK14+0.43","v":778161.43},{"$f":"IF(EE14=\"\",\"\",RANK(EL14,EL6:EL65,0))","v":12},null,null,null,null,null,null,9,{"$f":"IF(ES6<9,\"\",VLOOKUP(9,EA6:EM65,4,FALSE))","v":"Holkup Jan"},{"$f":"IF(ES6<9,\"\",VLOOKUP(9,EA6:EM65,10,FALSE))","v":823},null,null,{"$f":"IF(FC14=\"\",\"\",FK14)","v":24},null,null,"Táborský Lukáš",137,108,176,147,129,{"$f":"SUM(FC14:FG14)","v":697},176,{"$f":"SUM(FH14*1000)+FI14+0.43","v":697176.43},{"$f":"IF(FC14=\"\",\"\",RANK(FJ14,FJ6:FJ65,0))","v":24},null,null,null,null,null,null,9,{"$f":"IF(FQ6<9,\"\",VLOOKUP(9,EY6:FL65,4,FALSE))","v":"Carvan Pavel"},{"$f":"IF(FQ6<9,\"\",VLOOKUP(9,EY6:FL65,10,FALSE))","v":810},null,null,{"$f":"IF(GA14=\"\",\"\",GI14)","v":""},null,null,null,null,null,null,null,null,{"$f":"SUM(GA14:GE14)","v":0},0,{"$f":"SUM(GF14*1000)+GG14+0.43","v":0.43},{"$f":"IF(GA14=\"\",\"\",RANK(GH14,GH6:GH70,0))","v":""},null,null,null,null,null,null,9,{"$f":"IF(GO6<9,\"\",VLOOKUP(9,FW6:GI70,4,FALSE))","v":""},{"$f":"IF(GO6<9,\"\",VLOOKUP(9,FW6:GI70,10,FALSE))","v":""}]
[null,"KAČEROV",null,"12.10.",null,null,null,null,null,null,null,null,null,null,{"$f":"IF(S15=\"\",\"\",AA15)","v":11},null,null,"KROČIL TOMÁŠ",144,169,188,124,161,{"$f":"SUM(S15:W15)","v":786},188,{"$f":"SUM(X15*1000)+Y15+0.42","v":786188.42},{"$f":"IF(S15=\"\",\"\",RANK(Z15,Z6:Z65,0))","v":11},null,null,null,null,10,{"$f":"IF(AE6<10,\"\",VLOOKUP(10,O6:AA65,4,FALSE))","v":"ONDŘICH FRANTIŠEK"},{"$f":"IF(AE6<10,\"\",VLOOKUP(10,O6:AA65,10,FALSE))","v":796},null,null,{"$f":"IF(AO15=\"\",\"\",AW15)","v":46},null,null,"ŘEHÁK JAROSLAV",135,121,81,133,103,{"$f":"SUM(AO15:AS15)","v":573},135,{"$f":"SUM(AT15*1000)+AU15+0.42","v":573135.42000000004},{"$f":"IF(AO15=\"\",\"\",RANK(AV15,AV6:AV65,0))","v":46},null,null,null,null,10,{"$f":"IF(BA6<10,\"\",VLOOKUP(10,AK6:AW65,4,FALSE))","v":"MAŠÁT PETR"},{"$f":"IF(BA6<10,\"\",VLOOKUP(10,AK6:AW65,10,FALSE))","v":826},null,null,{"$f":"IF(BK15=\"\",\"\",BS15)","v":39},null,null,"FAY VLASTIMIL",121,130,134,121,105,{"$f":"SUM(BK15:BO15)","v":611},134,{"$f":"SUM(BP15*1000)+BQ15+0.42","v":611134.42000000004},{"$f":"IF(BK15=\"\",\"\",RANK(BR15,BR6:BR65,0))","v":39},null,null,null,null,null,null,10,{"$f":"IF(BY6<10,\"\",VLOOKUP(10,BG6:BS65,4,FALSE))","v":"POSPÍŠIL VÁCLAV"},{"$f":"IF(BY6<10,\"\",VLOOKUP(10,BG6:BS65,10,FALSE))","v":814},null,null,{"$f":"IF(CI15=\"\",\"\",CQ15)","v":33},null,null,"ŠAFÁŘ LADISLAV",124,127,139,140,102,{"$f":"SUM(CI15:CM15)","v":632},140,{"$f":"SUM(CN15*1000)+CO15+0.42","v":632140.42000000004},{"$f":"IF(CI15=\"\",\"\",RANK(CP15,CP6:CP65,0))","v":33},null,null,null,null,null,null,10,{"$f":"IF(CW6<10,\"\",VLOOKUP(10,CE6:CQ65,4,FALSE))","v":"DOUŠA ADAM"},{"$f":"IF(CW6<10,\"\",VLOOKUP(10,CE6:CQ65,10,FALSE))","v":785},null,null,{"$f":"IF(DG15=\"\",\"\",DO15)","v":33},null,null,"Kutina Pavel",138,124,143,135,136,{"$f":"SUM(DG15:DK15)","v":676},143,{"$f":"SUM(DL15*1000)+DM15+0.42","v":676143.42},{"$f":"IF(DG15=\"\",\"\",RANK(DN15,DN6:DN65,0))","v":33},null,null,null,null,null,null,10,{"$f":"IF(DU6<10,\"\",VLOOKUP(10,DC6:DO65,4,FALSE))","v":"Křemenák Petr"},{"$f":"IF(DU6<10,\"\",VLOOKUP(10,DC6:DO65,10,FALSE))","v":801},null,null,{"$f":"IF(EE15=\"\",\"\",EM15)","v":18},null,null,"Kročil Tomáš",132,147,147,163,139,{"$f":"SUM(EE15:EI15)","v":728},163,{"$f":"SUM(EJ15*1000)+EK15+0.42","v":728163.42},{"$f":"IF(EE15=\"\",\"\",RANK(EL15,EL6:EL65,0))","v":18},null,null,null,null,null,null,10,{"$f":"IF(ES6<10,\"\",VLOOKUP(10,EA6:EM65,4,FALSE))","v":"Alba Vladimír"},{"$f":"IF(ES6<10,\"\",VLOOKUP(10,EA6:EM65,10,FALSE))","v":814},null,null,{"$f":"IF(FC15=\"\",\"\",FK15)","v":39},null,null,"Pipek Pavel",104,117,155,178,78,{"$f":"SUM(FC15:FG15)","v":632},178,{"$f":"SUM(FH15*1000)+FI15+0.42","v":632178.42000000004},{"$f":"IF(FC15=\"\",\"\",RANK(FJ15,FJ6:FJ694,0))","v":39},null,null,null,null,null,null,10,{"$f":"IF(FQ6<10,\"\",VLOOKUP(10,EY6:FL65,4,FALSE))","v":"Ondřich František"},{"$f":"IF(FQ6<10,\"\",VLOOKUP(10,EY6:FL65,10,FALSE))","v":809},null,null,{"$f":"IF(GA15=\"\",\"\",GI15)","v":""},null,null,null,null,null,null,null,null,{"$f":"SUM(GA15:GE15)","v":0},0,{"$f":"SUM(GF15*1000)+GG15+0.42","v":0.42},{"$f":"IF(GA15=\"\",\"\",RANK(GH15,GH6:GH700,0))","v":""},null,null,null,null,null,null,10,{"$f":"IF(GO6<10,\"\",VLOOKUP(10,FW6:GI70,4,FALSE))","v":""},{"$f":"IF(GO6<10,\"\",VLOOKUP(10,FW6:GI70,10,FALSE))","v":""}]
[null,null,null,null,null,null,null,null,null,"jednotlivci",null,null,null,null,{"$f":"IF(S16=\"\",\"\",AA16)","v":3},null,null,"POSPÍŠIL VÁCLAV",192,188,205,140,156,{"$f":"SUM(S16:W16)","v":881},205,{"$f":"SUM(X16*1000)+Y16+0.41","v":881205.41},{"$f":"IF(S16=\"\",\"\",RANK(Z16,Z6:Z65,0))","v":3},null,null,null,null,11,{"$f":"IF(AE6<11,\"\",VLOOKUP(11,O6:AA65,4,FALSE))","v":"KROČIL TOMÁŠ"},{"$f":"IF(AE6<11,\"\",VLOOKUP(11,O6:AA65,10,FALSE))","v":786},null,null,{"$f":"IF(AO16=\"\",\"\",AW16)","v":17},null,null,"ŠAFÁŘ BOHUMIL",154,154,135,149,159,{"$f":"SUM(AO16:AS16)","v":751},159,{"$f":"SUM(AT16*1000)+AU16+0.41","v":751159.41},{"$f":"IF(AO16=\"\",\"\",RANK(AV16,AV6:AV65,0))","v":17},null,null,null,null,11,{"$f":"IF(BA6<11,\"\",VLOOKUP(11,AK6:AW65,4,FALSE))","v":"ONDŘICH FRANTIŠEK"},{"$f":"IF(BA6<11,\"\",VLOOKUP(11,AK6:AW65,10,FALSE))","v":815},null,null,{"$f":"IF(BK16=\"\",\"\",BS16)","v":22},null,null,"KOVÁŘ JAROSLAV",158,153,113,133,169,{"$f":"SUM(BK16:BO16)","v":726},169,{"$f":"SUM(BP16*1000)+BQ16+0.41","v":726169.41},{"$f":"IF(BK16=\"\",\"\",RANK(BR16,BR6:BR65,0))","v":22},null,null,null,null,null,null,11,{"$f":"IF(BY6<11,\"\",VLOOKUP(11,BG6:BS65,4,FALSE))","v":"SKRUŽNÁ PAVLA"},{"$f":"IF(BY6<11,\"\",VLOOKUP(11,BG6:BS65,10,FALSE))","v":811},null,null,{"$f":"IF(CI16=\"\",\"\",CQ16)","v":49},null,null,"SVÍTIL PAVEL",82,117,66,129,96,{"$f":"SUM(CI16:CM16)","v":490},129,{"$f":"SUM(CN16*1000)+CO16+0.41","v":490129.41},{"$f":"IF(CI16=\"\",\"\",RANK(CP16,CP6:CP65,0))","v":49},null,null,null,null,null,null,11,{"$f":"IF(CW6<11,\"\",VLOOKUP(11,CE6:CQ65,4,FALSE))","v":"ŠTĚPÁN RADEK"},{"$f":"IF(CW6<11,\"\",VLOOKUP(11,CE6:CQ65,10,FALSE))","v":779},null,null,{"$f":"IF(DG16=\"\",\"\",DO16)","v":24},null,null,"Radová Petra",150,128,135,161,143,{"$f":"SUM(DG16:DK16)","v":717},161,{"$f":"SUM(DL16*1000)+DM16+0.41","v":717161.41},{"$f":"IF(DG16=\"\",\"\",RANK(DN16,DN6:DN65,0))","v":24},null,null,null,null,null,null,11,{"$f":"IF(DU6<11,\"\",VLOOKUP(11,DC6:DO65,4,FALSE))","v":"Skružná Pavla"},{"$f":"IF(DU6<11,\"\",VLOOKUP(11,DC6:DO65,10,FALSE))","v":795},null,null,{"$f":"IF(EE16=\"\",\"\",EM16)","v":8},null,null,"Pospíšil Václav",180,146,177,181,150,{"$f":"SUM(EE16:EI16)","v":834},181,{"$f":"SUM(EJ16*1000)+EK16+0.41","v":834181.41},{"$f":"IF(EE16=\"\",\"\",RANK(EL16,EL6:EL65,0))","v":8},null,null,null,null,null,null,11,{"$f":"IF(ES6<11,\"\",VLOOKUP(11,EA6:EM65,4,FALSE))","v":"Novotný Lukáš"},{"$f":"IF(ES6<11,\"\",VLOOKUP(11,EA6:EM65,10,FALSE))","v":814},null,null,{"$f":"IF(FC16=\"\",\"\",FK16)","v":46},null,null,"Pelikán Stanislav",113,109,163,98,95,{"$f":"SUM(FC16:FG16)","v":578},163,{"$f":"SUM(FH16*1000)+FI16+0.41","v":578163.41},{"$f":"IF(FC16=\"\",\"\",RANK(FJ16,FJ6:FJ65,0))","v":46},null,null,null,null,null,null,11,{"$f":"IF(FQ6<11,\"\",VLOOKUP(11,EY6:FL65,4,FALSE))","v":"Hübner Jiří"},{"$f":"IF(FQ6<11,\"\",VLOOKUP(11,EY6:FL65,10,FALSE))","v":803},null,null,{"$f":"IF(GA16=\"\",\"\",GI16)","v":""},null,null,null,null,null,null,null,null,{"$f":"SUM(GA16:GE16)","v":0},0,{"$f":"SUM(GF16*1000)+GG16+0.41","v":0.41},{"$f":"IF(GA16=\"\",\"\",RANK(GH16,GH6:GH70,0))","v":""},null,null,null,null,null,null,11,{"$f":"IF(GO6<11,\"\",VLOOKUP(11,FW6:GI70,4,FALSE))","v":""},{"$f":"IF(GO6<11,\"\",VLOOKUP(11,FW6:GI70,10,FALSE))","v":""}]
[null,"VRŠOVICE",null,"9.11.",null,null,null,null,null,null,null,null,null,null,null,null,null,null,{"$f":"SUM(S12:S16)","v":796},{"$f":"SUM(T12:T16)","v":736},{"$f":"SUM(U12:U16)","v":827},{"$f":"SUM(V12:V16)","v":743},{"$f":"SUM(W12:W16)","v":750},null,null,null,null,{"$f":"SUM(S17:W17)","v":3852},null,null,null,12,{"$f":"IF(AE6<12,\"\",VLOOKUP(12,O6:AA65,4,FALSE))","v":"ALBA VLADIMÍR"},{"$f":"IF(AE6<12,\"\",VLOOKUP(12,O6:AA65,10,FALSE))","v":777},null,null,null,null,null,null,{"$f":"SUM(AO12:AO16)","v":654},{"$f":"SUM(AP12:AP16)","v":655},{"$f":"SUM(AQ12:AQ16)","v":613},{"$f":"SUM(AR12:AR16)","v":685},{"$f":"SUM(AS12:AS16)","v":602},null,null,null,null,{"$f":"SUM(AO17:AS17)","v":3209},null,null,null,12,{"$f":"IF(BA6<12,\"\",VLOOKUP(12,AK6:AW65,4,FALSE))","v":"KROČIL TOMÁŠ"},{"$f":"IF(BA6<12,\"\",VLOOKUP(12,AK6:AW65,10,FALSE))","v":806},null,null,null,null,null,null,{"$f":"SUM(BK12:BK16)","v":692},{"$f":"SUM(BL12:BL16)","v":675},{"$f":"SUM(BM12:BM16)","v":632},{"$f":"SUM(BN12:BN16)","v":678},{"$f":"SUM(BO12:BO16)","v":614},null,null,null,null,{"$f":"SUM(BK17:BO17)","v":3291},{"$f":"MAX(BK17:BO17)","v":692},{"$f":"IF(BK12=\"\",\"\",SUM(BT17*10000)+BU17)","v":32910692},null,null,null,12,{"$f":"IF(BY6<12,\"\",VLOOKUP(12,BG6:BS65,4,FALSE))","v":"NOVOTNÝ LUKÁŠ"},{"$f":"IF(BY6<12,\"\",VLOOKUP(12,BG6:BS65,10,FALSE))","v":793},null,null,null,null,null,null,{"$f":"SUM(CI12:CI16)","v":523},{"$f":"SUM(CJ12:CJ16)","v":544},{"$f":"SUM(CK12:CK16)","v":560},{"$f":"SUM(CL12:CL16)","v":620},{"$f":"SUM(CM12:CM16)","v":550},null,null,null,null,{"$f":"SUM(CI17:CM17)","v":2797},{"$f":"MAX(CI17:CM17)","v":620},{"$f":"IF(CI12=\"\",\"\",SUM(CR17*1000)+CS17)","v":2797620},null,null,null,12,{"$f":"IF(CW6<12,\"\",VLOOKUP(12,CE6:CQ65,4,FALSE))","v":"MOTTL PAVEL"},{"$f":"IF(CW6<12,\"\",VLOOKUP(12,CE6:CQ65,10,FALSE))","v":773},null,null,null,null,null,null,{"$f":"SUM(DG12:DG16)","v":662},{"$f":"SUM(DH12:DH16)","v":613},{"$f":"SUM(DI12:DI16)","v":635},{"$f":"SUM(DJ12:DJ16)","v":687},{"$f":"SUM(DK12:DK16)","v":740},null,null,null,null,{"$f":"SUM(DG17:DK17)","v":3337},{"$f":"MAX(DG17:DK17)","v":740},{"$f":"IF(DG12=\"\",\"\",SUM(DP17*1000)+DQ17)","v":3337740},null,null,null,12,{"$f":"IF(DU6<12,\"\",VLOOKUP(12,DC6:DO65,4,FALSE))","v":"Lazur Vladimír"},{"$f":"IF(DU6<12,\"\",VLOOKUP(12,DC6:DO65,10,FALSE))","v":794},null,null,null,null,null,null,{"$f":"SUM(EE12:EE16)","v":828},{"$f":"SUM(EF12:EF16)","v":775},{"$f":"SUM(EG12:EG16)","v":768},{"$f":"SUM(EH12:EH16)","v":893},{"$f":"SUM(EI12:EI16)","v":779},null,null,null,null,{"$f":"SUM(EE17:EI17)","v":4043},{"$f":"MAX(EE17:EI17)","v":893},{"$f":"IF(EE12=\"\",\"\",SUM(EN17*1000)+EO17)","v":4043893},null,null,null,12,{"$f":"IF(ES6<12,\"\",VLOOKUP(12,EA6:EM65,4,FALSE))","v":"Froněk Martin"},{"$f":"IF(ES6<12,\"\",VLOOKUP(12,EA6:EM65,10,FALSE))","v":778},null,null,null,null,null,null,{"$f":"SUM(FC12:FC16)","v":596},{"$f":"SUM(FD12:FD16)","v":594},{"$f":"SUM(FE12:FE16)","v":708},{"$f":"SUM(FF12:FF16)","v":649},{"$f":"SUM(FG12:FG16)","v":546},null,null,null,null,{"$f":"SUM(FC17:FG17)","v":3093},{"$f":"MAX(FC17:FG17)","v":708},{"$f":"IF(FC12=\"\",\"\",SUM(FL17*1000)+FM17)","v":3093708},null,null,null,12,{"$f":"IF(FQ6<12,\"\",VLOOKUP(12,EY6:FL65,4,FALSE))","v":"Holkup Jan"},{"$f":"IF(FQ6<12,\"\",VLOOKUP(12,EY6:FL65,10,FALSE))","v":802},null,null,null,null,null,null,{"$f":"SUM(GA12:GA16)","v":2},{"$f":"SUM(GB12:GB16)","v":1},{"$f":"SUM(GC12:GC16)","v":0},{"$f":"SUM(GD12:GD16)","v":0},{"$f":"SUM(GE12:GE16)","v":0},null,null,null,null,{"$f":"SUM(GA17:GE17)","v":3},{"$f":"MAX(GA17:GE17)","v":2},{"$f":"IF(GA12=\"\",\"\",SUM(GJ17*1000)+GK17)","v":3002},null,null,null,12,{"$f":"IF(GO6<12,\"\",VLOOKUP(12,FW6:GI70,4,FALSE))","v":""},{"$f":"IF(GO6<12,\"\",VLOOKUP(12,FW6:GI70,10,FALSE))","v":""}]
[null,null,null,null,null,null,null,null,null,null,null,null,null,null,{"$f":"IF(S18=\"\",\"\",AA18)","v":17},3,"KAČEROV I.","HÜBNER JIŘÍ",113,170,137,158,159,{"$f":"SUM(S18:W18)","v":737},{"$f":"MAX(S18:W18)","v":170},{"$f":"SUM(X18*1000)+Y18+0.4","v":737170.4},{"$f":"IF(S18=\"\",\"\",RANK(Z18,Z6:Z65,0))","v":17},null,{"$f":"RANK(AB23,AB11:AB65,0)","v":1},null,null,13,{"$f":"IF(AE6<13,\"\",VLOOKUP(13,O6:AA65,4,FALSE))","v":"HOLKUP JAN"},{"$f":"IF(AE6<13,\"\",VLOOKUP(13,O6:AA65,10,FALSE))","v":755},null,null,{"$f":"IF(AO18=\"\",\"\",AW18)","v":34},3,"ŘEPY I.","TICHÝ HUGO",121,129,114,123,149,{"$f":"SUM(AO18:AS18)","v":636},{"$f":"MAX(AO18:AS18)","v":149},{"$f":"SUM(AT18*1000)+AU18+0.4","v":636149.4},{"$f":"IF(AO18=\"\",\"\",RANK(AV18,AV6:AV65,0))","v":34},null,{"$f":"RANK(AX23,AX11:AX65,0)","v":9},null,null,13,{"$f":"IF(BA6<13,\"\",VLOOKUP(13,AK6:AW65,4,FALSE))","v":"KALFIŘT PETR"},{"$f":"IF(BA6<13,\"\",VLOOKUP(13,AK6:AW65,10,FALSE))","v":796},null,null,{"$f":"IF(BK18=\"\",\"\",BS18)","v":7},3,"KLÍČOV I.","PECKA JIŘÍ",157,169,179,156,170,{"$f":"SUM(BK18:BO18)","v":831},{"$f":"MAX(BK18:BO18)","v":179},{"$f":"SUM(BP18*1000)+BQ18+0.4","v":831179.4},{"$f":"IF(BK18=\"\",\"\",RANK(BR18,BR6:BR65,0))","v":7},null,null,null,{"$f":"IF(BK18=\"\",\"\",RANK(BV23,BV11:BV65,0))","v":3},null,null,13,{"$f":"IF(BY6<13,\"\",VLOOKUP(13,BG6:BS65,4,FALSE))","v":"ALBA VLADIMÍR"},{"$f":"IF(BY6<13,\"\",VLOOKUP(13,BG6:BS65,10,FALSE))","v":770},null,null,{"$f":"IF(CI18=\"\",\"\",CQ18)","v":3},3,"VRŠOVICE I.","KRUPA JOZEF",190,180,169,178,166,{"$f":"SUM(CI18:CM18)","v":883},{"$f":"MAX(CI18:CM18)","v":190},{"$f":"SUM(CN18*1000)+CO18+0.4","v":883190.4},{"$f":"IF(CI18=\"\",\"\",RANK(CP18,CP6:CP65,0))","v":3},null,null,null,{"$f":"IF(CI18=\"\",\"\",RANK(CT23,CT11:CT65,0))","v":2},null,null,13,{"$f":"IF(CW6<13,\"\",VLOOKUP(13,CE6:CQ65,4,FALSE))","v":"SEHNAL IVAN"},{"$f":"IF(CW6<13,\"\",VLOOKUP(13,CE6:CQ65,10,FALSE))","v":761},null,null,{"$f":"IF(DG18=\"\",\"\",DO18)","v":23},3,"HOSTIVAŘ I.","Růžička Ladislav",122,136,151,130,178,{"$f":"SUM(DG18:DK18)","v":717},{"$f":"MAX(DG18:DK18)","v":178},{"$f":"SUM(DL18*1000)+DM18+0.4","v":717178.4},{"$f":"IF(DG18=\"\",\"\",RANK(DN18,DN6:DN65,0))","v":23},null,null,null,{"$f":"IF(DG18=\"\",\"\",RANK(DR23,DR11:DR65,0))","v":3},null,null,13,{"$f":"IF(DU6<13,\"\",VLOOKUP(13,DC6:DO65,4,FALSE))","v":"Jelínek Jan"},{"$f":"IF(DU6<13,\"\",VLOOKUP(13,DC6:DO65,10,FALSE))","v":782},null,null,{"$f":"IF(EE18=\"\",\"\",EM18)","v":27},3,"KAČEROV I.","Hübner Jiří",135,128,111,125,178,{"$f":"SUM(EE18:EI18)","v":677},{"$f":"MAX(EE18:EI18)","v":178},{"$f":"SUM(EJ18*1000)+EK18+0.4","v":677178.4},{"$f":"IF(EE18=\"\",\"\",RANK(EL18,EL6:EL65,0))","v":27},null,null,null,{"$f":"IF(EE18=\"\",\"\",RANK(EP23,EP11:EP65,0))","v":5},null,null,13,{"$f":"IF(ES6<13,\"\",VLOOKUP(13,EA6:EM65,4,FALSE))","v":"Jelínek Jan"},{"$f":"IF(ES6<13,\"\",VLOOKUP(13,EA6:EM65,10,FALSE))","v":775},null,null,{"$f":"IF(FC18=\"\",\"\",FK18)","v":41},3,"ŘEPY I.","Mottl Pavel",99,160,127,124,118,{"$f":"SUM(FC18:FG18)","v":628},{"$f":"MAX(FC18:FG18)","v":160},{"$f":"SUM(FH18*1000)+FI18+0.4","v":628160.4},{"$f":"IF(FC18=\"\",\"\",RANK(FJ18,FJ6:FJ65,0))","v":41},null,null,null,{"$f":"IF(FC18=\"\",\"\",RANK(FN23,FN11:FN65,0))","v":7},null,null,13,{"$f":"IF(FQ6<13,\"\",VLOOKUP(13,EY6:FL65,4,FALSE))","v":"Kročil Tomáš"},{"$f":"IF(FQ6<13,\"\",VLOOKUP(13,EY6:FL65,10,FALSE))","v":796},null,null,{"$f":"IF(GA18=\"\",\"\",GI18)","v":1},3,"KAČEROV I.",null,3,null,null,null,null,{"$f":"SUM(GA18:GE18)","v":3},{"$f":"MAX(GA18:GE18)","v":3},{"$f":"SUM(GF18*1000)+GG18+0.4","v":3003.4},{"$f":"IF(GA18=\"\",\"\",RANK(GH18,GH6:GH70,0))","v":1},null,null,null,{"$f":"IF(GA18=\"\",\"\",RANK(GL23,GL11:GL71,0))","v":1},null,null,13,{"$f":"IF(GO6<13,\"\",VLOOKUP(13,FW6:GI70,4,FALSE))","v":""},{"$f":"IF(GO6<13,\"\",VLOOKUP(13,FW6:GI70,10,FALSE))","v":""}]
[null,"POHÁR GŘ",null,"8.12.",null,null,null,null,null,"statistika celkem",null,null,null,null,{"$f":"IF(S19=\"\",\"\",AA19)","v":7},null,null,"TOMÁŠEK ZDENĚK",169,128,132,208,188,{"$f":"SUM(S19:W19)","v":825},{"$f":"MAX(S19:W19)","v":208},{"$f":"SUM(X19*1000)+Y19+0.39","v":825208.39},{"$f":"IF(S19=\"\",\"\",RANK(Z19,Z6:Z65,0))","v":7},null,null,null,null,14,{"$f":"IF(AE6<14,\"\",VLOOKUP(14,O6:AA65,4,FALSE))","v":"CARVAN PAVEL"},{"$f":"IF(AE6<14,\"\",VLOOKUP(14,O6:AA65,10,FALSE))","v":752},null,null,{"$f":"IF(AO19=\"\",\"\",AW19)","v":30},null,null,"SEHNAL IVAN",187,86,115,147,130,{"$f":"SUM(AO19:AS19)","v":665},{"$f":"MAX(AO19:AS19)","v":187},{"$f":"SUM(AT19*1000)+AU19+0.39","v":665187.39},{"$f":"IF(AO19=\"\",\"\",RANK(AV19,AV6:AV65,0))","v":30},null,null,null,null,14,{"$f":"IF(BA6<14,\"\",VLOOKUP(14,AK6:AW65,4,FALSE))","v":"HOLKUP JAN"},{"$f":"IF(BA6<14,\"\",VLOOKUP(14,AK6:AW65,10,FALSE))","v":790},null,null,{"$f":"IF(BK19=\"\",\"\",BS19)","v":12},null,null,"NOVOTNÝ LUKÁŠ",144,141,178,185,145,{"$f":"SUM(BK19:BO19)","v":793},{"$f":"MAX(BK19:BO19)","v":185},{"$f":"SUM(BP19*1000)+BQ19+0.39","v":793185.39},{"$f":"IF(BK19=\"\",\"\",RANK(BR19,BR6:BR65,0))","v":12},null,null,null,null,null,null,14,{"$f":"IF(BY6<14,\"\",VLOOKUP(14,BG6:BS65,4,FALSE))","v":"JELÍNEK JAN"},{"$f":"IF(BY6<14,\"\",VLOOKUP(14,BG6:BS65,10,FALSE))","v":770},null,null,{"$f":"IF(CI19=\"\",\"\",CQ19)","v":7},null,null,"GERMAN MILAN",221,163,180,137,139,{"$f":"SUM(CI19:CM19)","v":840},{"$f":"MAX(CI19:CM19)","v":221},{"$f":"SUM(CN19*1000)+CO19+0.39","v":840221.39},{"$f":"IF(CI19=\"\",\"\",RANK(CP19,CP6:CP65,0))","v":7},null,null,null,null,null,null,14,{"$f":"IF(CW6<14,\"\",VLOOKUP(14,CE6:CQ65,4,FALSE))","v":"MYSLIVEČEK JAROSLAV"},{"$f":"IF(CW6<14,\"\",VLOOKUP(14,CE6:CQ65,10,FALSE))","v":754},null,null,{"$f":"IF(DG19=\"\",\"\",DO19)","v":32},null,null,"Kolár Pavel",163,90,162,144,122,{"$f":"SUM(DG19:DK19)","v":681},{"$f":"MAX(DG19:DK19)","v":163},{"$f":"SUM(DL19*1000)+DM19+0.39","v":681163.39},{"$f":"IF(DG19=\"\",\"\",RANK(DN19,DN6:DN65,0))","v":32},null,null,null,null,null,null,14,{"$f":"IF(DU6<14,\"\",VLOOKUP(14,DC6:DO65,4,FALSE))","v":"Alba Vladimír"},{"$f":"IF(DU6<14,\"\",VLOOKUP(14,DC6:DO65,10,FALSE))","v":776},null,null,{"$f":"IF(EE19=\"\",\"\",EM19)","v":28},null,null,"Turek Stanislav",125,170,108,129,142,{"$f":"SUM(EE19:EI19)","v":674},{"$f":"MAX(EE19:EI19)","v":170},{"$f":"SUM(EJ19*1000)+EK19+0.39","v":674170.39},{"$f":"IF(EE19=\"\",\"\",RANK(EL19,EL6:EL65,0))","v":28},null,null,null,null,null,null,14,{"$f":"IF(ES6<14,\"\",VLOOKUP(14,EA6:EM65,4,FALSE))","v":"Bošek Jan"},{"$f":"IF(ES6<14,\"\",VLOOKUP(14,EA6:EM65,10,FALSE))","v":773},null,null,{"$f":"IF(FC19=\"\",\"\",FK19)","v":36},null,null,"Křikava Miroslav",161,107,114,132,130,{"$f":"SUM(FC19:FG19)","v":644},{"$f":"MAX(FC19:FG19)","v":161},{"$f":"SUM(FH19*1000)+FI19+0.39","v":644161.39},{"$f":"IF(FC19=\"\",\"\",RANK(FJ19,FJ6:FJ65,0))","v":36},null,null,null,null,null,null,14,{"$f":"IF(FQ6<14,\"\",VLOOKUP(14,EY6:FL65,4,FALSE))","v":"Růžička Ladislav"},{"$f":"IF(FQ6<14,\"\",VLOOKUP(14,EY6:FL65,10,FALSE))","v":792},null,null,{"$f":"IF(GA19=\"\",\"\",GI19)","v":""},null,null,null,null,null,null,null,null,{"$f":"SUM(GA19:GE19)","v":0},{"$f":"MAX(GA19:GE19)","v":0},{"$f":"SUM(GF19*1000)+GG19+0.39","v":0.39},{"$f":"IF(GA19=\"\",\"\",RANK(GH19,GH6:GH70,0))","v":""},null,null,null,null,null,null,14,{"$f":"IF(GO6<14,\"\",VLOOKUP(14,FW6:GI70,4,FALSE))","v":""},{"$f":"IF(GO6<14,\"\",VLOOKUP(14,FW6:GI70,10,FALSE))","v":""}]
[null,null,null,null,null,null,null,null,null,null,null,null,null,null,{"$f":"IF(S20=\"\",\"\",AA20)","v":10},null,null,"ONDŘICH FRANTIŠEK",127,158,144,217,150,{"$f":"SUM(S20:W20)","v":796},{"$f":"MAX(S20:W20)","v":217},{"$f":"SUM(X20*1000)+Y20+0.38","v":796217.38},{"$f":"IF(S20=\"\",\"\",RANK(Z20,Z6:Z65,0))","v":10},null,null,null,null,15,{"$f":"IF(AE6<15,\"\",VLOOKUP(15,O6:AA65,4,FALSE))","v":"KOCŮR JAROSLAV"},{"$f":"IF(AE6<15,\"\",VLOOKUP(15,O6:AA65,10,FALSE))","v":744},null,null,{"$f":"IF(AO20=\"\",\"\",AW20)","v":41},null,null,"PLECHÁČEK MIROSLAV",107,124,136,110,131,{"$f":"SUM(AO20:AS20)","v":608},{"$f":"MAX(AO20:AS20)","v":136},{"$f":"SUM(AT20*1000)+AU20+0.38","v":608136.38},{"$f":"IF(AO20=\"\",\"\",RANK(AV20,AV6:AV65,0))","v":41},null,null,null,null,15,{"$f":"IF(BA6<15,\"\",VLOOKUP(15,AK6:AW65,4,FALSE))","v":"MYSLIVEČEK JAROSLAV"},{"$f":"IF(BA6<15,\"\",VLOOKUP(15,AK6:AW65,10,FALSE))","v":768},null,null,{"$f":"IF(BK20=\"\",\"\",BS20)","v":15},null,null,"KALFIŘT PETR",130,146,183,167,142,{"$f":"SUM(BK20:BO20)","v":768},{"$f":"MAX(BK20:BO20)","v":183},{"$f":"SUM(BP20*1000)+BQ20+0.38","v":768183.38},{"$f":"IF(BK20=\"\",\"\",RANK(BR20,BR6:BR65,0))","v":15},null,null,null,null,null,null,15,{"$f":"IF(BY6<15,\"\",VLOOKUP(15,BG6:BS65,4,FALSE))","v":"KALFIŘT PETR"},{"$f":"IF(BY6<15,\"\",VLOOKUP(15,BG6:BS65,10,FALSE))","v":768},null,null,{"$f":"IF(CI20=\"\",\"\",CQ20)","v":27},null,null,"BOŠEK JAN",144,125,143,146,117,{"$f":"SUM(CI20:CM20)","v":675},{"$f":"MAX(CI20:CM20)","v":146},{"$f":"SUM(CN20*1000)+CO20+0.38","v":675146.38},{"$f":"IF(CI20=\"\",\"\",RANK(CP20,CP6:CP65,0))","v":27},null,null,null,null,null,null,15,{"$f":"IF(CW6<15,\"\",VLOOKUP(15,CE6:CQ65,4,FALSE))","v":"BREJCHA JAROSLAV"},{"$f":"IF(CW6<15,\"\",VLOOKUP(15,CE6:CQ65,10,FALSE))","v":753},null,null,{"$f":"IF(DG20=\"\",\"\",DO20)","v":13},null,null,"Jelínek Jan",161,153,148,145,175,{"$f":"SUM(DG20:DK20)","v":782},{"$f":"MAX(DG20:DK20)","v":175},{"$f":"SUM(DL20*1000)+DM20+0.38","v":782175.38},{"$f":"IF(DG20=\"\",\"\",RANK(DN20,DN6:DN65,0))","v":13},null,null,null,null,null,null,15,{"$f":"IF(DU6<15,\"\",VLOOKUP(15,DC6:DO65,4,FALSE))","v":"Pospíšil Václav"},{"$f":"IF(DU6<15,\"\",VLOOKUP(15,DC6:DO65,10,FALSE))","v":766},null,null,{"$f":"IF(EE20=\"\",\"\",EM20)","v":5},null,null,"Ondřich František",187,163,145,175,193,{"$f":"SUM(EE20:EI20)","v":863},{"$f":"MAX(EE20:EI20)","v":193},{"$f":"SUM(EJ20*1000)+EK20+0.38","v":863193.38},{"$f":"IF(EE20=\"\",\"\",RANK(EL20,EL6:EL65,0))","v":5},null,null,null,null,null,null,15,{"$f":"IF(ES6<15,\"\",VLOOKUP(15,EA6:EM65,4,FALSE))","v":"Carvan Pavel"},{"$f":"IF(ES6<15,\"\",VLOOKUP(15,EA6:EM65,10,FALSE))","v":762},null,null,{"$f":"IF(FC20=\"\",\"\",FK20)","v":45},null,null,"Růžička Václav",121,130,134,87,114,{"$f":"SUM(FC20:FG20)","v":586},{"$f":"MAX(FC20:FG20)","v":134},{"$f":"SUM(FH20*1000)+FI20+0.38","v":586134.38},{"$f":"IF(FC20=\"\",\"\",RANK(FJ20,FJ6:FJ65,0))","v":45},null,null,null,null,null,null,15,{"$f":"IF(FQ6<15,\"\",VLOOKUP(15,EY6:FL65,4,FALSE))","v":"Pecka Jiří"},{"$f":"IF(FQ6<15,\"\",VLOOKUP(15,EY6:FL65,10,FALSE))","v":790},null,null,{"$f":"IF(GA20=\"\",\"\",GI20)","v":""},null,null,null,null,null,null,null,null,{"$f":"SUM(GA20:GE20)","v":0},{"$f":"MAX(GA20:GE20)","v":0},{"$f":"SUM(GF20*1000)+GG20+0.38","v":0.38},{"$f":"IF(GA20=\"\",\"\",RANK(GH20,GH6:GH70,0))","v":""},null,null,null,null,null,null,15,{"$f":"IF(GO6<15,\"\",VLOOKUP(15,FW6:GI70,4,FALSE))","v":""},{"$f":"IF(GO6<15,\"\",VLOOKUP(15,FW6:GI70,10,FALSE))","v":""}]
[null,null,null,null,null,null,null,null,null,null,null,null,null,null,{"$f":"IF(S21=\"\",\"\",AA21)","v":2},null,null,"MAŠÁT PETR",184,165,192,170,184,{"$f":"SUM(S21:W21)","v":895},{"$f":"MAX(S21:W21)","v":192},{"$f":"SUM(X21*1000)+Y21+0.37","v":895192.37},{"$f":"IF(S21=\"\",\"\",RANK(Z21,Z6:Z65,0))","v":2},null,null,null,null,16,{"$f":"IF(AE6<16,\"\",VLOOKUP(16,O6:AA65,4,FALSE))","v":"RŮŽIČKA LADISLAV"},{"$f":"IF(AE6<16,\"\",VLOOKUP(16,O6:AA65,10,FALSE))","v":744},null,null,{"$f":"IF(AO21=\"\",\"\",AW21)","v":48},null,null,"KŘIKAVA MIROSLAV",128,88,84,145,103,{"$f":"SUM(AO21:AS21)","v":548},{"$f":"MAX(AO21:AS21)","v":145},{"$f":"SUM(AT21*1000)+AU21+0.37","v":548145.37},{"$f":"IF(AO21=\"\",\"\",RANK(AV21,AV6:AV65,0))","v":48},null,null,null,null,16,{"$f":"IF(BA6<16,\"\",VLOOKUP(16,AK6:AW65,4,FALSE))","v":"DOUŠA ADAM"},{"$f":"IF(BA6<16,\"\",VLOOKUP(16,AK6:AW65,10,FALSE))","v":766},null,null,{"$f":"IF(BK21=\"\",\"\",BS21)","v":26},null,null,"KŘEMENÁK PETR",129,144,124,138,168,{"$f":"SUM(BK21:BO21)","v":703},{"$f":"MAX(BK21:BO21)","v":168},{"$f":"SUM(BP21*1000)+BQ21+0.37","v":703168.37},{"$f":"IF(BK21=\"\",\"\",RANK(BR21,BR6:BR65,0))","v":26},null,null,null,null,null,null,16,{"$f":"IF(BY6<16,\"\",VLOOKUP(16,BG6:BS65,4,FALSE))","v":"BERGER MICHAL"},{"$f":"IF(BY6<16,\"\",VLOOKUP(16,BG6:BS65,10,FALSE))","v":767},null,null,{"$f":"IF(CI21=\"\",\"\",CQ21)","v":19},null,null,"KUČERA MIROSLAV",178,158,152,130,106,{"$f":"SUM(CI21:CM21)","v":724},{"$f":"MAX(CI21:CM21)","v":178},{"$f":"SUM(CN21*1000)+CO21+0.37","v":724178.37},{"$f":"IF(CI21=\"\",\"\",RANK(CP21,CP6:CP65,0))","v":19},null,null,null,null,null,null,16,{"$f":"IF(CW6<16,\"\",VLOOKUP(16,CE6:CQ65,4,FALSE))","v":"ALBA VLADIMÍR"},{"$f":"IF(CW6<16,\"\",VLOOKUP(16,CE6:CQ65,10,FALSE))","v":738},null,null,{"$f":"IF(DG21=\"\",\"\",DO21)","v":8},null,null,"Šafařík Luděk",145,191,153,146,170,{"$f":"SUM(DG21:DK21)","v":805},{"$f":"MAX(DG21:DK21)","v":191},{"$f":"SUM(DL21*1000)+DM21+0.37","v":805191.37},{"$f":"IF(DG21=\"\",\"\",RANK(DN21,DN6:DN65,0))","v":8},null,null,null,null,null,null,16,{"$f":"IF(DU6<16,\"\",VLOOKUP(16,DC6:DO65,4,FALSE))","v":"Troller Pavel"},{"$f":"IF(DU6<16,\"\",VLOOKUP(16,DC6:DO65,10,FALSE))","v":757},null,null,{"$f":"IF(EE21=\"\",\"\",EM21)","v":31},null,null,"Mašát Petr",106,134,143,149,125,{"$f":"SUM(EE21:EI21)","v":657},{"$f":"MAX(EE21:EI21)","v":149},{"$f":"SUM(EJ21*1000)+EK21+0.37","v":657149.37},{"$f":"IF(EE21=\"\",\"\",RANK(EL21,EL6:EL65,0))","v":31},null,null,null,null,null,null,16,{"$f":"IF(ES6<16,\"\",VLOOKUP(16,EA6:EM65,4,FALSE))","v":"Krupová Martina"},{"$f":"IF(ES6<16,\"\",VLOOKUP(16,EA6:EM65,10,FALSE))","v":755},null,null,{"$f":"IF(FC21=\"\",\"\",FK21)","v":32},null,null,"Sehnal Ivan ing.",120,154,132,130,122,{"$f":"SUM(FC21:FG21)","v":658},{"$f":"MAX(FC21:FG21)","v":154},{"$f":"SUM(FH21*1000)+FI21+0.37","v":658154.37},{"$f":"IF(FC21=\"\",\"\",RANK(FJ21,FJ6:FJ65,0))","v":32},null,null,null,null,null,null,16,{"$f":"IF(FQ6<16,\"\",VLOOKUP(16,EY6:FL65,4,FALSE))","v":"Věchtík Antoním"},{"$f":"IF(FQ6<16,\"\",VLOOKUP(16,EY6:FL65,10,FALSE))","v":766},null,null,{"$f":"IF(GA21=\"\",\"\",GI21)","v":""},null,null,null,null,null,null,null,null,{"$f":"SUM(GA21:GE21)","v":0},{"$f":"MAX(GA21:GE21)","v":0},{"$f":"SUM(GF21*1000)+GG21+0.37","v":0.37},{"$f":"IF(GA21=\"\",\"\",RANK(GH21,GH6:GH70,0))","v":""},null,null,null,null,null,null,16,{"$f":"IF(GO6<16,\"\",VLOOKUP(16,FW6:GI70,4,FALSE))","v":""},{"$f":"IF(GO6<16,\"\",VLOOKUP(16,FW6:GI70,10,FALSE))","v":""}]
[null,null,null,null,null,null,null,null,null,"garáže",null,null,null,null,{"$f":"IF(S22=\"\",\"\",AA22)","v":14},null,null,"CARVAN PAVEL",136,133,171,159,153,{"$f":"SUM(S22:W22)","v":752},{"$f":"MAX(S22:W22)","v":171},{"$f":"SUM(X22*1000)+Y22+0.36","v":752171.36},{"$f":"IF(S22=\"\",\"\",RANK(Z22,Z6:Z65,0))","v":14},null,null,null,null,17,{"$f":"IF(AE6<17,\"\",VLOOKUP(17,O6:AA65,4,FALSE))","v":"HÜBNER JIŘÍ"},{"$f":"IF(AE6<17,\"\",VLOOKUP(17,O6:AA65,10,FALSE))","v":737},null,null,{"$f":"IF(AO22=\"\",\"\",AW22)","v":45},null,null,"MOTTL PAVEL",115,96,134,120,131,{"$f":"SUM(AO22:AS22)","v":596},{"$f":"MAX(AO22:AS22)","v":134},{"$f":"SUM(AT22*1000)+AU22+0.36","v":596134.36},{"$f":"IF(AO22=\"\",\"\",RANK(AV22,AV6:AV65,0))","v":45},null,null,null,null,17,{"$f":"IF(BA6<17,\"\",VLOOKUP(17,AK6:AW65,4,FALSE))","v":"ŠAFÁŘ BOHUMIL"},{"$f":"IF(BA6<17,\"\",VLOOKUP(17,AK6:AW65,10,FALSE))","v":751},null,null,{"$f":"IF(BK22=\"\",\"\",BS22)","v":27},null,null,"HÁJEK MOJMÍR",125,136,104,145,189,{"$f":"SUM(BK22:BO22)","v":699},{"$f":"MAX(BK22:BO22)","v":189},{"$f":"SUM(BP22*1000)+BQ22+0.36","v":699189.36},{"$f":"IF(BK22=\"\",\"\",RANK(BR22,BR6:BR65,0))","v":27},null,null,null,null,null,null,17,{"$f":"IF(BY6<17,\"\",VLOOKUP(17,BG6:BS65,4,FALSE))","v":"KRUPA JOZEF"},{"$f":"IF(BY6<17,\"\",VLOOKUP(17,BG6:BS65,10,FALSE))","v":760},null,null,{"$f":"IF(CI22=\"\",\"\",CQ22)","v":18},null,null,"KRUPOVÁ MARTINA",124,137,146,173,145,{"$f":"SUM(CI22:CM22)","v":725},{"$f":"MAX(CI22:CM22)","v":173},{"$f":"SUM(CN22*1000)+CO22+0.36","v":725173.36},{"$f":"IF(CI22=\"\",\"\",RANK(CP22,CP6:CP65,0))","v":18},null,null,null,null,null,null,17,{"$f":"IF(CW6<17,\"\",VLOOKUP(17,CE6:CQ65,4,FALSE))","v":"HÜBNER JIŘÍ"},{"$f":"IF(CW6<17,\"\",VLOOKUP(17,CE6:CQ65,10,FALSE))","v":725},null,null,{"$f":"IF(DG22=\"\",\"\",DO22)","v":12},null,null,"Lazur Vladimír",121,154,159,181,179,{"$f":"SUM(DG22:DK22)","v":794},{"$f":"MAX(DG22:DK22)","v":181},{"$f":"SUM(DL22*1000)+DM22+0.36","v":794181.36},{"$f":"IF(DG22=\"\",\"\",RANK(DN22,DN6:DN65,0))","v":12},null,null,null,null,null,null,17,{"$f":"IF(DU6<17,\"\",VLOOKUP(17,DC6:DO65,4,FALSE))","v":"Pecka Jiří"},{"$f":"IF(DU6<17,\"\",VLOOKUP(17,DC6:DO65,10,FALSE))","v":751},null,null,{"$f":"IF(EE22=\"\",\"\",EM22)","v":15},null,null,"Carvan Pavel",146,192,147,127,150,{"$f":"SUM(EE22:EI22)","v":762},{"$f":"MAX(EE22:EI22)","v":192},{"$f":"SUM(EJ22*1000)+EK22+0.36","v":762192.36},{"$f":"IF(EE22=\"\",\"\",RANK(EL22,EL6:EL65,0))","v":15},null,null,null,null,null,null,17,{"$f":"IF(ES6<17,\"\",VLOOKUP(17,EA6:EM65,4,FALSE))","v":"Berger Michal"},{"$f":"IF(ES6<17,\"\",VLOOKUP(17,EA6:EM65,10,FALSE))","v":730},null,null,{"$f":"IF(FC22=\"\",\"\",FK22)","v":19},null,null,"Sladovník Miloslav",162,146,143,148,156,{"$f":"SUM(FC22:FG22)","v":755},{"$f":"MAX(FC22:FG22)","v":162},{"$f":"SUM(FH22*1000)+FI22+0.36","v":755162.36},{"$f":"IF(FC22=\"\",\"\",RANK(FJ22,FJ6:FJ65,0))","v":19},null,null,null,null,null,null,17,{"$f":"IF(FQ6<17,\"\",VLOOKUP(17,EY6:FL65,4,FALSE))","v":"Kalfiřt Petr"},{"$f":"IF(FQ6<17,\"\",VLOOKUP(17,EY6:FL65,10,FALSE))","v":761},null,null,{"$f":"IF(GA22=\"\",\"\",GI22)","v":""},null,null,null,null,null,null,null,null,{"$f":"SUM(GA22:GE22)","v":0},{"$f":"MAX(GA22:GE22)","v":0},{"$f":"SUM(GF22*1000)+GG22+0.36","v":0.36},{"$f":"IF(GA22=\"\",\"\",RANK(GH22,GH6:GH70,0))","v":""},null,null,null,null,null,null,17,{"$f":"IF(GO6<17,\"\",VLOOKUP(17,FW6:GI70,4,FALSE))","v":""},{"$f":"IF(GO6<17,\"\",VLOOKUP(17,FW6:GI70,10,FALSE))","v":""}]
[null,"PRO PŘÍPAD            11 DRUŽSTEV",null,null,null,null,null,null,null,null,null,null,null,null,null,null,null,null,{"$f":"SUM(S18:S22)","v":729},{"$f":"SUM(T18:T22)","v":754},{"$f":"SUM(U18:U22)","v":776},{"$f":"SUM(V18:V22)","v":912},{"$f":"SUM(W18:W22)","v":834},null,null,null,null,{"$f":"SUM(S23:W23)","v":4005},null,null,null,18,{"$f":"IF(AE6<18,\"\",VLOOKUP(18,O6:AA65,4,FALSE))","v":"JELÍNEK JAN"},{"$f":"IF(AE6<18,\"\",VLOOKUP(18,O6:AA65,10,FALSE))","v":727},null,null,null,null,null,null,{"$f":"SUM(AO18:AO22)","v":658},{"$f":"SUM(AP18:AP22)","v":523},{"$f":"SUM(AQ18:AQ22)","v":583},{"$f":"SUM(AR18:AR22)","v":645},{"$f":"SUM(AS18:AS22)","v":644},null,null,null,null,{"$f":"SUM(AO23:AS23)","v":3053},null,null,null,18,{"$f":"IF(BA6<18,\"\",VLOOKUP(18,AK6:AW65,4,FALSE))","v":"SKRUŽNÁ PAVLA"},{"$f":"IF(BA6<18,\"\",VLOOKUP(18,AK6:AW65,10,FALSE))","v":738},null,null,null,null,null,null,{"$f":"SUM(BK18:BK22)","v":685},{"$f":"SUM(BL18:BL22)","v":736},{"$f":"SUM(BM18:BM22)","v":768},{"$f":"SUM(BN18:BN22)","v":791},{"$f":"SUM(BO18:BO22)","v":814},null,null,null,null,{"$f":"SUM(BK23:BO23)","v":3794},{"$f":"MAX(BK23:BO23)","v":814},{"$f":"IF(BK18=\"\",\"\",SUM(BT23*10000)+BU23)","v":37940814},null,null,null,18,{"$f":"IF(BY6<18,\"\",VLOOKUP(18,BG6:BS65,4,FALSE))","v":"KROČIL TOMÁŠ"},{"$f":"IF(BY6<18,\"\",VLOOKUP(18,BG6:BS65,10,FALSE))","v":742},null,null,null,null,null,null,{"$f":"SUM(CI18:CI22)","v":857},{"$f":"SUM(CJ18:CJ22)","v":763},{"$f":"SUM(CK18:CK22)","v":790},{"$f":"SUM(CL18:CL22)","v":764},{"$f":"SUM(CM18:CM22)","v":673},null,null,null,null,{"$f":"SUM(CI23:CM23)","v":3847},{"$f":"MAX(CI23:CM23)","v":857},{"$f":"IF(CI18=\"\",\"\",SUM(CR23*1000)+CS23)","v":3847857},null,null,null,18,{"$f":"IF(CW6<18,\"\",VLOOKUP(18,CE6:CQ65,4,FALSE))","v":"KRUPOVÁ MARTINA"},{"$f":"IF(CW6<18,\"\",VLOOKUP(18,CE6:CQ65,10,FALSE))","v":725},null,null,null,null,null,null,{"$f":"SUM(DG18:DG22)","v":712},{"$f":"SUM(DH18:DH22)","v":724},{"$f":"SUM(DI18:DI22)","v":773},{"$f":"SUM(DJ18:DJ22)","v":746},{"$f":"SUM(DK18:DK22)","v":824},null,null,null,null,{"$f":"SUM(DG23:DK23)","v":3779},{"$f":"MAX(DG23:DK23)","v":824},{"$f":"IF(DG18=\"\",\"\",SUM(DP23*1000)+DQ23)","v":3779824},null,null,null,18,{"$f":"IF(DU6<18,\"\",VLOOKUP(18,DC6:DO65,4,FALSE))","v":"Tomášek Zdenek"},{"$f":"IF(DU6<18,\"\",VLOOKUP(18,DC6:DO65,10,FALSE))","v":725},null,null,null,null,null,null,{"$f":"SUM(EE18:EE22)","v":699},{"$f":"SUM(EF18:EF22)","v":787},{"$f":"SUM(EG18:EG22)","v":654},{"$f":"SUM(EH18:EH22)","v":705},{"$f":"SUM(EI18:EI22)","v":788},null,null,null,null,{"$f":"SUM(EE23:EI23)","v":3633},{"$f":"MAX(EE23:EI23)","v":788},{"$f":"IF(EE18=\"\",\"\",SUM(EN23*1000)+EO23)","v":3633788},null,null,null,18,{"$f":"IF(ES6<18,\"\",VLOOKUP(18,EA6:EM65,4,FALSE))","v":"Kročil Tomáš"},{"$f":"IF(ES6<18,\"\",VLOOKUP(18,EA6:EM65,10,FALSE))","v":728},null,null,null,null,null,null,{"$f":"SUM(FC18:FC22)","v":663},{"$f":"SUM(FD18:FD22)","v":697},{"$f":"SUM(FE18:FE22)","v":650},{"$f":"SUM(FF18:FF22)","v":621},{"$f":"SUM(FG18:FG22)","v":640},null,null,null,null,{"$f":"SUM(FC23:FG23)","v":3271},{"$f":"MAX(FC23:FG23)","v":697},{"$f":"IF(FC18=\"\",\"\",SUM(FL23*1000)+FM23)","v":3271697},null,null,null,18,{"$f":"IF(FQ6<18,\"\",VLOOKUP(18,EY6:FL65,4,FALSE))","v":"Podhola Martin"},{"$f":"IF(FQ6<18,\"\",VLOOKUP(18,EY6:FL65,10,FALSE))","v":757},null,null,null,null,null,null,{"$f":"SUM(GA18:GA22)","v":3},{"$f":"SUM(GB18:GB22)","v":0},{"$f":"SUM(GC18:GC22)","v":0},{"$f":"SUM(GD18:GD22)","v":0},{"$f":"SUM(GE18:GE22)","v":0},null,null,null,null,{"$f":"SUM(GA23:GE23)","v":3},{"$f":"MAX(GA23:GE23)","v":3},{"$f":"IF(GA18=\"\",\"\",SUM(GJ23*1000)+GK23)","v":3003},null,null,null,18,{"$f":"IF(GO6<18,\"\",VLOOKUP(18,FW6:GI70,4,FALSE))","v":""},{"$f":"IF(GO6<18,\"\",VLOOKUP(18,FW6:GI70,10,FALSE))","v":""}]
[null,null,null,null,null,null,null,null,null,null,null,null,null,null,{"$f":"IF(S24=\"\",\"\",AA24)","v":33},4,"KAČEROV II.","DOUŠA ADAM",103,134,169,115,115,{"$f":"SUM(S24:W24)","v":636},{"$f":"MAX(S24:W24)","v":169},{"$f":"SUM(X24*1000)+Y24+0.35","v":636169.35},{"$f":"IF(S24=\"\",\"\",RANK(Z24,Z6:Z65,0))","v":33},null,{"$f":"RANK(AB29,AB11:AB65,0)","v":7},null,null,19,{"$f":"IF(AE6<19,\"\",VLOOKUP(19,O6:AA65,4,FALSE))","v":"SLADOVNÍK MILOSLAV"},{"$f":"IF(AE6<19,\"\",VLOOKUP(19,O6:AA65,10,FALSE))","v":720},null,null,{"$f":"IF(AO24=\"\",\"\",AW24)","v":23},4,"ŘEPY II.","ALBA VLADIMÍR",154,149,143,134,121,{"$f":"SUM(AO24:AS24)","v":701},{"$f":"MAX(AO24:AS24)","v":154},{"$f":"SUM(AT24*1000)+AU24+0.35","v":701154.35},{"$f":"IF(AO24=\"\",\"\",RANK(AV24,AV6:AV65,0))","v":23},null,{"$f":"RANK(AX29,AX11:AX65,0)","v":2},null,null,19,{"$f":"IF(BA6<19,\"\",VLOOKUP(19,AK6:AW65,4,FALSE))","v":"TOMÁŠEK ZDENĚK"},{"$f":"IF(BA6<19,\"\",VLOOKUP(19,AK6:AW65,10,FALSE))","v":728},null,null,{"$f":"IF(BK24=\"\",\"\",BS24)","v":30},4,"KLÍČOV II.","NOVOTNÁ PETRA",136,140,123,135,147,{"$f":"SUM(BK24:BO24)","v":681},{"$f":"MAX(BK24:BO24)","v":147},{"$f":"SUM(BP24*1000)+BQ24+0.35","v":681147.35},{"$f":"IF(BK24=\"\",\"\",RANK(BR24,BR6:BR65,0))","v":30},null,null,null,{"$f":"IF(BK24=\"\",\"\",RANK(BV29,BV11:BV65,0))","v":10},null,null,19,{"$f":"IF(BY6<19,\"\",VLOOKUP(19,BG6:BS65,4,FALSE))","v":"BROŽ STANISLAV"},{"$f":"IF(BY6<19,\"\",VLOOKUP(19,BG6:BS65,10,FALSE))","v":742},null,null,{"$f":"IF(CI24=\"\",\"\",CQ24)","v":21},4,"VRŠOVICE II.","AUNICKÝ FRANTIŠEK",161,137,110,161,136,{"$f":"SUM(CI24:CM24)","v":705},{"$f":"MAX(CI24:CM24)","v":161},{"$f":"SUM(CN24*1000)+CO24+0.35","v":705161.35},{"$f":"IF(CI24=\"\",\"\",RANK(CP24,CP6:CP65,0))","v":21},null,null,null,{"$f":"IF(CI24=\"\",\"\",RANK(CT29,CT11:CT65,0))","v":8},null,null,19,{"$f":"IF(CW6<19,\"\",VLOOKUP(19,CE6:CQ65,4,FALSE))","v":"KUČERA MIROSLAV"},{"$f":"IF(CW6<19,\"\",VLOOKUP(19,CE6:CQ65,10,FALSE))","v":724},null,null,{"$f":"IF(DG24=\"\",\"\",DO24)","v":27},4,"HOSTIVAŘ II.","Mysliveček Jaroslav",176,136,115,169,105,{"$f":"SUM(DG24:DK24)","v":701},{"$f":"MAX(DG24:DK24)","v":176},{"$f":"SUM(DL24*1000)+DM24+0.35","v":701176.35},{"$f":"IF(DG24=\"\",\"\",RANK(DN24,DN6:DN65,0))","v":27},null,null,null,{"$f":"IF(DG24=\"\",\"\",RANK(DR29,DR11:DR65,0))","v":6},null,null,19,{"$f":"IF(DU6<19,\"\",VLOOKUP(19,DC6:DO65,4,FALSE))","v":"Bošek Jan"},{"$f":"IF(DU6<19,\"\",VLOOKUP(19,DC6:DO65,10,FALSE))","v":723},null,null,{"$f":"IF(EE24=\"\",\"\",EM24)","v":38},4,"KAČEROV II.","Katolický Zdeněk",149,126,131,80,141,{"$f":"SUM(EE24:EI24)","v":627},{"$f":"MAX(EE24:EI24)","v":149},{"$f":"SUM(EJ24*1000)+EK24+0.35","v":627149.35},{"$f":"IF(EE24=\"\",\"\",RANK(EL24,EL6:EL65,0))","v":38},null,null,null,{"$f":"IF(EE24=\"\",\"\",RANK(EP29,EP11:EP65,0))","v":6},null,null,19,{"$f":"IF(ES6<19,\"\",VLOOKUP(19,EA6:EM65,4,FALSE))","v":"Brož Stanislav"},{"$f":"IF(ES6<19,\"\",VLOOKUP(19,EA6:EM65,10,FALSE))","v":723},null,null,{"$f":"IF(FC24=\"\",\"\",FK24)","v":5},4,"ŘEPY II.","Kocůr Jaroslav",161,210,158,174,147,{"$f":"SUM(FC24:FG24)","v":850},{"$f":"MAX(FC24:FG24)","v":210},{"$f":"SUM(FH24*1000)+FI24+0.35","v":850210.35},{"$f":"IF(FC24=\"\",\"\",RANK(FJ24,FJ6:FJ65,0))","v":5},null,null,null,{"$f":"IF(FC24=\"\",\"\",RANK(FN29,FN11:FN65,0))","v":1},null,null,19,{"$f":"IF(FQ6<19,\"\",VLOOKUP(19,EY6:FL65,4,FALSE))","v":"Sladovník Miloslav"},{"$f":"IF(FQ6<19,\"\",VLOOKUP(19,EY6:FL65,10,FALSE))","v":755},null,null,{"$f":"IF(GA24=\"\",\"\",GI24)","v":""},4,"KAČEROV II.",null,null,null,null,null,null,{"$f":"SUM(GA24:GE24)","v":0},{"$f":"MAX(GA24:GE24)","v":0},{"$f":"SUM(GF24*1000)+GG24+0.35","v":0.35},{"$f":"IF(GA24=\"\",\"\",RANK(GH24,GH6:GH70,0))","v":""},null,null,null,{"$f":"IF(GA24=\"\",\"\",RANK(GL29,GL11:GL71,0))","v":""},null,null,19,{"$f":"IF(GO6<19,\"\",VLOOKUP(19,FW6:GI70,4,FALSE))","v":""},{"$f":"IF(GO6<19,\"\",VLOOKUP(19,FW6:GI70,10,FALSE))","v":""}]
[null,null,null,null,null,null,null,null,null,null,null,null,null,null,{"$f":"IF(S25=\"\",\"\",AA25)","v":50},null,null,"KUTINA PAVEL",115,75,105,92,86,{"$f":"SUM(S25:W25)","v":473},{"$f":"MAX(S25:W25)","v":115},{"$f":"SUM(X25*1000)+Y25+0.34","v":473115.34},{"$f":"IF(S25=\"\",\"\",RANK(Z25,Z6:Z65,0))","v":50},null,null,null,null,20,{"$f":"IF(AE6<20,\"\",VLOOKUP(20,O6:AA65,4,FALSE))","v":"RADOVÁ PETRA"},{"$f":"IF(AE6<20,\"\",VLOOKUP(20,O6:AA65,10,FALSE))","v":718},null,null,{"$f":"IF(AO25=\"\",\"\",AW25)","v":24},null,null,"SLADOVNÍK MILOSLAV",147,177,112,127,130,{"$f":"SUM(AO25:AS25)","v":693},{"$f":"MAX(AO25:AS25)","v":177},{"$f":"SUM(AT25*1000)+AU25+0.34","v":693177.34},{"$f":"IF(AO25=\"\",\"\",RANK(AV25,AV6:AV65,0))","v":24},null,null,null,null,20,{"$f":"IF(BA6<20,\"\",VLOOKUP(20,AK6:AW65,4,FALSE))","v":"JELÍNEK JAN"},{"$f":"IF(BA6<20,\"\",VLOOKUP(20,AK6:AW65,10,FALSE))","v":719},null,null,{"$f":"IF(BK25=\"\",\"\",BS25)","v":43},null,null,"NOVOTNÁ JANA",108,111,147,115,100,{"$f":"SUM(BK25:BO25)","v":581},{"$f":"MAX(BK25:BO25)","v":147},{"$f":"SUM(BP25*1000)+BQ25+0.34","v":581147.34},{"$f":"IF(BK25=\"\",\"\",RANK(BR25,BR6:BR65,0))","v":43},null,null,null,null,null,null,20,{"$f":"IF(BY6<20,\"\",VLOOKUP(20,BG6:BS65,4,FALSE))","v":"TOMÁŠEK ZDENĚK"},{"$f":"IF(BY6<20,\"\",VLOOKUP(20,BG6:BS65,10,FALSE))","v":733},null,null,{"$f":"IF(CI25=\"\",\"\",CQ25)","v":23},null,null,"KAZDA JAN",181,133,141,118,127,{"$f":"SUM(CI25:CM25)","v":700},{"$f":"MAX(CI25:CM25)","v":181},{"$f":"SUM(CN25*1000)+CO25+0.34","v":700181.34},{"$f":"IF(CI25=\"\",\"\",RANK(CP25,CP6:CP65,0))","v":23},null,null,null,null,null,null,20,{"$f":"IF(CW6<20,\"\",VLOOKUP(20,CE6:CQ65,4,FALSE))","v":"TOMÁŠEK ZDENĚK"},{"$f":"IF(CW6<20,\"\",VLOOKUP(20,CE6:CQ65,10,FALSE))","v":723},null,null,{"$f":"IF(DG25=\"\",\"\",DO25)","v":31},null,null,"Šafář Ladislav",105,147,143,149,139,{"$f":"SUM(DG25:DK25)","v":683},{"$f":"MAX(DG25:DK25)","v":149},{"$f":"SUM(DL25*1000)+DM25+0.34","v":683149.34},{"$f":"IF(DG25=\"\",\"\",RANK(DN25,DN6:DN65,0))","v":31},null,null,null,null,null,null,20,{"$f":"IF(DU6<20,\"\",VLOOKUP(20,DC6:DO65,4,FALSE))","v":"Sehnal Ivan"},{"$f":"IF(DU6<20,\"\",VLOOKUP(20,DC6:DO65,10,FALSE))","v":722},null,null,{"$f":"IF(EE25=\"\",\"\",EM25)","v":25},null,null,"Brejcha Jaroslav",142,130,155,137,127,{"$f":"SUM(EE25:EI25)","v":691},{"$f":"MAX(EE25:EI25)","v":155},{"$f":"SUM(EJ25*1000)+EK25+0.34","v":691155.34},{"$f":"IF(EE25=\"\",\"\",RANK(EL25,EL6:EL65,0))","v":25},null,null,null,null,null,null,20,{"$f":"IF(ES6<20,\"\",VLOOKUP(20,EA6:EM65,4,FALSE))","v":"Štěpán Radek"},{"$f":"IF(ES6<20,\"\",VLOOKUP(20,EA6:EM65,10,FALSE))","v":716},null,null,{"$f":"IF(FC25=\"\",\"\",FK25)","v":22},null,null,"Alba Vladimír",116,156,132,170,148,{"$f":"SUM(FC25:FG25)","v":722},{"$f":"MAX(FC25:FG25)","v":170},{"$f":"SUM(FH25*1000)+FI25+0.34","v":722170.34},{"$f":"IF(FC25=\"\",\"\",RANK(FJ25,FJ6:FJ65,0))","v":22},null,null,null,null,null,null,20,{"$f":"IF(FQ6<20,\"\",VLOOKUP(20,EY6:FL65,4,FALSE))","v":"Troller Pavel"},{"$f":"IF(FQ6<20,\"\",VLOOKUP(20,EY6:FL65,10,FALSE))","v":742},null,null,{"$f":"IF(GA25=\"\",\"\",GI25)","v":""},null,null,null,null,null,null,null,null,{"$f":"SUM(GA25:GE25)","v":0},{"$f":"MAX(GA25:GE25)","v":0},{"$f":"SUM(GF25*1000)+GG25+0.34","v":0.34},{"$f":"IF(GA25=\"\",\"\",RANK(GH25,GH6:GH70,0))","v":""},null,null,null,null,null,null,20,{"$f":"IF(GO6<20,\"\",VLOOKUP(20,FW6:GI70,4,FALSE))","v":""},{"$f":"IF(GO6<20,\"\",VLOOKUP(20,FW6:GI70,10,FALSE))","v":""}]
[null,null,null,null,null,null,null,null,null,null,null,null,null,null,{"$f":"IF(S26=\"\",\"\",AA26)","v":38},null,null,"BREJCHA JAROSLAV",102,153,110,145,104,{"$f":"SUM(S26:W26)","v":614},{"$f":"MAX(S26:W26)","v":153},{"$f":"SUM(X26*1000)+Y26+0.33","v":614153.32999999996},{"$f":"IF(S26=\"\",\"\",RANK(Z26,Z6:Z65,0))","v":38},null,null,null,null,21,{"$f":"IF(AE6<21,\"\",VLOOKUP(21,O6:AA65,4,FALSE))","v":"KŘEMENÁK PETR"},{"$f":"IF(AE6<21,\"\",VLOOKUP(21,O6:AA65,10,FALSE))","v":707},null,null,{"$f":"IF(AO26=\"\",\"\",AW26)","v":12},null,null,"KROČIL TOMÁŠ",207,115,170,136,178,{"$f":"SUM(AO26:AS26)","v":806},{"$f":"MAX(AO26:AS26)","v":207},{"$f":"SUM(AT26*1000)+AU26+0.33","v":806207.33},{"$f":"IF(AO26=\"\",\"\",RANK(AV26,AV6:AV65,0))","v":12},null,null,null,null,21,{"$f":"IF(BA6<21,\"\",VLOOKUP(21,AK6:AW65,4,FALSE))","v":"BOŠEK JAN"},{"$f":"IF(BA6<21,\"\",VLOOKUP(21,AK6:AW65,10,FALSE))","v":710},null,null,{"$f":"IF(BK26=\"\",\"\",BS26)","v":37},null,null,"ŠAFÁŘ BOHUMIL",100,124,164,155,117,{"$f":"SUM(BK26:BO26)","v":660},{"$f":"MAX(BK26:BO26)","v":164},{"$f":"SUM(BP26*1000)+BQ26+0.33","v":660164.32999999996},{"$f":"IF(BK26=\"\",\"\",RANK(BR26,BR6:BR65,0))","v":37},null,null,null,null,null,null,21,{"$f":"IF(BY6<21,\"\",VLOOKUP(21,BG6:BS65,4,FALSE))","v":"SLADOVNÍK MILOSLAV"},{"$f":"IF(BY6<21,\"\",VLOOKUP(21,BG6:BS65,10,FALSE))","v":727},null,null,{"$f":"IF(CI26=\"\",\"\",CQ26)","v":41},null,null,"KOVÁŘ JAROSLAV",113,100,111,118,127,{"$f":"SUM(CI26:CM26)","v":569},{"$f":"MAX(CI26:CM26)","v":127},{"$f":"SUM(CN26*1000)+CO26+0.33","v":569127.32999999996},{"$f":"IF(CI26=\"\",\"\",RANK(CP26,CP6:CP65,0))","v":41},null,null,null,null,null,null,21,{"$f":"IF(CW6<21,\"\",VLOOKUP(21,CE6:CQ65,4,FALSE))","v":"AUNICKÝ FRANTIŠEK"},{"$f":"IF(CW6<21,\"\",VLOOKUP(21,CE6:CQ65,10,FALSE))","v":705},null,null,{"$f":"IF(DG26=\"\",\"\",DO26)","v":45},null,null,"Čermák Tomáš",139,112,78,113,119,{"$f":"SUM(DG26:DK26)","v":561},{"$f":"MAX(DG26:DK26)","v":139},{"$f":"SUM(DL26*1000)+DM26+0.33","v":561139.32999999996},{"$f":"IF(DG26=\"\",\"\",RANK(DN26,DN6:DN65,0))","v":45},null,null,null,null,null,null,21,{"$f":"IF(DU6<21,\"\",VLOOKUP(21,DC6:DO65,4,FALSE))","v":"Turek Stanislav"},{"$f":"IF(DU6<21,\"\",VLOOKUP(21,DC6:DO65,10,FALSE))","v":721},null,null,{"$f":"IF(EE26=\"\",\"\",EM26)","v":37},null,null,"Kutina Pavel",151,128,126,107,115,{"$f":"SUM(EE26:EI26)","v":627},{"$f":"MAX(EE26:EI26)","v":151},{"$f":"SUM(EJ26*1000)+EK26+0.33","v":627151.32999999996},{"$f":"IF(EE26=\"\",\"\",RANK(EL26,EL6:EL65,0))","v":37},null,null,null,null,null,null,21,{"$f":"IF(ES6<21,\"\",VLOOKUP(21,EA6:EM65,4,FALSE))","v":"Troller Pavel"},{"$f":"IF(ES6<21,\"\",VLOOKUP(21,EA6:EM65,10,FALSE))","v":701},null,null,{"$f":"IF(FC26=\"\",\"\",FK26)","v":1},null,null,"Froněk Martin",163,181,199,173,177,{"$f":"SUM(FC26:FG26)","v":893},{"$f":"MAX(FC26:FG26)","v":199},{"$f":"SUM(FH26*1000)+FI26+0.33","v":893199.33},{"$f":"IF(FC26=\"\",\"\",RANK(FJ26,FJ6:FJ65,0))","v":1},null,null,null,null,null,null,21,{"$f":"IF(FQ6<21,\"\",VLOOKUP(21,EY6:FL65,4,FALSE))","v":"Berger Michal"},{"$f":"IF(FQ6<21,\"\",VLOOKUP(21,EY6:FL65,10,FALSE))","v":729},null,null,{"$f":"IF(GA26=\"\",\"\",GI26)","v":""},null,null,null,null,null,null,null,null,{"$f":"SUM(GA26:GE26)","v":0},{"$f":"MAX(GA26:GE26)","v":0},{"$f":"SUM(GF26*1000)+GG26+0.33","v":0.33},{"$f":"IF(GA26=\"\",\"\",RANK(GH26,GH6:GH70,0))","v":""},null,null,null,null,null,null,21,{"$f":"IF(GO6<21,\"\",VLOOKUP(21,FW6:GI70,4,FALSE))","v":""},{"$f":"IF(GO6<21,\"\",VLOOKUP(21,FW6:GI70,10,FALSE))","v":""}]
[null,null,null,null,null,null,null,null,null,null,null,null,null,null,{"$f":"IF(S27=\"\",\"\",AA27)","v":29},null,null,"BROŽ STANISLAV",122,122,144,127,142,{"$f":"SUM(S27:W27)","v":657},{"$f":"MAX(S27:W27)","v":144},{"$f":"SUM(X27*1000)+Y27+0.32","v":657144.31999999995},{"$f":"IF(S27=\"\",\"\",RANK(Z27,Z6:Z65,0))","v":29},null,null,null,null,22,{"$f":"IF(AE6<22,\"\",VLOOKUP(22,O6:AA65,4,FALSE))","v":"TICHÝ HUGO"},{"$f":"IF(AE6<22,\"\",VLOOKUP(22,O6:AA65,10,FALSE))","v":705},null,null,{"$f":"IF(AO27=\"\",\"\",AW27)","v":2},null,null,"KOCŮR JAROSLAV",172,179,183,185,196,{"$f":"SUM(AO27:AS27)","v":915},{"$f":"MAX(AO27:AS27)","v":196},{"$f":"SUM(AT27*1000)+AU27+0.32","v":915196.32},{"$f":"IF(AO27=\"\",\"\",RANK(AV27,AV6:AV65,0))","v":2},null,null,null,null,22,{"$f":"IF(BA6<22,\"\",VLOOKUP(22,AK6:AW65,4,FALSE))","v":"ŠAFÁŘ LADISLAV"},{"$f":"IF(BA6<22,\"\",VLOOKUP(22,AK6:AW65,10,FALSE))","v":708},null,null,{"$f":"IF(BK27=\"\",\"\",BS27)","v":49},null,null,"VYCHNEROVÁ MICHALA",84,114,108,98,104,{"$f":"SUM(BK27:BO27)","v":508},{"$f":"MAX(BK27:BO27)","v":114},{"$f":"SUM(BP27*1000)+BQ27+0.32","v":508114.32},{"$f":"IF(BK27=\"\",\"\",RANK(BR27,BR6:BR65,0))","v":49},null,null,null,null,null,null,22,{"$f":"IF(BY6<22,\"\",VLOOKUP(22,BG6:BS65,4,FALSE))","v":"KOVÁŘ JAROSLAV"},{"$f":"IF(BY6<22,\"\",VLOOKUP(22,BG6:BS65,10,FALSE))","v":726},null,null,{"$f":"IF(CI27=\"\",\"\",CQ27)","v":37},null,null,"FAY VLASTIMIL",130,103,108,129,131,{"$f":"SUM(CI27:CM27)","v":601},{"$f":"MAX(CI27:CM27)","v":131},{"$f":"SUM(CN27*1000)+CO27+0.32","v":601131.31999999995},{"$f":"IF(CI27=\"\",\"\",RANK(CP27,CP6:CP65,0))","v":37},null,null,null,null,null,null,22,{"$f":"IF(CW6<22,\"\",VLOOKUP(22,CE6:CQ65,4,FALSE))","v":"BERGER MICHAL"},{"$f":"IF(CW6<22,\"\",VLOOKUP(22,CE6:CQ65,10,FALSE))","v":703},null,null,{"$f":"IF(DG27=\"\",\"\",DO27)","v":5},null,null,"Křápek Roman",123,223,152,158,178,{"$f":"SUM(DG27:DK27)","v":834},{"$f":"MAX(DG27:DK27)","v":223},{"$f":"SUM(DL27*1000)+DM27+0.32","v":834223.32},{"$f":"IF(DG27=\"\",\"\",RANK(DN27,DN6:DN65,0))","v":5},null,null,null,null,null,null,22,{"$f":"IF(DU6<22,\"\",VLOOKUP(22,DC6:DO65,4,FALSE))","v":"Brejcha Jaroslav"},{"$f":"IF(DU6<22,\"\",VLOOKUP(22,DC6:DO65,10,FALSE))","v":718},null,null,{"$f":"IF(EE27=\"\",\"\",EM27)","v":19},null,null,"Brož Stanislav",140,181,127,155,120,{"$f":"SUM(EE27:EI27)","v":723},{"$f":"MAX(EE27:EI27)","v":181},{"$f":"SUM(EJ27*1000)+EK27+0.32","v":723181.32},{"$f":"IF(EE27=\"\",\"\",RANK(EL27,EL6:EL65,0))","v":19},null,null,null,null,null,null,22,{"$f":"IF(ES6<22,\"\",VLOOKUP(22,EA6:EM65,4,FALSE))","v":"Táborský Lukáš"},{"$f":"IF(ES6<22,\"\",VLOOKUP(22,EA6:EM65,10,FALSE))","v":695},null,null,{"$f":"IF(FC27=\"\",\"\",FK27)","v":13},null,null,"Kročil Tomáš",183,168,178,142,125,{"$f":"SUM(FC27:FG27)","v":796},{"$f":"MAX(FC27:FG27)","v":183},{"$f":"SUM(FH27*1000)+FI27+0.32","v":796183.32},{"$f":"IF(FC27=\"\",\"\",RANK(FJ27,FJ6:FJ65,0))","v":13},null,null,null,null,null,null,22,{"$f":"IF(FQ6<22,\"\",VLOOKUP(22,EY6:FL65,4,FALSE))","v":"Alba Vladimír"},{"$f":"IF(FQ6<22,\"\",VLOOKUP(22,EY6:FL65,10,FALSE))","v":722},null,null,{"$f":"IF(GA27=\"\",\"\",GI27)","v":""},null,null,null,null,null,null,null,null,{"$f":"SUM(GA27:GE27)","v":0},{"$f":"MAX(GA27:GE27)","v":0},{"$f":"SUM(GF27*1000)+GG27+0.32","v":0.32},{"$f":"IF(GA27=\"\",\"\",RANK(GH27,GH6:GH70,0))","v":""},null,null,null,null,null,null,22,{"$f":"IF(GO6<22,\"\",VLOOKUP(22,FW6:GI70,4,FALSE))","v":""},{"$f":"IF(GO6<22,\"\",VLOOKUP(22,FW6:GI70,10,FALSE))","v":""}]
[null,null,null,null,null,null,null,null,null,null,null,null,null,null,{"$f":"IF(S28=\"\",\"\",AA28)","v":20},null,null,"RADOVÁ PETRA",141,155,140,139,143,{"$f":"SUM(S28:W28)","v":718},{"$f":"MAX(S28:W28)","v":155},{"$f":"SUM(X28*1000)+Y28+0.31","v":718155.31},{"$f":"IF(S28=\"\",\"\",RANK(Z28,Z6:Z65,0))","v":20},null,null,null,null,23,{"$f":"IF(AE6<23,\"\",VLOOKUP(23,O6:AA65,4,FALSE))","v":"MYSLIVEČEK JAROSLAV"},{"$f":"IF(AE6<23,\"\",VLOOKUP(23,O6:AA65,10,FALSE))","v":702},null,null,{"$f":"IF(AO28=\"\",\"\",AW28)","v":6},null,null,"POSPÍŠIL VÁCLAV",194,218,150,158,156,{"$f":"SUM(AO28:AS28)","v":876},{"$f":"MAX(AO28:AS28)","v":218},{"$f":"SUM(AT28*1000)+AU28+0.31","v":876218.31},{"$f":"IF(AO28=\"\",\"\",RANK(AV28,AV6:AV65,0))","v":6},null,null,null,null,23,{"$f":"IF(BA6<23,\"\",VLOOKUP(23,AK6:AW65,4,FALSE))","v":"ALBA VLADIMÍR"},{"$f":"IF(BA6<23,\"\",VLOOKUP(23,AK6:AW65,10,FALSE))","v":701},null,null,{"$f":"IF(BK28=\"\",\"\",BS28)","v":45},null,null,"ŘEHÁK JAROSLAV",103,108,128,135,93,{"$f":"SUM(BK28:BO28)","v":567},{"$f":"MAX(BK28:BO28)","v":135},{"$f":"SUM(BP28*1000)+BQ28+0.31","v":567135.31000000006},{"$f":"IF(BK28=\"\",\"\",RANK(BR28,BR6:BR65,0))","v":45},null,null,null,null,null,null,23,{"$f":"IF(BY6<23,\"\",VLOOKUP(23,BG6:BS65,4,FALSE))","v":"FRONĚK MARTIN"},{"$f":"IF(BY6<23,\"\",VLOOKUP(23,BG6:BS65,10,FALSE))","v":720},null,null,{"$f":"IF(CI28=\"\",\"\",CQ28)","v":39},null,null,"POSPÍŠIL LUKÁŠ",104,124,87,133,135,{"$f":"SUM(CI28:CM28)","v":583},{"$f":"MAX(CI28:CM28)","v":135},{"$f":"SUM(CN28*1000)+CO28+0.31","v":583135.31000000006},{"$f":"IF(CI28=\"\",\"\",RANK(CP28,CP6:CP65,0))","v":39},null,null,null,null,null,null,23,{"$f":"IF(CW6<23,\"\",VLOOKUP(23,CE6:CQ65,4,FALSE))","v":"KAZDA JAN"},{"$f":"IF(CW6<23,\"\",VLOOKUP(23,CE6:CQ65,10,FALSE))","v":700},null,null,{"$f":"IF(DG28=\"\",\"\",DO28)","v":25},null,null,"Lazurová Jiřina",145,119,166,141,133,{"$f":"SUM(DG28:DK28)","v":704},{"$f":"MAX(DG28:DK28)","v":166},{"$f":"SUM(DL28*1000)+DM28+0.31","v":704166.31},{"$f":"IF(DG28=\"\",\"\",RANK(DN28,DN6:DN65,0))","v":25},null,null,null,null,null,null,23,{"$f":"IF(DU6<23,\"\",VLOOKUP(23,DC6:DO65,4,FALSE))","v":"Růžička Ladislav"},{"$f":"IF(DU6<23,\"\",VLOOKUP(23,DC6:DO65,10,FALSE))","v":717},null,null,{"$f":"IF(EE28=\"\",\"\",EM28)","v":26},null,null,"Radová Petra",121,127,138,155,144,{"$f":"SUM(EE28:EI28)","v":685},{"$f":"MAX(EE28:EI28)","v":155},{"$f":"SUM(EJ28*1000)+EK28+0.31","v":685155.31},{"$f":"IF(EE28=\"\",\"\",RANK(EL28,EL6:EL65,0))","v":26},null,null,null,null,null,null,23,{"$f":"IF(ES6<23,\"\",VLOOKUP(23,EA6:EM65,4,FALSE))","v":"Kollár Pavel"},{"$f":"IF(ES6<23,\"\",VLOOKUP(23,EA6:EM65,10,FALSE))","v":695},null,null,{"$f":"IF(FC28=\"\",\"\",FK28)","v":6},null,null,"Pospíšil Václav",174,148,167,171,184,{"$f":"SUM(FC28:FG28)","v":844},{"$f":"MAX(FC28:FG28)","v":184},{"$f":"SUM(FH28*1000)+FI28+0.31","v":844184.31},{"$f":"IF(FC28=\"\",\"\",RANK(FJ28,FJ6:FJ65,0))","v":6},null,null,null,null,null,null,23,{"$f":"IF(FQ6<23,\"\",VLOOKUP(23,EY6:FL65,4,FALSE))","v":"Mysliveček Jaroslav"},{"$f":"IF(FQ6<23,\"\",VLOOKUP(23,EY6:FL65,10,FALSE))","v":717},null,null,{"$f":"IF(GA28=\"\",\"\",GI28)","v":""},null,null,null,null,null,null,null,null,{"$f":"SUM(GA28:GE28)","v":0},{"$f":"MAX(GA28:GE28)","v":0},{"$f":"SUM(GF28*1000)+GG28+0.31","v":0.31},{"$f":"IF(GA28=\"\",\"\",RANK(GH28,GH6:GH70,0))","v":""},null,null,null,null,null,null,23,{"$f":"IF(GO6<23,\"\",VLOOKUP(23,FW6:GI70,4,FALSE))","v":""},{"$f":"IF(GO6<23,\"\",VLOOKUP(23,FW6:GI70,10,FALSE))","v":""}]
[null,null,null,null,null,null,null,null,null,null,null,null,null,null,null,null,null,null,{"$f":"SUM(S24:S28)","v":583},{"$f":"SUM(T24:T28)","v":639},{"$f":"SUM(U24:U28)","v":668},{"$f":"SUM(V24:V28)","v":618},{"$f":"SUM(W24:W28)","v":590},null,null,null,null,{"$f":"SUM(S29:W29)","v":3098},null,null,null,24,{"$f":"IF(AE6<24,\"\",VLOOKUP(24,O6:AA65,4,FALSE))","v":"TROLLER PAVEL"},{"$f":"IF(AE6<24,\"\",VLOOKUP(24,O6:AA65,10,FALSE))","v":691},null,null,null,null,null,null,{"$f":"SUM(AO24:AO28)","v":874},{"$f":"SUM(AP24:AP28)","v":838},{"$f":"SUM(AQ24:AQ28)","v":758},{"$f":"SUM(AR24:AR28)","v":740},{"$f":"SUM(AS24:AS28)","v":781},null,null,null,null,{"$f":"SUM(AO29:AS29)","v":3991},null,null,null,24,{"$f":"IF(BA6<24,\"\",VLOOKUP(24,AK6:AW65,4,FALSE))","v":"SLADOVNÍK MILOSLAV"},{"$f":"IF(BA6<24,\"\",VLOOKUP(24,AK6:AW65,10,FALSE))","v":693},null,null,null,null,null,null,{"$f":"SUM(BK24:BK28)","v":531},{"$f":"SUM(BL24:BL28)","v":597},{"$f":"SUM(BM24:BM28)","v":670},{"$f":"SUM(BN24:BN28)","v":638},{"$f":"SUM(BO24:BO28)","v":561},null,null,null,null,{"$f":"SUM(BK29:BO29)","v":2997},{"$f":"MAX(BK29:BO29)","v":670},{"$f":"IF(BK24=\"\",\"\",SUM(BT29*10000)+BU29)","v":29970670},null,null,null,24,{"$f":"IF(BY6<24,\"\",VLOOKUP(24,BG6:BS65,4,FALSE))","v":"TICHÝ HUGO"},{"$f":"IF(BY6<24,\"\",VLOOKUP(24,BG6:BS65,10,FALSE))","v":711},null,null,null,null,null,null,{"$f":"SUM(CI24:CI28)","v":689},{"$f":"SUM(CJ24:CJ28)","v":597},{"$f":"SUM(CK24:CK28)","v":557},{"$f":"SUM(CL24:CL28)","v":659},{"$f":"SUM(CM24:CM28)","v":656},null,null,null,null,{"$f":"SUM(CI29:CM29)","v":3158},{"$f":"MAX(CI29:CM29)","v":689},{"$f":"IF(CI24=\"\",\"\",SUM(CR29*1000)+CS29)","v":3158689},null,null,null,24,{"$f":"IF(CW6<24,\"\",VLOOKUP(24,CE6:CQ65,4,FALSE))","v":"RADOVÁ PETRA"},{"$f":"IF(CW6<24,\"\",VLOOKUP(24,CE6:CQ65,10,FALSE))","v":688},null,null,null,null,null,null,{"$f":"SUM(DG24:DG28)","v":688},{"$f":"SUM(DH24:DH28)","v":737},{"$f":"SUM(DI24:DI28)","v":654},{"$f":"SUM(DJ24:DJ28)","v":730},{"$f":"SUM(DK24:DK28)","v":674},null,null,null,null,{"$f":"SUM(DG29:DK29)","v":3483},{"$f":"MAX(DG29:DK29)","v":737},{"$f":"IF(DG24=\"\",\"\",SUM(DP29*1000)+DQ29)","v":3483737},null,null,null,24,{"$f":"IF(DU6<24,\"\",VLOOKUP(24,DC6:DO65,4,FALSE))","v":"Radová Petra"},{"$f":"IF(DU6<24,\"\",VLOOKUP(24,DC6:DO65,10,FALSE))","v":717},null,null,null,null,null,null,{"$f":"SUM(EE24:EE28)","v":703},{"$f":"SUM(EF24:EF28)","v":692},{"$f":"SUM(EG24:EG28)","v":677},{"$f":"SUM(EH24:EH28)","v":634},{"$f":"SUM(EI24:EI28)","v":647},null,null,null,null,{"$f":"SUM(EE29:EI29)","v":3353},{"$f":"MAX(EE29:EI29)","v":703},{"$f":"IF(EE24=\"\",\"\",SUM(EN29*1000)+EO29)","v":3353703},null,null,null,24,{"$f":"IF(ES6<24,\"\",VLOOKUP(24,EA6:EM65,4,FALSE))","v":"Kazda Jan"},{"$f":"IF(ES6<24,\"\",VLOOKUP(24,EA6:EM65,10,FALSE))","v":694},null,null,null,null,null,null,{"$f":"SUM(FC24:FC28)","v":797},{"$f":"SUM(FD24:FD28)","v":863},{"$f":"SUM(FE24:FE28)","v":834},{"$f":"SUM(FF24:FF28)","v":830},{"$f":"SUM(FG24:FG28)","v":781},null,null,null,null,{"$f":"SUM(FC29:FG29)","v":4105},{"$f":"MAX(FC29:FG29)","v":863},{"$f":"IF(FC24=\"\",\"\",SUM(FL29*1000)+FM29)","v":4105863},null,null,null,24,{"$f":"IF(FQ6<24,\"\",VLOOKUP(24,EY6:FL65,4,FALSE))","v":"Táborský Lukáš"},{"$f":"IF(FQ6<24,\"\",VLOOKUP(24,EY6:FL65,10,FALSE))","v":697},null,null,null,null,null,null,{"$f":"SUM(GA24:GA28)","v":0},{"$f":"SUM(GB24:GB28)","v":0},{"$f":"SUM(GC24:GC28)","v":0},{"$f":"SUM(GD24:GD28)","v":0},{"$f":"SUM(GE24:GE28)","v":0},null,null,null,null,{"$f":"SUM(GA29:GE29)","v":0},{"$f":"MAX(GA29:GE29)","v":0},{"$f":"IF(GA24=\"\",\"\",SUM(GJ29*1000)+GK29)","v":""},null,null,null,24,{"$f":"IF(GO6<24,\"\",VLOOKUP(24,FW6:GI70,4,FALSE))","v":""},{"$f":"IF(GO6<24,\"\",VLOOKUP(24,FW6:GI70,10,FALSE))","v":""}]
[null,null,null,null,null,null,null,null,null,null,null,null,null,null,{"$f":"IF(S30=\"\",\"\",AA30)","v":32},5,"HOSTIVAŘ I.","KŘÁPEK ROMAN",115,155,107,145,115,{"$f":"SUM(S30:W30)","v":637},{"$f":"MAX(S30:W30)","v":155},{"$f":"SUM(X30*1000)+Y30+0.3","v":637155.30000000005},{"$f":"IF(S30=\"\",\"\",RANK(Z30,Z6:Z65,0))","v":32},null,{"$f":"RANK(AB35,AB11:AB65,0)","v":2},null,null,25,{"$f":"IF(AE6<25,\"\",VLOOKUP(25,O6:AA65,4,FALSE))","v":"KALFIŘT PETR"},{"$f":"IF(AE6<25,\"\",VLOOKUP(25,O6:AA65,10,FALSE))","v":680},null,null,{"$f":"IF(AO30=\"\",\"\",AW30)","v":19},5,"KAČEROV I.","TOMÁŠEK ZDENĚK",135,143,134,184,132,{"$f":"SUM(AO30:AS30)","v":728},{"$f":"MAX(AO30:AS30)","v":184},{"$f":"SUM(AT30*1000)+AU30+0.3","v":728184.3},{"$f":"IF(AO30=\"\",\"\",RANK(AV30,AV6:AV65,0))","v":19},null,{"$f":"RANK(AX35,AX11:AX65,0)","v":4},null,null,25,{"$f":"IF(BA6<25,\"\",VLOOKUP(25,AK6:AW65,4,FALSE))","v":"BROŽ STANISLAV"},{"$f":"IF(BA6<25,\"\",VLOOKUP(25,AK6:AW65,10,FALSE))","v":693},null,null,{"$f":"IF(BK30=\"\",\"\",BS30)","v":31},5,"ŘEPY I.","SEHNAL IVAN",141,139,187,103,110,{"$f":"SUM(BK30:BO30)","v":680},{"$f":"MAX(BK30:BO30)","v":187},{"$f":"SUM(BP30*1000)+BQ30+0.3","v":680187.3},{"$f":"IF(BK30=\"\",\"\",RANK(BR30,BR6:BR65,0))","v":31},null,null,null,{"$f":"IF(BK30=\"\",\"\",RANK(BV35,BV11:BV65,0))","v":7},null,null,25,{"$f":"IF(BY6<25,\"\",VLOOKUP(25,BG6:BS65,4,FALSE))","v":"CARVAN PAVEL"},{"$f":"IF(BY6<25,\"\",VLOOKUP(25,BG6:BS65,10,FALSE))","v":705},null,null,{"$f":"IF(CI30=\"\",\"\",CQ30)","v":45},5,"KLÍČOV I.","HÁJEK MOJMÍR",116,151,75,91,116,{"$f":"SUM(CI30:CM30)","v":549},{"$f":"MAX(CI30:CM30)","v":151},{"$f":"SUM(CN30*1000)+CO30+0.3","v":549151.30000000005},{"$f":"IF(CI30=\"\",\"\",RANK(CP30,CP6:CP65,0))","v":45},null,null,null,{"$f":"IF(CI30=\"\",\"\",RANK(CT35,CT11:CT65,0))","v":6},null,null,25,{"$f":"IF(CW6<25,\"\",VLOOKUP(25,CE6:CQ65,4,FALSE))","v":"KUTINA PAVEL"},{"$f":"IF(CW6<25,\"\",VLOOKUP(25,CE6:CQ65,10,FALSE))","v":682},null,null,{"$f":"IF(DG30=\"\",\"\",DO30)","v":1},5,"VRŠOVICE I.","Krupa Jozef",201,205,199,171,183,{"$f":"SUM(DG30:DK30)","v":959},{"$f":"MAX(DG30:DK30)","v":205},{"$f":"SUM(DL30*1000)+DM30+0.3","v":959205.3},{"$f":"IF(DG30=\"\",\"\",RANK(DN30,DN6:DN65,0))","v":1},null,null,null,{"$f":"IF(DG30=\"\",\"\",RANK(DR35,DR11:DR65,0))","v":1},null,null,25,{"$f":"IF(DU6<25,\"\",VLOOKUP(25,DC6:DO65,4,FALSE))","v":"Lazurová Jiřina"},{"$f":"IF(DU6<25,\"\",VLOOKUP(25,DC6:DO65,10,FALSE))","v":704},null,null,{"$f":"IF(EE30=\"\",\"\",EM30)","v":35},5,"HOSTIVAŘ I.","Křápek Roman",111,105,133,139,145,{"$f":"SUM(EE30:EI30)","v":633},{"$f":"MAX(EE30:EI30)","v":145},{"$f":"SUM(EJ30*1000)+EK30+0.3","v":633145.30000000005},{"$f":"IF(EE30=\"\",\"\",RANK(EL30,EL6:EL65,0))","v":35},null,null,null,{"$f":"IF(EE30=\"\",\"\",RANK(EP35,EP11:EP65,0))","v":3},null,null,25,{"$f":"IF(ES6<25,\"\",VLOOKUP(25,EA6:EM65,4,FALSE))","v":"Brejcha Jaroslav"},{"$f":"IF(ES6<25,\"\",VLOOKUP(25,EA6:EM65,10,FALSE))","v":691},null,null,{"$f":"IF(FC30=\"\",\"\",FK30)","v":11},5,"KAČEROV I.","Hübner Jiří",157,208,177,123,138,{"$f":"SUM(FC30:FG30)","v":803},{"$f":"MAX(FC30:FG30)","v":208},{"$f":"SUM(FH30*1000)+FI30+0.3","v":803208.3},{"$f":"IF(FC30=\"\",\"\",RANK(FJ30,FJ6:FJ65,0))","v":11},null,null,null,{"$f":"IF(FC30=\"\",\"\",RANK(FN35,FN11:FN65,0))","v":5},null,null,25,{"$f":"IF(FQ6<25,\"\",VLOOKUP(25,EY6:FL65,4,FALSE))","v":"Křemenák Petr"},{"$f":"IF(FQ6<25,\"\",VLOOKUP(25,EY6:FL65,10,FALSE))","v":687},null,null,{"$f":"IF(GA30=\"\",\"\",GI30)","v":""},5,"HOSTIVAŘ I.",null,null,null,null,null,null,{"$f":"SUM(GA30:GE30)","v":0},{"$f":"MAX(GA30:GE30)","v":0},{"$f":"SUM(GF30*1000)+GG30+0.3","v":0.3},{"$f":"IF(GA30=\"\",\"\",RANK(GH30,GH6:GH70,0))","v":""},null,null,null,{"$f":"IF(GA30=\"\",\"\",RANK(GL35,GL11:GL71,0))","v":""},null,null,25,{"$f":"IF(GO6<25,\"\",VLOOKUP(25,FW6:GI70,4,FALSE))","v":""},{"$f":"IF(GO6<25,\"\",VLOOKUP(25,FW6:GI70,10,FALSE))","v":""}]
[null,null,null,null,null,null,null,null,null,null,null,null,null,null,{"$f":"IF(S31=\"\",\"\",AA31)","v":18},null,null,"JELÍNEK JAN",143,158,165,135,126,{"$f":"SUM(S31:W31)","v":727},{"$f":"MAX(S31:W31)","v":165},{"$f":"SUM(X31*1000)+Y31+0.29","v":727165.29},{"$f":"IF(S31=\"\",\"\",RANK(Z31,Z6:Z65,0))","v":18},null,null,null,null,26,{"$f":"IF(AE6<26,\"\",VLOOKUP(26,O6:AA65,4,FALSE))","v":"KOVÁŘ JAROSLAV"},{"$f":"IF(AE6<26,\"\",VLOOKUP(26,O6:AA65,10,FALSE))","v":673},null,null,{"$f":"IF(AO31=\"\",\"\",AW31)","v":27},null,null,"RADOVÁ PETRA",121,152,148,121,144,{"$f":"SUM(AO31:AS31)","v":686},{"$f":"MAX(AO31:AS31)","v":152},{"$f":"SUM(AT31*1000)+AU31+0.29","v":686152.29},{"$f":"IF(AO31=\"\",\"\",RANK(AV31,AV6:AV65,0))","v":27},null,null,null,null,26,{"$f":"IF(BA6<26,\"\",VLOOKUP(26,AK6:AW65,4,FALSE))","v":"BERGER MICHAL"},{"$f":"IF(BA6<26,\"\",VLOOKUP(26,AK6:AW65,10,FALSE))","v":689},null,null,{"$f":"IF(BK31=\"\",\"\",BS31)","v":24},null,null,"TICHÝ HUGO",118,123,124,180,166,{"$f":"SUM(BK31:BO31)","v":711},{"$f":"MAX(BK31:BO31)","v":180},{"$f":"SUM(BP31*1000)+BQ31+0.29","v":711180.29},{"$f":"IF(BK31=\"\",\"\",RANK(BR31,BR6:BR65,0))","v":24},null,null,null,null,null,null,26,{"$f":"IF(BY6<26,\"\",VLOOKUP(26,BG6:BS65,4,FALSE))","v":"KŘEMENÁK PETR"},{"$f":"IF(BY6<26,\"\",VLOOKUP(26,BG6:BS65,10,FALSE))","v":703},null,null,{"$f":"IF(CI31=\"\",\"\",CQ31)","v":8},null,null,"KALFIŘT PETR",131,181,138,163,194,{"$f":"SUM(CI31:CM31)","v":807},{"$f":"MAX(CI31:CM31)","v":194},{"$f":"SUM(CN31*1000)+CO31+0.29","v":807194.29},{"$f":"IF(CI31=\"\",\"\",RANK(CP31,CP6:CP65,0))","v":8},null,null,null,null,null,null,26,{"$f":"IF(CW6<26,\"\",VLOOKUP(26,CE6:CQ65,4,FALSE))","v":"ČÍHAL FRANTIŠEK"},{"$f":"IF(CW6<26,\"\",VLOOKUP(26,CE6:CQ65,10,FALSE))","v":681},null,null,{"$f":"IF(DG31=\"\",\"\",DO31)","v":6},null,null,"Podhola Martin",172,144,173,185,152,{"$f":"SUM(DG31:DK31)","v":826},{"$f":"MAX(DG31:DK31)","v":185},{"$f":"SUM(DL31*1000)+DM31+0.29","v":826185.29},{"$f":"IF(DG31=\"\",\"\",RANK(DN31,DN6:DN65,0))","v":6},null,null,null,null,null,null,26,{"$f":"IF(DU6<26,\"\",VLOOKUP(26,DC6:DO65,4,FALSE))","v":"Hübner Jiří"},{"$f":"IF(DU6<26,\"\",VLOOKUP(26,DC6:DO65,10,FALSE))","v":703},null,null,{"$f":"IF(EE31=\"\",\"\",EM31)","v":30},null,null,"Růžička Ladislav",123,137,137,142,125,{"$f":"SUM(EE31:EI31)","v":664},{"$f":"MAX(EE31:EI31)","v":142},{"$f":"SUM(EJ31*1000)+EK31+0.29","v":664142.29},{"$f":"IF(EE31=\"\",\"\",RANK(EL31,EL6:EL65,0))","v":30},null,null,null,null,null,null,26,{"$f":"IF(ES6<26,\"\",VLOOKUP(26,EA6:EM65,4,FALSE))","v":"Radová Petra"},{"$f":"IF(ES6<26,\"\",VLOOKUP(26,EA6:EM65,10,FALSE))","v":685},null,null,{"$f":"IF(FC31=\"\",\"\",FK31)","v":34},null,null,"Turek Stanislav",100,103,168,141,137,{"$f":"SUM(FC31:FG31)","v":649},{"$f":"MAX(FC31:FG31)","v":168},{"$f":"SUM(FH31*1000)+FI31+0.29","v":649168.29},{"$f":"IF(FC31=\"\",\"\",RANK(FJ31,FJ6:FJ65,0))","v":34},null,null,null,null,null,null,26,{"$f":"IF(FQ6<26,\"\",VLOOKUP(26,EY6:FL65,4,FALSE))","v":"Kazda Jan"},{"$f":"IF(FQ6<26,\"\",VLOOKUP(26,EY6:FL65,10,FALSE))","v":682},null,null,{"$f":"IF(GA31=\"\",\"\",GI31)","v":""},null,null,null,null,null,null,null,null,{"$f":"SUM(GA31:GE31)","v":0},{"$f":"MAX(GA31:GE31)","v":0},{"$f":"SUM(GF31*1000)+GG31+0.29","v":0.28999999999999998},{"$f":"IF(GA31=\"\",\"\",RANK(GH31,GH6:GH70,0))","v":""},null,null,null,null,null,null,26,{"$f":"IF(GO6<26,\"\",VLOOKUP(26,FW6:GI70,4,FALSE))","v":""},{"$f":"IF(GO6<26,\"\",VLOOKUP(26,FW6:GI70,10,FALSE))","v":""}]
[null,null,null,null,null,null,null,null,null,null,null,null,null,null,{"$f":"IF(S32=\"\",\"\",AA32)","v":16},null,null,"RŮŽIČKA LADISLAV",133,162,155,128,166,{"$f":"SUM(S32:W32)","v":744},{"$f":"MAX(S32:W32)","v":166},{"$f":"SUM(X32*1000)+Y32+0.28","v":744166.28},{"$f":"IF(S32=\"\",\"\",RANK(Z32,Z6:Z65,0))","v":16},null,null,null,null,27,{"$f":"IF(AE6<27,\"\",VLOOKUP(27,O6:AA65,4,FALSE))","v":"MOTTL PAVEL"},{"$f":"IF(AE6<27,\"\",VLOOKUP(27,O6:AA65,10,FALSE))","v":664},null,null,{"$f":"IF(AO32=\"\",\"\",AW32)","v":11},null,null,"ONDŘICH FRANTIŠEK",145,176,138,173,183,{"$f":"SUM(AO32:AS32)","v":815},{"$f":"MAX(AO32:AS32)","v":183},{"$f":"SUM(AT32*1000)+AU32+0.28","v":815183.28},{"$f":"IF(AO32=\"\",\"\",RANK(AV32,AV6:AV65,0))","v":11},null,null,null,null,27,{"$f":"IF(BA6<27,\"\",VLOOKUP(27,AK6:AW65,4,FALSE))","v":"RADOVÁ PETRA"},{"$f":"IF(BA6<27,\"\",VLOOKUP(27,AK6:AW65,10,FALSE))","v":686},null,null,{"$f":"IF(BK32=\"\",\"\",BS32)","v":47},null,null,"KŘIKAVA MIROSLAV",115,126,98,99,98,{"$f":"SUM(BK32:BO32)","v":536},{"$f":"MAX(BK32:BO32)","v":126},{"$f":"SUM(BP32*1000)+BQ32+0.28","v":536126.28},{"$f":"IF(BK32=\"\",\"\",RANK(BR32,BR6:BR65,0))","v":47},null,null,null,null,null,null,27,{"$f":"IF(BY6<27,\"\",VLOOKUP(27,BG6:BS65,4,FALSE))","v":"HÁJEK MOJMÍR"},{"$f":"IF(BY6<27,\"\",VLOOKUP(27,BG6:BS65,10,FALSE))","v":699},null,null,{"$f":"IF(CI32=\"\",\"\",CQ32)","v":32},null,null,"KŘEMENÁK PETR",124,144,114,113,143,{"$f":"SUM(CI32:CM32)","v":638},{"$f":"MAX(CI32:CM32)","v":144},{"$f":"SUM(CN32*1000)+CO32+0.28","v":638144.28},{"$f":"IF(CI32=\"\",\"\",RANK(CP32,CP6:CP65,0))","v":32},null,null,null,null,null,null,27,{"$f":"IF(CW6<27,\"\",VLOOKUP(27,CE6:CQ65,4,FALSE))","v":"BOŠEK JAN"},{"$f":"IF(CW6<27,\"\",VLOOKUP(27,CE6:CQ65,10,FALSE))","v":675},null,null,{"$f":"IF(DG32=\"\",\"\",DO32)","v":2},null,null,"Holkup Jan",235,146,166,187,178,{"$f":"SUM(DG32:DK32)","v":912},{"$f":"MAX(DG32:DK32)","v":235},{"$f":"SUM(DL32*1000)+DM32+0.28","v":912235.28},{"$f":"IF(DG32=\"\",\"\",RANK(DN32,DN6:DN65,0))","v":2},null,null,null,null,null,null,27,{"$f":"IF(DU6<27,\"\",VLOOKUP(27,DC6:DO65,4,FALSE))","v":"Mysliveček Jaroslav"},{"$f":"IF(DU6<27,\"\",VLOOKUP(27,DC6:DO65,10,FALSE))","v":701},null,null,{"$f":"IF(EE32=\"\",\"\",EM32)","v":13},null,null,"Jelínek Jan",134,142,134,164,201,{"$f":"SUM(EE32:EI32)","v":775},{"$f":"MAX(EE32:EI32)","v":201},{"$f":"SUM(EJ32*1000)+EK32+0.28","v":775201.28000000003},{"$f":"IF(EE32=\"\",\"\",RANK(EL32,EL6:EL65,0))","v":13},null,null,null,null,null,null,27,{"$f":"IF(ES6<27,\"\",VLOOKUP(27,EA6:EM65,4,FALSE))","v":"Hübner Jiří"},{"$f":"IF(ES6<27,\"\",VLOOKUP(27,EA6:EM65,10,FALSE))","v":677},null,null,{"$f":"IF(FC32=\"\",\"\",FK32)","v":10},null,null,"Ondřich František",200,138,144,163,164,{"$f":"SUM(FC32:FG32)","v":809},{"$f":"MAX(FC32:FG32)","v":200},{"$f":"SUM(FH32*1000)+FI32+0.28","v":809200.28},{"$f":"IF(FC32=\"\",\"\",RANK(FJ32,FJ6:FJ65,0))","v":10},null,null,null,null,null,null,27,{"$f":"IF(FQ6<27,\"\",VLOOKUP(27,EY6:FL65,4,FALSE))","v":"Brejcha Jaroslav"},{"$f":"IF(FQ6<27,\"\",VLOOKUP(27,EY6:FL65,10,FALSE))","v":681},null,null,{"$f":"IF(GA32=\"\",\"\",GI32)","v":""},null,null,null,null,null,null,null,null,{"$f":"SUM(GA32:GE32)","v":0},{"$f":"MAX(GA32:GE32)","v":0},{"$f":"SUM(GF32*1000)+GG32+0.28","v":0.28000000000000003},{"$f":"IF(GA32=\"\",\"\",RANK(GH32,GH6:GH70,0))","v":""},null,null,null,null,null,null,27,{"$f":"IF(GO6<27,\"\",VLOOKUP(27,FW6:GI70,4,FALSE))","v":""},{"$f":"IF(GO6<27,\"\",VLOOKUP(27,FW6:GI70,10,FALSE))","v":""}]
[null,null,null,null,null,null,null,null,null,null,null,null,null,null,{"$f":"IF(S33=\"\",\"\",AA33)","v":1},null,null,"ŠAFAŘÍK LUDĚK",188,156,153,231,200,{"$f":"SUM(S33:W33)","v":928},{"$f":"MAX(S33:W33)","v":231},{"$f":"SUM(X33*1000)+Y33+0.27","v":928231.27},{"$f":"IF(S33=\"\",\"\",RANK(Z33,Z6:Z65,0))","v":1},null,null,null,null,28,{"$f":"IF(AE6<28,\"\",VLOOKUP(28,O6:AA65,4,FALSE))","v":"TÁBORSKÝ LUKÁŠ"},{"$f":"IF(AE6<28,\"\",VLOOKUP(28,O6:AA65,10,FALSE))","v":661},null,null,{"$f":"IF(AO33=\"\",\"\",AW33)","v":10},null,null,"MAŠÁT PETR",167,172,158,151,178,{"$f":"SUM(AO33:AS33)","v":826},{"$f":"MAX(AO33:AS33)","v":178},{"$f":"SUM(AT33*1000)+AU33+0.27","v":826178.27},{"$f":"IF(AO33=\"\",\"\",RANK(AV33,AV6:AV65,0))","v":10},null,null,null,null,28,{"$f":"IF(BA6<28,\"\",VLOOKUP(28,AK6:AW65,4,FALSE))","v":"LOKVENC JIŘÍ"},{"$f":"IF(BA6<28,\"\",VLOOKUP(28,AK6:AW65,10,FALSE))","v":686},null,null,{"$f":"IF(BK33=\"\",\"\",BS33)","v":6},null,null,"MOTTL PAVEL",201,153,168,197,119,{"$f":"SUM(BK33:BO33)","v":838},{"$f":"MAX(BK33:BO33)","v":201},{"$f":"SUM(BP33*1000)+BQ33+0.27","v":838201.27},{"$f":"IF(BK33=\"\",\"\",RANK(BR33,BR6:BR65,0))","v":6},null,null,null,null,null,null,28,{"$f":"IF(BY6<28,\"\",VLOOKUP(28,BG6:BS65,4,FALSE))","v":"RADOVÁ PETRA"},{"$f":"IF(BY6<28,\"\",VLOOKUP(28,BG6:BS65,10,FALSE))","v":684},null,null,{"$f":"IF(CI33=\"\",\"\",CQ33)","v":38},null,null,"NOVOTNÁ PETRA",91,121,130,129,123,{"$f":"SUM(CI33:CM33)","v":594},{"$f":"MAX(CI33:CM33)","v":130},{"$f":"SUM(CN33*1000)+CO33+0.27","v":594130.27},{"$f":"IF(CI33=\"\",\"\",RANK(CP33,CP6:CP65,0))","v":38},null,null,null,null,null,null,28,{"$f":"IF(CW6<28,\"\",VLOOKUP(28,CE6:CQ65,4,FALSE))","v":"JELÍNEK JAN"},{"$f":"IF(CW6<28,\"\",VLOOKUP(28,CE6:CQ65,10,FALSE))","v":666},null,null,{"$f":"IF(DG33=\"\",\"\",DO33)","v":29},null,null,"Kovář Jaroslav",152,107,148,164,117,{"$f":"SUM(DG33:DK33)","v":688},{"$f":"MAX(DG33:DK33)","v":164},{"$f":"SUM(DL33*1000)+DM33+0.27","v":688164.27},{"$f":"IF(DG33=\"\",\"\",RANK(DN33,DN6:DN65,0))","v":29},null,null,null,null,null,null,28,{"$f":"IF(DU6<28,\"\",VLOOKUP(28,DC6:DO65,4,FALSE))","v":"Pospíšil Lukáš"},{"$f":"IF(DU6<28,\"\",VLOOKUP(28,DC6:DO65,10,FALSE))","v":697},null,null,{"$f":"IF(EE33=\"\",\"\",EM33)","v":2},null,null,"Lazur Vladimír",191,145,197,156,212,{"$f":"SUM(EE33:EI33)","v":901},{"$f":"MAX(EE33:EI33)","v":212},{"$f":"SUM(EJ33*1000)+EK33+0.27","v":901212.27},{"$f":"IF(EE33=\"\",\"\",RANK(EL33,EL6:EL65,0))","v":2},null,null,null,null,null,null,28,{"$f":"IF(ES6<28,\"\",VLOOKUP(28,EA6:EM65,4,FALSE))","v":"Turek Stanislav"},{"$f":"IF(ES6<28,\"\",VLOOKUP(28,EA6:EM65,10,FALSE))","v":674},null,null,{"$f":"IF(FC33=\"\",\"\",FK33)","v":30},null,null,"Mašát Petr",120,141,116,136,156,{"$f":"SUM(FC33:FG33)","v":669},{"$f":"MAX(FC33:FG33)","v":156},{"$f":"SUM(FH33*1000)+FI33+0.27","v":669156.27},{"$f":"IF(FC33=\"\",\"\",RANK(FJ33,FJ6:FJ65,0))","v":30},null,null,null,null,null,null,28,{"$f":"IF(FQ6<28,\"\",VLOOKUP(28,EY6:FL65,4,FALSE))","v":"Radová Petra"},{"$f":"IF(FQ6<28,\"\",VLOOKUP(28,EY6:FL65,10,FALSE))","v":675},null,null,{"$f":"IF(GA33=\"\",\"\",GI33)","v":""},null,null,null,null,null,null,null,null,{"$f":"SUM(GA33:GE33)","v":0},{"$f":"MAX(GA33:GE33)","v":0},{"$f":"SUM(GF33*1000)+GG33+0.27","v":0.27},{"$f":"IF(GA33=\"\",\"\",RANK(GH33,GH6:GH70,0))","v":""},null,null,null,null,null,null,28,{"$f":"IF(GO6<28,\"\",VLOOKUP(28,FW6:GI70,4,FALSE))","v":""},{"$f":"IF(GO6<28,\"\",VLOOKUP(28,FW6:GI70,10,FALSE))","v":""}]
[null,null,null,null,null,null,null,null,null,null,null,null,null,null,{"$f":"IF(S34=\"\",\"\",AA34)","v":5},null,null,"LAZUR VLADIMÍR",159,160,165,176,187,{"$f":"SUM(S34:W34)","v":847},{"$f":"MAX(S34:W34)","v":187},{"$f":"SUM(X34*1000)+Y34+0.26","v":847187.26},{"$f":"IF(S34=\"\",\"\",RANK(Z34,Z6:Z65,0))","v":5},null,null,null,null,29,{"$f":"IF(AE6<29,\"\",VLOOKUP(29,O6:AA65,4,FALSE))","v":"BROŽ STANISLAV"},{"$f":"IF(AE6<29,\"\",VLOOKUP(29,O6:AA65,10,FALSE))","v":657},null,null,{"$f":"IF(AO34=\"\",\"\",AW34)","v":7},null,null,"CARVAN PAVEL",156,180,178,184,162,{"$f":"SUM(AO34:AS34)","v":860},{"$f":"MAX(AO34:AS34)","v":184},{"$f":"SUM(AT34*1000)+AU34+0.26","v":860184.26},{"$f":"IF(AO34=\"\",\"\",RANK(AV34,AV6:AV65,0))","v":7},null,null,null,null,29,{"$f":"IF(BA6<29,\"\",VLOOKUP(29,AK6:AW65,4,FALSE))","v":"POSPÍŠIL LUKÁŠ"},{"$f":"IF(BA6<29,\"\",VLOOKUP(29,AK6:AW65,10,FALSE))","v":683},null,null,{"$f":"IF(BK34=\"\",\"\",BS34)","v":21},null,null,"SLADOVNÍK MILOSLAV",126,152,146,159,144,{"$f":"SUM(BK34:BO34)","v":727},{"$f":"MAX(BK34:BO34)","v":159},{"$f":"SUM(BP34*1000)+BQ34+0.26","v":727159.26},{"$f":"IF(BK34=\"\",\"\",RANK(BR34,BR6:BR65,0))","v":21},null,null,null,null,null,null,29,{"$f":"IF(BY6<29,\"\",VLOOKUP(29,BG6:BS65,4,FALSE))","v":"BREJCHA JAROSLAV"},{"$f":"IF(BY6<29,\"\",VLOOKUP(29,BG6:BS65,10,FALSE))","v":683},null,null,{"$f":"IF(CI34=\"\",\"\",CQ34)","v":11},null,null,"ŠTĚPÁN RADEK",153,136,184,167,139,{"$f":"SUM(CI34:CM34)","v":779},{"$f":"MAX(CI34:CM34)","v":184},{"$f":"SUM(CN34*1000)+CO34+0.26","v":779184.26},{"$f":"IF(CI34=\"\",\"\",RANK(CP34,CP6:CP65,0))","v":11},null,null,null,null,null,null,29,{"$f":"IF(CW6<29,\"\",VLOOKUP(29,CE6:CQ65,4,FALSE))","v":"BROŽ STANISLAV"},{"$f":"IF(CW6<29,\"\",VLOOKUP(29,CE6:CQ65,10,FALSE))","v":666},null,null,{"$f":"IF(DG34=\"\",\"\",DO34)","v":11},null,null,"Skružná Pavla",150,162,181,142,160,{"$f":"SUM(DG34:DK34)","v":795},{"$f":"MAX(DG34:DK34)","v":181},{"$f":"SUM(DL34*1000)+DM34+0.26","v":795181.26},{"$f":"IF(DG34=\"\",\"\",RANK(DN34,DN6:DN65,0))","v":11},null,null,null,null,null,null,29,{"$f":"IF(DU6<29,\"\",VLOOKUP(29,DC6:DO65,4,FALSE))","v":"Kovář Jaroslav"},{"$f":"IF(DU6<29,\"\",VLOOKUP(29,DC6:DO65,10,FALSE))","v":688},null,null,{"$f":"IF(EE34=\"\",\"\",EM34)","v":1},null,null,"Šafařík Luděk",213,186,202,186,175,{"$f":"SUM(EE34:EI34)","v":962},{"$f":"MAX(EE34:EI34)","v":213},{"$f":"SUM(EJ34*1000)+EK34+0.26","v":962213.26},{"$f":"IF(EE34=\"\",\"\",RANK(EL34,EL6:EL65,0))","v":1},null,null,null,null,null,null,29,{"$f":"IF(ES6<29,\"\",VLOOKUP(29,EA6:EM65,4,FALSE))","v":"Mottl Pavel"},{"$f":"IF(ES6<29,\"\",VLOOKUP(29,EA6:EM65,10,FALSE))","v":673},null,null,{"$f":"IF(FC34=\"\",\"\",FK34)","v":9},null,null,"Carvan Pavel",160,147,150,185,168,{"$f":"SUM(FC34:FG34)","v":810},{"$f":"MAX(FC34:FG34)","v":185},{"$f":"SUM(FH34*1000)+FI34+0.26","v":810185.26},{"$f":"IF(FC34=\"\",\"\",RANK(FJ34,FJ6:FJ65,0))","v":9},null,null,null,null,null,null,29,{"$f":"IF(FQ6<29,\"\",VLOOKUP(29,EY6:FL65,4,FALSE))","v":"Kollár Pavel"},{"$f":"IF(FQ6<29,\"\",VLOOKUP(29,EY6:FL65,10,FALSE))","v":672},null,null,{"$f":"IF(GA34=\"\",\"\",GI34)","v":""},null,null,null,null,null,null,null,null,{"$f":"SUM(GA34:GE34)","v":0},{"$f":"MAX(GA34:GE34)","v":0},{"$f":"SUM(GF34*1000)+GG34+0.26","v":0.26},{"$f":"IF(GA34=\"\",\"\",RANK(GH34,GH6:GH70,0))","v":""},null,null,null,null,null,null,29,{"$f":"IF(GO6<29,\"\",VLOOKUP(29,FW6:GI70,4,FALSE))","v":""},{"$f":"IF(GO6<29,\"\",VLOOKUP(29,FW6:GI70,10,FALSE))","v":""}]
[null,null,null,null,null,null,null,null,null,null,null,null,null,null,null,null,null,null,{"$f":"SUM(S30:S34)","v":738},{"$f":"SUM(T30:T34)","v":791},{"$f":"SUM(U30:U34)","v":745},{"$f":"SUM(V30:V34)","v":815},{"$f":"SUM(W30:W34)","v":794},null,null,null,null,{"$f":"SUM(S35:W35)","v":3883},null,null,null,30,{"$f":"IF(AE6<30,\"\",VLOOKUP(30,O6:AA65,4,FALSE))","v":"KAZDA JAN"},{"$f":"IF(AE6<30,\"\",VLOOKUP(30,O6:AA65,10,FALSE))","v":655},null,null,null,null,null,null,{"$f":"SUM(AO30:AO34)","v":724},{"$f":"SUM(AP30:AP34)","v":823},{"$f":"SUM(AQ30:AQ34)","v":756},{"$f":"SUM(AR30:AR34)","v":813},{"$f":"SUM(AS30:AS34)","v":799},null,null,null,null,{"$f":"SUM(AO35:AS35)","v":3915},null,null,null,30,{"$f":"IF(BA6<30,\"\",VLOOKUP(30,AK6:AW65,4,FALSE))","v":"SEHNAL IVAN"},{"$f":"IF(BA6<30,\"\",VLOOKUP(30,AK6:AW65,10,FALSE))","v":665},null,null,null,null,null,null,{"$f":"SUM(BK30:BK34)","v":701},{"$f":"SUM(BL30:BL34)","v":693},{"$f":"SUM(BM30:BM34)","v":723},{"$f":"SUM(BN30:BN34)","v":738},{"$f":"SUM(BO30:BO34)","v":637},null,null,null,null,{"$f":"SUM(BK35:BO35)","v":3492},{"$f":"MAX(BK35:BO35)","v":738},{"$f":"IF(BK30=\"\",\"\",SUM(BT35*10000)+BU35)","v":34920738},null,null,null,30,{"$f":"IF(BY6<30,\"\",VLOOKUP(30,BG6:BS65,4,FALSE))","v":"NOVOTNÁ PETRA"},{"$f":"IF(BY6<30,\"\",VLOOKUP(30,BG6:BS65,10,FALSE))","v":681},null,null,null,null,null,null,{"$f":"SUM(CI30:CI34)","v":615},{"$f":"SUM(CJ30:CJ34)","v":733},{"$f":"SUM(CK30:CK34)","v":641},{"$f":"SUM(CL30:CL34)","v":663},{"$f":"SUM(CM30:CM34)","v":715},null,null,null,null,{"$f":"SUM(CI35:CM35)","v":3367},{"$f":"MAX(CI35:CM35)","v":733},{"$f":"IF(CI30=\"\",\"\",SUM(CR35*1000)+CS35)","v":3367733},null,null,null,30,{"$f":"IF(CW6<30,\"\",VLOOKUP(30,CE6:CQ65,4,FALSE))","v":"ONDŘICH FRANTIŠEK"},{"$f":"IF(CW6<30,\"\",VLOOKUP(30,CE6:CQ65,10,FALSE))","v":664},null,null,null,null,null,null,{"$f":"SUM(DG30:DG34)","v":910},{"$f":"SUM(DH30:DH34)","v":764},{"$f":"SUM(DI30:DI34)","v":867},{"$f":"SUM(DJ30:DJ34)","v":849},{"$f":"SUM(DK30:DK34)","v":790},null,null,null,null,{"$f":"SUM(DG35:DK35)","v":4180},{"$f":"MAX(DG35:DK35)","v":910},{"$f":"IF(DG30=\"\",\"\",SUM(DP35*1000)+DQ35)","v":4180910},null,null,null,30,{"$f":"IF(DU6<30,\"\",VLOOKUP(30,DC6:DO65,4,FALSE))","v":"Carvan Pavel"},{"$f":"IF(DU6<30,\"\",VLOOKUP(30,DC6:DO65,10,FALSE))","v":683},null,null,null,null,null,null,{"$f":"SUM(EE30:EE34)","v":772},{"$f":"SUM(EF30:EF34)","v":715},{"$f":"SUM(EG30:EG34)","v":803},{"$f":"SUM(EH30:EH34)","v":787},{"$f":"SUM(EI30:EI34)","v":858},null,null,null,null,{"$f":"SUM(EE35:EI35)","v":3935},{"$f":"MAX(EE35:EI35)","v":858},{"$f":"IF(EE30=\"\",\"\",SUM(EN35*1000)+EO35)","v":3935858},null,null,null,30,{"$f":"IF(ES6<30,\"\",VLOOKUP(30,EA6:EM65,4,FALSE))","v":"Růžička Ladislav"},{"$f":"IF(ES6<30,\"\",VLOOKUP(30,EA6:EM65,10,FALSE))","v":664},null,null,null,null,null,null,{"$f":"SUM(FC30:FC34)","v":737},{"$f":"SUM(FD30:FD34)","v":737},{"$f":"SUM(FE30:FE34)","v":755},{"$f":"SUM(FF30:FF34)","v":748},{"$f":"SUM(FG30:FG34)","v":763},null,null,null,null,{"$f":"SUM(FC35:FG35)","v":3740},{"$f":"MAX(FC35:FG35)","v":763},{"$f":"IF(FC30=\"\",\"\",SUM(FL35*1000)+FM35)","v":3740763},null,null,null,30,{"$f":"IF(FQ6<30,\"\",VLOOKUP(30,EY6:FL65,4,FALSE))","v":"Mašát Petr"},{"$f":"IF(FQ6<30,\"\",VLOOKUP(30,EY6:FL65,10,FALSE))","v":669},null,null,null,null,null,null,{"$f":"SUM(GA30:GA34)","v":0},{"$f":"SUM(GB30:GB34)","v":0},{"$f":"SUM(GC30:GC34)","v":0},{"$f":"SUM(GD30:GD34)","v":0},{"$f":"SUM(GE30:GE34)","v":0},null,null,null,null,{"$f":"SUM(GA35:GE35)","v":0},{"$f":"MAX(GA35:GE35)","v":0},{"$f":"IF(GA30=\"\",\"\",SUM(GJ35*1000)+GK35)","v":""},null,null,null,30,{"$f":"IF(GO6<30,\"\",VLOOKUP(30,FW6:GI70,4,FALSE))","v":""},{"$f":"IF(GO6<30,\"\",VLOOKUP(30,FW6:GI70,10,FALSE))","v":""}]
[null,null,null,null,null,null,null,null,null,null,null,null,null,null,{"$f":"IF(S36=\"\",\"\",AA36)","v":42},6,"HOSTIVAŘ II.","ČERMÁK TOMÁŠ",126,104,135,123,89,{"$f":"SUM(S36:W36)","v":577},{"$f":"MAX(S36:W36)","v":135},{"$f":"SUM(X36*1000)+Y36+0.25","v":577135.25},{"$f":"IF(S36=\"\",\"\",RANK(Z36,Z6:Z65,0))","v":42},null,{"$f":"RANK(AB41,AB11:AB65,0)","v":9},null,null,31,{"$f":"IF(AE6<31,\"\",VLOOKUP(31,O6:AA65,4,FALSE))","v":"PLECHÁČEK MIROSLAV"},{"$f":"IF(AE6<31,\"\",VLOOKUP(31,O6:AA65,10,FALSE))","v":653},null,null,{"$f":"IF(AO36=\"\",\"\",AW36)","v":16},6,"KAČEROV II.","DOUŠA ADAM",165,128,197,141,135,{"$f":"SUM(AO36:AS36)","v":766},{"$f":"MAX(AO36:AS36)","v":197},{"$f":"SUM(AT36*1000)+AU36+0.25","v":766197.25},{"$f":"IF(AO36=\"\",\"\",RANK(AV36,AV6:AV65,0))","v":16},null,{"$f":"RANK(AX41,AX11:AX65,0)","v":6},null,null,31,{"$f":"IF(BA6<31,\"\",VLOOKUP(31,AK6:AW65,4,FALSE))","v":"KRUPOVÁ MARTINA"},{"$f":"IF(BA6<31,\"\",VLOOKUP(31,AK6:AW65,10,FALSE))","v":662},null,null,{"$f":"IF(BK36=\"\",\"\",BS36)","v":1},6,"ŘEPY II.","KOCŮR JAROSLAV",176,154,187,232,211,{"$f":"SUM(BK36:BO36)","v":960},{"$f":"MAX(BK36:BO36)","v":232},{"$f":"SUM(BP36*1000)+BQ36+0.25","v":960232.25},{"$f":"IF(BK36=\"\",\"\",RANK(BR36,BR6:BR65,0))","v":1},null,null,null,{"$f":"IF(BK36=\"\",\"\",RANK(BV41,BV11:BV65,0))","v":1},null,null,31,{"$f":"IF(BY6<31,\"\",VLOOKUP(31,BG6:BS65,4,FALSE))","v":"SEHNAL IVAN"},{"$f":"IF(BY6<31,\"\",VLOOKUP(31,BG6:BS65,10,FALSE))","v":680},null,null,{"$f":"IF(CI36=\"\",\"\",CQ36)","v":42},6,"KLÍČOV II.","ŘEHÁK JAROSLAV",117,110,98,109,126,{"$f":"SUM(CI36:CM36)","v":560},{"$f":"MAX(CI36:CM36)","v":126},{"$f":"SUM(CN36*1000)+CO36+0.25","v":560126.25},{"$f":"IF(CI36=\"\",\"\",RANK(CP36,CP6:CP65,0))","v":42},null,null,null,{"$f":"IF(CI36=\"\",\"\",RANK(CT41,CT11:CT65,0))","v":10},null,null,31,{"$f":"IF(CW6<31,\"\",VLOOKUP(31,CE6:CQ65,4,FALSE))","v":"KŘIKAVA MIROSLAV"},{"$f":"IF(CW6<31,\"\",VLOOKUP(31,CE6:CQ65,10,FALSE))","v":651},null,null,{"$f":"IF(DG36=\"\",\"\",DO36)","v":40},6,"VRŠOVICE II.","Aunický František",120,118,127,108,146,{"$f":"SUM(DG36:DK36)","v":619},{"$f":"MAX(DG36:DK36)","v":146},{"$f":"SUM(DL36*1000)+DM36+0.25","v":619146.25},{"$f":"IF(DG36=\"\",\"\",RANK(DN36,DN6:DN65,0))","v":40},null,null,null,{"$f":"IF(DG36=\"\",\"\",RANK(DR41,DR11:DR65,0))","v":9},null,null,31,{"$f":"IF(DU6<31,\"\",VLOOKUP(31,DC6:DO65,4,FALSE))","v":"Šafář Ladislav"},{"$f":"IF(DU6<31,\"\",VLOOKUP(31,DC6:DO65,10,FALSE))","v":683},null,null,{"$f":"IF(EE36=\"\",\"\",EM36)","v":34},6,"HOSTIVAŘ II.","Mysliveček Jaroslav",120,128,130,162,102,{"$f":"SUM(EE36:EI36)","v":642},{"$f":"MAX(EE36:EI36)","v":162},{"$f":"SUM(EJ36*1000)+EK36+0.25","v":642162.25},{"$f":"IF(EE36=\"\",\"\",RANK(EL36,EL6:EL65,0))","v":34},null,null,null,{"$f":"IF(EE36=\"\",\"\",RANK(EP41,EP11:EP65,0))","v":7},null,null,31,{"$f":"IF(ES6<31,\"\",VLOOKUP(31,EA6:EM65,4,FALSE))","v":"Mašát Petr"},{"$f":"IF(ES6<31,\"\",VLOOKUP(31,EA6:EM65,10,FALSE))","v":657},null,null,{"$f":"IF(FC36=\"\",\"\",FK36)","v":40},6,"KAČEROV II.","Douša Adam",118,115,135,137,126,{"$f":"SUM(FC36:FG36)","v":631},{"$f":"MAX(FC36:FG36)","v":137},{"$f":"SUM(FH36*1000)+FI36+0.25","v":631137.25},{"$f":"IF(FC36=\"\",\"\",RANK(FJ36,FJ6:FJ65,0))","v":40},null,null,null,{"$f":"IF(FC36=\"\",\"\",RANK(FN41,FN11:FN65,0))","v":8},null,null,31,{"$f":"IF(FQ6<31,\"\",VLOOKUP(31,EY6:FL65,4,FALSE))","v":"Křápek Roman"},{"$f":"IF(FQ6<31,\"\",VLOOKUP(31,EY6:FL65,10,FALSE))","v":668},null,null,{"$f":"IF(GA36=\"\",\"\",GI36)","v":""},6,"HOSTIVAŘ II.",null,null,null,null,null,null,{"$f":"SUM(GA36:GE36)","v":0},{"$f":"MAX(GA36:GE36)","v":0},{"$f":"SUM(GF36*1000)+GG36+0.25","v":0.25},{"$f":"IF(GA36=\"\",\"\",RANK(GH36,GH6:GH70,0))","v":""},null,null,null,{"$f":"IF(GA36=\"\",\"\",RANK(GL41,GL11:GL71,0))","v":""},null,null,31,{"$f":"IF(GO6<31,\"\",VLOOKUP(31,FW6:GI70,4,FALSE))","v":""},{"$f":"IF(GO6<31,\"\",VLOOKUP(31,FW6:GI70,10,FALSE))","v":""}]
[null,null,null,null,null,null,null,null,null,null,null,null,null,null,{"$f":"IF(S37=\"\",\"\",AA37)","v":49},null,null,"KALOŠOVÁ DAGMAR",105,85,127,79,100,{"$f":"SUM(S37:W37)","v":496},{"$f":"MAX(S37:W37)","v":127},{"$f":"SUM(X37*1000)+Y37+0.24","v":496127.24},{"$f":"IF(S37=\"\",\"\",RANK(Z37,Z6:Z65,0))","v":49},null,null,null,null,32,{"$f":"IF(AE6<32,\"\",VLOOKUP(32,O6:AA65,4,FALSE))","v":"KŘÁPEK ROMAN"},{"$f":"IF(AE6<32,\"\",VLOOKUP(32,O6:AA65,10,FALSE))","v":637},null,null,{"$f":"IF(AO37=\"\",\"\",AW37)","v":25},null,null,"BROŽ STANISLAV",121,134,132,134,172,{"$f":"SUM(AO37:AS37)","v":693},{"$f":"MAX(AO37:AS37)","v":172},{"$f":"SUM(AT37*1000)+AU37+0.24","v":693172.24},{"$f":"IF(AO37=\"\",\"\",RANK(AV37,AV6:AV65,0))","v":25},null,null,null,null,32,{"$f":"IF(BA6<32,\"\",VLOOKUP(32,AK6:AW65,4,FALSE))","v":"KAZDA JAN"},{"$f":"IF(BA6<32,\"\",VLOOKUP(32,AK6:AW65,10,FALSE))","v":656},null,null,{"$f":"IF(BK37=\"\",\"\",BS37)","v":13},null,null,"ALBA VLADIMÍR",116,202,152,133,167,{"$f":"SUM(BK37:BO37)","v":770},{"$f":"MAX(BK37:BO37)","v":202},{"$f":"SUM(BP37*1000)+BQ37+0.24","v":770202.24},{"$f":"IF(BK37=\"\",\"\",RANK(BR37,BR6:BR65,0))","v":13},null,null,null,null,null,null,32,{"$f":"IF(BY6<32,\"\",VLOOKUP(32,BG6:BS65,4,FALSE))","v":"KAZDA JAN"},{"$f":"IF(BY6<32,\"\",VLOOKUP(32,BG6:BS65,10,FALSE))","v":676},null,null,{"$f":"IF(CI37=\"\",\"\",CQ37)","v":50},null,null,"ŠTARKOVÁ TEREZA",109,93,93,100,92,{"$f":"SUM(CI37:CM37)","v":487},{"$f":"MAX(CI37:CM37)","v":109},{"$f":"SUM(CN37*1000)+CO37+0.24","v":487109.24},{"$f":"IF(CI37=\"\",\"\",RANK(CP37,CP6:CP65,0))","v":50},null,null,null,null,null,null,32,{"$f":"IF(CW6<32,\"\",VLOOKUP(32,CE6:CQ65,4,FALSE))","v":"KŘEMENÁK PETR"},{"$f":"IF(CW6<32,\"\",VLOOKUP(32,CE6:CQ65,10,FALSE))","v":638},null,null,{"$f":"IF(DG37=\"\",\"\",DO37)","v":44},null,null,"Pavlíček Rudolf",119,97,123,112,113,{"$f":"SUM(DG37:DK37)","v":564},{"$f":"MAX(DG37:DK37)","v":123},{"$f":"SUM(DL37*1000)+DM37+0.24","v":564123.24},{"$f":"IF(DG37=\"\",\"\",RANK(DN37,DN6:DN65,0))","v":44},null,null,null,null,null,null,32,{"$f":"IF(DU6<32,\"\",VLOOKUP(32,DC6:DO65,4,FALSE))","v":"Kolár Pavel"},{"$f":"IF(DU6<32,\"\",VLOOKUP(32,DC6:DO65,10,FALSE))","v":681},null,null,{"$f":"IF(EE37=\"\",\"\",EM37)","v":36},null,null,"Šafář Ladislav",129,138,133,115,116,{"$f":"SUM(EE37:EI37)","v":631},{"$f":"MAX(EE37:EI37)","v":138},{"$f":"SUM(EJ37*1000)+EK37+0.24","v":631138.24},{"$f":"IF(EE37=\"\",\"\",RANK(EL37,EL6:EL65,0))","v":36},null,null,null,null,null,null,32,{"$f":"IF(ES6<32,\"\",VLOOKUP(32,EA6:EM65,4,FALSE))","v":"Kolár Vladimír"},{"$f":"IF(ES6<32,\"\",VLOOKUP(32,EA6:EM65,10,FALSE))","v":650},null,null,{"$f":"IF(FC37=\"\",\"\",FK37)","v":44},null,null,"Kutina Pavel",133,100,99,135,148,{"$f":"SUM(FC37:FG37)","v":615},{"$f":"MAX(FC37:FG37)","v":148},{"$f":"SUM(FH37*1000)+FI37+0.24","v":615148.24},{"$f":"IF(FC37=\"\",\"\",RANK(FJ37,FJ6:FJ65,0))","v":44},null,null,null,null,null,null,32,{"$f":"IF(FQ6<32,\"\",VLOOKUP(32,EY6:FL65,4,FALSE))","v":"Sehnal Ivan ing."},{"$f":"IF(FQ6<32,\"\",VLOOKUP(32,EY7:FL66,10,FALSE))","v":658},null,null,{"$f":"IF(GA37=\"\",\"\",GI37)","v":""},null,null,null,null,null,null,null,null,{"$f":"SUM(GA37:GE37)","v":0},{"$f":"MAX(GA37:GE37)","v":0},{"$f":"SUM(GF37*1000)+GG37+0.24","v":0.24},{"$f":"IF(GA37=\"\",\"\",RANK(GH37,GH6:GH70,0))","v":""},null,null,null,null,null,null,32,{"$f":"IF(GO6<32,\"\",VLOOKUP(32,FW6:GI70,4,FALSE))","v":""},{"$f":"IF(GO6<32,\"\",VLOOKUP(32,FW6:GI70,10,FALSE))","v":""}]
[null,null,null,null,null,null,null,null,null,null,null,null,null,null,{"$f":"IF(S38=\"\",\"\",AA38)","v":23},null,null,"MYSLIVEČEK JAROSLAV",124,176,143,147,112,{"$f":"SUM(S38:W38)","v":702},{"$f":"MAX(S38:W38)","v":176},{"$f":"SUM(X38*1000)+Y38+0.23","v":702176.23},{"$f":"IF(S38=\"\",\"\",RANK(Z38,Z6:Z65,0))","v":23},null,null,null,null,33,{"$f":"IF(AE6<33,\"\",VLOOKUP(33,O6:AA65,4,FALSE))","v":"DOUŠA ADAM"},{"$f":"IF(AE6<33,\"\",VLOOKUP(33,O6:AA65,10,FALSE))","v":636},null,null,{"$f":"IF(AO38=\"\",\"\",AW38)","v":37},null,null,"ŽALUD MIROSLAV",134,130,110,112,139,{"$f":"SUM(AO38:AS38)","v":625},{"$f":"MAX(AO38:AS38)","v":139},{"$f":"SUM(AT38*1000)+AU38+0.23","v":625139.23},{"$f":"IF(AO38=\"\",\"\",RANK(AV38,AV6:AV65,0))","v":37},null,null,null,null,33,{"$f":"IF(BA6<33,\"\",VLOOKUP(33,AK6:AW65,4,FALSE))","v":"TROLLER PAVEL"},{"$f":"IF(BA6<33,\"\",VLOOKUP(33,AK6:AW65,10,FALSE))","v":638},null,null,{"$f":"IF(BK38=\"\",\"\",BS38)","v":23},null,null,"FRONĚK MARTIN",138,145,162,140,135,{"$f":"SUM(BK38:BO38)","v":720},{"$f":"MAX(BK38:BO38)","v":162},{"$f":"SUM(BP38*1000)+BQ38+0.23","v":720162.23},{"$f":"IF(BK38=\"\",\"\",RANK(BR38,BR6:BR65,0))","v":23},null,null,null,null,null,null,33,{"$f":"IF(BY6<33,\"\",VLOOKUP(33,BG6:BS65,4,FALSE))","v":"BOŠEK JAN"},{"$f":"IF(BY6<33,\"\",VLOOKUP(33,BG6:BS65,10,FALSE))","v":673},null,null,{"$f":"IF(CI38=\"\",\"\",CQ38)","v":44},null,null,"VYCHNEROVÁ MICHAELA",92,79,153,116,116,{"$f":"SUM(CI38:CM38)","v":556},{"$f":"MAX(CI38:CM38)","v":153},{"$f":"SUM(CN38*1000)+CO38+0.23","v":556153.23},{"$f":"IF(CI38=\"\",\"\",RANK(CP38,CP6:CP65,0))","v":44},null,null,null,null,null,null,33,{"$f":"IF(CW6<33,\"\",VLOOKUP(33,CE6:CQ65,4,FALSE))","v":"ŠAFÁŘ LADISLAV"},{"$f":"IF(CW6<33,\"\",VLOOKUP(33,CE6:CQ65,10,FALSE))","v":632},null,null,{"$f":"IF(DG38=\"\",\"\",DO38)","v":48},null,null,"Fay Vlastimil",109,102,99,105,124,{"$f":"SUM(DG38:DK38)","v":539},{"$f":"MAX(DG38:DK38)","v":124},{"$f":"SUM(DL38*1000)+DM38+0.23","v":539124.23},{"$f":"IF(DG38=\"\",\"\",RANK(DN38,DN6:DN65,0))","v":48},null,null,null,null,null,null,33,{"$f":"IF(DU6<33,\"\",VLOOKUP(33,DC6:DO65,4,FALSE))","v":"Kutina Pavel"},{"$f":"IF(DU6<33,\"\",VLOOKUP(33,DC6:DO65,10,FALSE))","v":676},null,null,{"$f":"IF(EE38=\"\",\"\",EM38)","v":48},null,null,"Čermák Tomáš",89,128,121,133,114,{"$f":"SUM(EE38:EI38)","v":585},{"$f":"MAX(EE38:EI38)","v":133},{"$f":"SUM(EJ38*1000)+EK38+0.23","v":585133.23},{"$f":"IF(EE38=\"\",\"\",RANK(EL38,EL6:EL65,0))","v":48},null,null,null,null,null,null,33,{"$f":"IF(ES6<33,\"\",VLOOKUP(33,EA6:EM65,4,FALSE))","v":"Lokvenc Jiří"},{"$f":"IF(ES6<33,\"\",VLOOKUP(33,EA6:EM65,10,FALSE))","v":645},null,null,{"$f":"IF(FC38=\"\",\"\",FK38)","v":27},null,null,"Brejcha Jaroslav",143,132,141,137,128,{"$f":"SUM(FC38:FG38)","v":681},{"$f":"MAX(FC38:FG38)","v":143},{"$f":"SUM(FH38*1000)+FI38+0.23","v":681143.23},{"$f":"IF(FC38=\"\",\"\",RANK(FJ38,FJ6:FJ65,0))","v":27},null,null,null,null,null,null,33,{"$f":"IF(FQ6<33,\"\",VLOOKUP(33,EY6:FL65,4,FALSE))","v":"Šafář Ladislav"},{"$f":"IF(FQ6<33,\"\",VLOOKUP(33,EY6:FL65,10,FALSE))","v":652},null,null,{"$f":"IF(GA38=\"\",\"\",GI38)","v":""},null,null,null,null,null,null,null,null,{"$f":"SUM(GA38:GE38)","v":0},{"$f":"MAX(GA38:GE38)","v":0},{"$f":"SUM(GF38*1000)+GG38+0.23","v":0.23},{"$f":"IF(GA38=\"\",\"\",RANK(GH38,GH6:GH70,0))","v":""},null,null,null,null,null,null,33,{"$f":"IF(GO6<33,\"\",VLOOKUP(33,FW6:GI70,4,FALSE))","v":""},{"$f":"IF(GO6<33,\"\",VLOOKUP(33,FW6:GI70,10,FALSE))","v":""}]
[null,null,null,null,null,null,null,null,null,null,null,null,null,null,{"$f":"IF(S39=\"\",\"\",AA39)","v":36},null,null,"ŠAFÁŘ VLADIMÍR",144,108,98,146,120,{"$f":"SUM(S39:W39)","v":616},{"$f":"MAX(S39:W39)","v":146},{"$f":"SUM(X39*1000)+Y39+0.21","v":616146.21},{"$f":"IF(S39=\"\",\"\",RANK(Z39,Z6:Z65,0))","v":36},null,null,null,null,34,{"$f":"IF(AE6<34,\"\",VLOOKUP(34,O6:AA65,4,FALSE))","v":"SEHNAL IVAN"},{"$f":"IF(AE6<34,\"\",VLOOKUP(34,O6:AA65,10,FALSE))","v":631},null,null,{"$f":"IF(AO39=\"\",\"\",AW39)","v":39},null,null,"BREJCHA JAROSLAV",107,116,158,112,125,{"$f":"SUM(AO39:AS39)","v":618},{"$f":"MAX(AO39:AS39)","v":158},{"$f":"SUM(AT39*1000)+AU39+0.21","v":618158.21},{"$f":"IF(AO39=\"\",\"\",RANK(AV39,AV6:AV65,0))","v":39},null,null,null,null,34,{"$f":"IF(BA6<34,\"\",VLOOKUP(34,AK6:AW65,4,FALSE))","v":"TICHÝ HUGO"},{"$f":"IF(BA6<34,\"\",VLOOKUP(34,AK6:AW65,10,FALSE))","v":636},null,null,{"$f":"IF(BK39=\"\",\"\",BS39)","v":18},null,null,"KROČIL TOMÁŠ",142,141,139,151,169,{"$f":"SUM(BK39:BO39)","v":742},{"$f":"MAX(BK39:BO39)","v":169},{"$f":"SUM(BP39*1000)+BQ39+0.21","v":742169.21},{"$f":"IF(BK39=\"\",\"\",RANK(BR39,BR6:BR65,0))","v":18},null,null,null,null,null,null,34,{"$f":"IF(BY6<34,\"\",VLOOKUP(34,BG6:BS65,4,FALSE))","v":"DOUŠA ADAM"},{"$f":"IF(BY6<34,\"\",VLOOKUP(34,BG6:BS65,10,FALSE))","v":672},null,null,{"$f":"IF(CI39=\"\",\"\",CQ39)","v":40},null,null,"PIPEK PAVEL",160,109,94,117,97,{"$f":"SUM(CI39:CM39)","v":577},{"$f":"MAX(CI39:CM39)","v":160},{"$f":"SUM(CN39*1000)+CO39+0.21","v":577160.21},{"$f":"IF(CI39=\"\",\"\",RANK(CP39,CP6:CP65,0))","v":40},null,null,null,null,null,null,34,{"$f":"IF(CW6<34,\"\",VLOOKUP(34,CE6:CQ65,4,FALSE))","v":"ČERMÁK TOMÁŠ"},{"$f":"IF(CW6<34,\"\",VLOOKUP(34,CE6:CQ65,10,FALSE))","v":631},null,null,{"$f":"IF(DG39=\"\",\"\",DO39)","v":28},null,null,"Pospíšil Lukáš",139,130,123,182,123,{"$f":"SUM(DG39:DK39)","v":697},{"$f":"MAX(DG39:DK39)","v":182},{"$f":"SUM(DL39*1000)+DM39+0.21","v":697182.21},{"$f":"IF(DG39=\"\",\"\",RANK(DN39,DN6:DN65,0))","v":28},null,null,null,null,null,null,34,{"$f":"IF(DU6<34,\"\",VLOOKUP(34,DC6:DO65,4,FALSE))","v":"Douša Adam"},{"$f":"IF(DU6<34,\"\",VLOOKUP(34,DC6:DO65,10,FALSE))","v":669},null,null,{"$f":"IF(EE39=\"\",\"\",EM39)","v":17},null,null,"Berger Michal",132,164,147,153,134,{"$f":"SUM(EE39:EI39)","v":730},{"$f":"MAX(EE39:EI39)","v":164},{"$f":"SUM(EJ39*1000)+EK39+0.21","v":730164.21},{"$f":"IF(EE39=\"\",\"\",RANK(EL39,EL6:EL65,0))","v":17},null,null,null,null,null,null,34,{"$f":"IF(ES6<34,\"\",VLOOKUP(34,EA6:EM65,4,FALSE))","v":"Mysliveček Jaroslav"},{"$f":"IF(ES6<34,\"\",VLOOKUP(34,EA6:EM65,10,FALSE))","v":642},null,null,{"$f":"IF(FC39=\"\",\"\",FK39)","v":42},null,null,"Brož Stanislav",124,135,111,105,150,{"$f":"SUM(FC39:FG39)","v":625},{"$f":"MAX(FC39:FG39)","v":150},{"$f":"SUM(FH39*1000)+FI39+0.21","v":625150.21},{"$f":"IF(FC39=\"\",\"\",RANK(FJ39,FJ6:FJ65,0))","v":42},null,null,null,null,null,null,34,{"$f":"IF(FQ6<34,\"\",VLOOKUP(34,EY6:FL65,4,FALSE))","v":"Turek Stanislav"},{"$f":"IF(FQ6<34,\"\",VLOOKUP(34,EY6:FL65,10,FALSE))","v":649},null,null,{"$f":"IF(GA39=\"\",\"\",GI39)","v":""},null,null,null,null,null,null,null,null,{"$f":"SUM(GA39:GE39)","v":0},{"$f":"MAX(GA39:GE39)","v":0},{"$f":"SUM(GF39*1000)+GG39+0.21","v":0.21},{"$f":"IF(GA39=\"\",\"\",RANK(GH39,GH6:GH70,0))","v":""},null,null,null,null,null,null,34,{"$f":"IF(GO6<34,\"\",VLOOKUP(34,FW6:GI70,4,FALSE))","v":""},{"$f":"IF(GO6<34,\"\",VLOOKUP(34,FW6:GI70,10,FALSE))","v":""}]
[null,null,null,null,null,null,null,null,null,null,null,null,null,null,{"$f":"IF(S40=\"\",\"\",AA40)","v":44},null,null,"KOLLÁR PAVEL",115,141,89,101,125,{"$f":"SUM(S40:W40)","v":571},{"$f":"MAX(S40:W40)","v":141},{"$f":"SUM(X40*1000)+Y40+0.2","v":571141.19999999995},{"$f":"IF(S40=\"\",\"\",RANK(Z40,Z6:Z65,0))","v":44},null,null,null,null,35,{"$f":"IF(AE6<35,\"\",VLOOKUP(35,O6:AA65,4,FALSE))","v":"KRUPKA JAKUB"},{"$f":"IF(AE6<35,\"\",VLOOKUP(35,O6:AA65,10,FALSE))","v":627},null,null,{"$f":"IF(AO40=\"\",\"\",AW40)","v":40},null,null,"KUTINA PAVEL",118,116,116,141,120,{"$f":"SUM(AO40:AS40)","v":611},{"$f":"MAX(AO40:AS40)","v":141},{"$f":"SUM(AT40*1000)+AU40+0.2","v":611141.19999999995},{"$f":"IF(AO40=\"\",\"\",RANK(AV40,AV6:AV65,0))","v":40},null,null,null,null,35,{"$f":"IF(BA6<35,\"\",VLOOKUP(35,AK6:AW65,4,FALSE))","v":"NOVOTNÁ PETRA"},{"$f":"IF(BA6<35,\"\",VLOOKUP(35,AK6:AW65,10,FALSE))","v":636},null,null,{"$f":"IF(BK40=\"\",\"\",BS40)","v":10},null,null,"POSPÍŠIL VÁCLAV",167,153,171,143,180,{"$f":"SUM(BK40:BO40)","v":814},{"$f":"MAX(BK40:BO40)","v":180},{"$f":"SUM(BP40*1000)+BQ40+0.2","v":814180.2},{"$f":"IF(BK40=\"\",\"\",RANK(BR40,BR6:BR65,0))","v":10},null,null,null,null,null,null,35,{"$f":"IF(BY6<35,\"\",VLOOKUP(35,BG6:BS65,4,FALSE))","v":"LAZUROVÁ JIŘINA"},{"$f":"IF(BY6<35,\"\",VLOOKUP(35,BG6:BS65,10,FALSE))","v":669},null,null,{"$f":"IF(CI40=\"\",\"\",CQ40)","v":46},null,null,"TÁBORSKÝ FRANTIŠEK",97,102,123,114,99,{"$f":"SUM(CI40:CM40)","v":535},{"$f":"MAX(CI40:CM40)","v":123},{"$f":"SUM(CN40*1000)+CO40+0.2","v":535123.19999999995},{"$f":"IF(CI40=\"\",\"\",RANK(CP40,CP6:CP65,0))","v":46},null,null,null,null,null,null,35,{"$f":"IF(CW6<35,\"\",VLOOKUP(35,CE6:CQ65,4,FALSE))","v":"RŮŽIČKA VÁCLAV"},{"$f":"IF(CW6<35,\"\",VLOOKUP(35,CE6:CQ65,10,FALSE))","v":619},null,null,{"$f":"IF(DG40=\"\",\"\",DO40)","v":19},null,null,"Bošek Jan",154,146,127,144,152,{"$f":"SUM(DG40:DK40)","v":723},{"$f":"MAX(DG40:DK40)","v":154},{"$f":"SUM(DL40*1000)+DM40+0.2","v":723154.2},{"$f":"IF(DG40=\"\",\"\",RANK(DN40,DN6:DN65,0))","v":19},null,null,null,null,null,null,35,{"$f":"IF(DU6<35,\"\",VLOOKUP(35,DC6:DO65,4,FALSE))","v":"Sladovník Miloslav"},{"$f":"IF(DU6<35,\"\",VLOOKUP(35,DC6:DO65,10,FALSE))","v":668},null,null,{"$f":"IF(EE40=\"\",\"\",EM40)","v":23},null,null,"Kollár Pavel",122,170,131,130,142,{"$f":"SUM(EE40:EI40)","v":695},{"$f":"MAX(EE40:EI40)","v":170},{"$f":"SUM(EJ40*1000)+EK40+0.2","v":695170.2},{"$f":"IF(EE40=\"\",\"\",RANK(EL40,EL6:EL65,0))","v":23},null,null,null,null,null,null,35,{"$f":"IF(ES6<35,\"\",VLOOKUP(35,EA6:EM65,4,FALSE))","v":"Křápek Roman"},{"$f":"IF(ES6<35,\"\",VLOOKUP(35,EA6:EM65,10,FALSE))","v":633},null,null,{"$f":"IF(FC40=\"\",\"\",FK40)","v":28},null,null,"Radová Petra",124,101,172,164,114,{"$f":"SUM(FC40:FG40)","v":675},{"$f":"MAX(FC40:FG40)","v":172},{"$f":"SUM(FH40*1000)+FI40+0.2","v":675172.2},{"$f":"IF(FC40=\"\",\"\",RANK(FJ40,FJ6:FJ65,0))","v":28},null,null,null,null,null,null,35,{"$f":"IF(FQ6<35,\"\",VLOOKUP(35,EY6:FL65,4,FALSE))","v":"Skružná Pavla"},{"$f":"IF(FQ6<35,\"\",VLOOKUP(35,EY6:FL65,10,FALSE))","v":647},null,null,{"$f":"IF(GA40=\"\",\"\",GI40)","v":""},null,null,null,null,null,null,null,null,{"$f":"SUM(GA40:GE40)","v":0},{"$f":"MAX(GA40:GE40)","v":0},{"$f":"SUM(GF40*1000)+GG40+0.2","v":0.2},{"$f":"IF(GA40=\"\",\"\",RANK(GH40,GH6:GH70,0))","v":""},null,null,null,null,null,null,35,{"$f":"IF(GO6<35,\"\",VLOOKUP(35,FW6:GI70,4,FALSE))","v":""},{"$f":"IF(GO6<35,\"\",VLOOKUP(35,FW6:GI70,10,FALSE))","v":""}]
[null,null,null,null,null,null,null,null,null,null,null,null,null,null,null,null,null,null,{"$f":"SUM(S36:S40)","v":614},{"$f":"SUM(T36:T40)","v":614},{"$f":"SUM(U36:U40)","v":592},{"$f":"SUM(V36:V40)","v":596},{"$f":"SUM(W36:W40)","v":546},null,null,null,null,{"$f":"SUM(S41:W41)","v":2962},null,null,null,36,{"$f":"IF(AE6<36,\"\",VLOOKUP(36,O6:AA65,4,FALSE))","v":"ŠAFÁŘ VLADIMÍR"},{"$f":"IF(AE6<36,\"\",VLOOKUP(36,O6:AA65,10,FALSE))","v":616},null,null,null,null,null,null,{"$f":"SUM(AO36:AO40)","v":645},{"$f":"SUM(AP36:AP40)","v":624},{"$f":"SUM(AQ36:AQ40)","v":713},{"$f":"SUM(AR36:AR40)","v":640},{"$f":"SUM(AS36:AS40)","v":691},null,null,null,null,{"$f":"SUM(AO41:AS41)","v":3313},null,null,null,36,{"$f":"IF(BA6<36,\"\",VLOOKUP(36,AK6:AW65,4,FALSE))","v":"KŘÁPEK ROMAN"},{"$f":"IF(BA6<36,\"\",VLOOKUP(36,AK6:AW65,10,FALSE))","v":632},null,null,null,null,null,null,{"$f":"SUM(BK36:BK40)","v":739},{"$f":"SUM(BL36:BL40)","v":795},{"$f":"SUM(BM36:BM40)","v":811},{"$f":"SUM(BN36:BN40)","v":799},{"$f":"SUM(BO36:BO40)","v":862},null,null,null,null,{"$f":"SUM(BK41:BO41)","v":4006},{"$f":"MAX(BK41:BO41)","v":862},{"$f":"IF(BK36=\"\",\"\",SUM(BT41*10000)+BU41)","v":40060862},null,null,null,36,{"$f":"IF(BY6<36,\"\",VLOOKUP(36,BG6:BS65,4,FALSE))","v":"KUČERA MIROSLAV"},{"$f":"IF(BY6<36,\"\",VLOOKUP(36,BG6:BS65,10,FALSE))","v":665},null,null,null,null,null,null,{"$f":"SUM(CI36:CI40)","v":575},{"$f":"SUM(CJ36:CJ40)","v":493},{"$f":"SUM(CK36:CK40)","v":561},{"$f":"SUM(CL36:CL40)","v":556},{"$f":"SUM(CM36:CM40)","v":530},null,null,null,null,{"$f":"SUM(CI41:CM41)","v":2715},{"$f":"MAX(CI41:CM41)","v":575},{"$f":"IF(CI36=\"\",\"\",SUM(CR41*1000)+CS41)","v":2715575},null,null,null,36,{"$f":"IF(CW6<36,\"\",VLOOKUP(36,CE6:CQ65,4,FALSE))","v":"TICHÝ HUGO"},{"$f":"IF(CW6<36,\"\",VLOOKUP(36,CE6:CQ65,10,FALSE))","v":618},null,null,null,null,null,null,{"$f":"SUM(DG36:DG40)","v":641},{"$f":"SUM(DH36:DH40)","v":593},{"$f":"SUM(DI36:DI40)","v":599},{"$f":"SUM(DJ36:DJ40)","v":651},{"$f":"SUM(DK36:DK40)","v":658},null,null,null,null,{"$f":"SUM(DG41:DK41)","v":3142},{"$f":"MAX(DG41:DK41)","v":658},{"$f":"IF(DG36=\"\",\"\",SUM(DP41*1000)+DQ41)","v":3142658},null,null,null,36,{"$f":"IF(DU6<36,\"\",VLOOKUP(36,DC6:DO65,4,FALSE))","v":"Štěpán Radek"},{"$f":"IF(DU6<36,\"\",VLOOKUP(36,DC6:DO65,10,FALSE))","v":667},null,null,null,null,null,null,{"$f":"SUM(EE36:EE40)","v":592},{"$f":"SUM(EF36:EF40)","v":728},{"$f":"SUM(EG36:EG40)","v":662},{"$f":"SUM(EH36:EH40)","v":693},{"$f":"SUM(EI36:EI40)","v":608},null,null,null,null,{"$f":"SUM(EE41:EI41)","v":3283},{"$f":"MAX(EE41:EI41)","v":728},{"$f":"IF(EE36=\"\",\"\",SUM(EN41*1000)+EO41)","v":3283728},null,null,null,36,{"$f":"IF(ES6<36,\"\",VLOOKUP(36,EA6:EM65,4,FALSE))","v":"Šafář Ladislav"},{"$f":"IF(ES6<36,\"\",VLOOKUP(36,EA6:EM65,10,FALSE))","v":631},null,null,null,null,null,null,{"$f":"SUM(FC36:FC40)","v":642},{"$f":"SUM(FD36:FD40)","v":583},{"$f":"SUM(FE36:FE40)","v":658},{"$f":"SUM(FF36:FF40)","v":678},{"$f":"SUM(FG36:FG40)","v":666},null,null,null,null,{"$f":"SUM(FC41:FG41)","v":3227},{"$f":"MAX(FC41:FG41)","v":678},{"$f":"IF(FC36=\"\",\"\",SUM(FL41*1000)+FM41)","v":3227678},null,null,null,36,{"$f":"IF(FQ6<36,\"\",VLOOKUP(36,EY6:FL65,4,FALSE))","v":"Křikava Miroslav"},{"$f":"IF(FQ6<36,\"\",VLOOKUP(36,EY6:FL65,10,FALSE))","v":644},null,null,null,null,null,null,{"$f":"SUM(GA36:GA40)","v":0},{"$f":"SUM(GB36:GB40)","v":0},{"$f":"SUM(GC36:GC40)","v":0},{"$f":"SUM(GD36:GD40)","v":0},{"$f":"SUM(GE36:GE40)","v":0},null,null,null,null,{"$f":"SUM(GA41:GE41)","v":0},{"$f":"MAX(GA41:GE41)","v":0},{"$f":"IF(GA36=\"\",\"\",SUM(GJ41*1000)+GK41)","v":""},null,null,null,36,{"$f":"IF(GO6<36,\"\",VLOOKUP(36,FW6:GI70,4,FALSE))","v":""},{"$f":"IF(GO6<36,\"\",VLOOKUP(36,FW6:GI70,10,FALSE))","v":""}]
[null,null,null,null,null,null,null,null,null,null,null,null,null,null,{"$f":"IF(S42=\"\",\"\",AA42)","v":9},7,"VRŠOVICE I.","KRUPA JOZEF",143,119,136,201,200,{"$f":"SUM(S42:W42)","v":799},{"$f":"MAX(S42:W42)","v":201},{"$f":"SUM(X42*1000)+Y42+0.19","v":799201.19},{"$f":"IF(S42=\"\",\"\",RANK(Z42,Z6:Z65,0))","v":9},null,{"$f":"RANK(AB47,AB11:AB65,0)","v":5},null,null,37,{"$f":"IF(AE6<37,\"\",VLOOKUP(37,O6:AA65,4,FALSE))","v":"SKRUŽNÁ PAVLA"},{"$f":"IF(AE6<37,\"\",VLOOKUP(37,O6:AA65,10,FALSE))","v":616},null,null,{"$f":"IF(AO42=\"\",\"\",AW42)","v":15},7,"HOSTIVAŘ I.","MYSLIVEČEK JAROSLAV",172,139,146,167,144,{"$f":"SUM(AO42:AS42)","v":768},{"$f":"MAX(AO42:AS42)","v":172},{"$f":"SUM(AT42*1000)+AU42+0.19","v":768172.19},{"$f":"IF(AO42=\"\",\"\",RANK(AV42,AV6:AV65,0))","v":15},null,{"$f":"RANK(AX47,AX11:AX65,0)","v":3},null,null,37,{"$f":"IF(BA6<37,\"\",VLOOKUP(37,AK6:AW65,4,FALSE))","v":"ŽALUD MIROSLAV"},{"$f":"IF(BA6<37,\"\",VLOOKUP(37,AK6:AW65,10,FALSE))","v":625},null,null,{"$f":"IF(BK42=\"\",\"\",BS42)","v":20},7,"KAČEROV I.","TOMÁŠEK ZDENĚK",161,145,117,179,131,{"$f":"SUM(BK42:BO42)","v":733},{"$f":"MAX(BK42:BO42)","v":179},{"$f":"SUM(BP42*1000)+BQ42+0.19","v":733179.19},{"$f":"IF(BK42=\"\",\"\",RANK(BR42,BR6:BR65,0))","v":20},null,null,null,{"$f":"IF(BK42=\"\",\"\",RANK(BV47,BV11:BV65,0))","v":2},null,null,37,{"$f":"IF(BY6<37,\"\",VLOOKUP(37,BG6:BS65,4,FALSE))","v":"ŠAFÁŘ BOHUMIL"},{"$f":"IF(BY6<37,\"\",VLOOKUP(37,BG6:BS65,10,FALSE))","v":660},null,null,{"$f":"IF(CI42=\"\",\"\",CQ42)","v":13},7,"ŘEPY I.","SEHNAL IVAN",111,137,181,186,146,{"$f":"SUM(CI42:CM42)","v":761},{"$f":"MAX(CI42:CM42)","v":186},{"$f":"SUM(CN42*1000)+CO42+0.19","v":761186.19},{"$f":"IF(CI42=\"\",\"\",RANK(CP42,CP6:CP65,0))","v":13},null,null,null,{"$f":"IF(CI42=\"\",\"\",RANK(CT47,CT11:CT65,0))","v":7},null,null,37,{"$f":"IF(CW6<37,\"\",VLOOKUP(37,CE6:CQ65,4,FALSE))","v":"FAY VLASTIMIL"},{"$f":"IF(CW6<37,\"\",VLOOKUP(37,CE6:CQ65,10,FALSE))","v":601},null,null,{"$f":"IF(DG42=\"\",\"\",DO42)","v":16},7,"KLÍČOV I.","Troller Pavel",152,132,192,153,128,{"$f":"SUM(DG42:DK42)","v":757},{"$f":"MAX(DG42:DK42)","v":192},{"$f":"SUM(DL42*1000)+DM42+0.19","v":757192.19},{"$f":"IF(DG42=\"\",\"\",RANK(DN42,DN6:DN65,0))","v":16},null,null,null,{"$f":"IF(DG42=\"\",\"\",RANK(DR47,DR11:DR65,0))","v":2},null,null,37,{"$f":"IF(DU6<37,\"\",VLOOKUP(37,DC6:DO65,4,FALSE))","v":"Řehák Jaroslav"},{"$f":"IF(DU6<37,\"\",VLOOKUP(37,DC6:DO65,10,FALSE))","v":649},null,null,{"$f":"IF(EE42=\"\",\"\",EM42)","v":7},7,"VRŠOVICE I.","Krupa Jozef",160,169,176,182,160,{"$f":"SUM(EE42:EI42)","v":847},{"$f":"MAX(EE42:EI42)","v":182},{"$f":"SUM(EJ42*1000)+EK42+0.19","v":847182.19},{"$f":"IF(EE42=\"\",\"\",RANK(EL42,EL6:EL65,0))","v":7},null,null,null,{"$f":"IF(EE42=\"\",\"\",RANK(EP47,EP11:EP65,0))","v":4},null,null,37,{"$f":"IF(ES6<37,\"\",VLOOKUP(37,EA6:EM65,4,FALSE))","v":"Kutina Pavel"},{"$f":"IF(ES6<37,\"\",VLOOKUP(37,EA6:EM65,10,FALSE))","v":627},null,null,{"$f":"IF(FC42=\"\",\"\",FK42)","v":31},7,"HOSTIVAŘ I.","Křápek Roman",104,125,160,130,149,{"$f":"SUM(FC42:FG42)","v":668},{"$f":"MAX(FC42:FG42)","v":160},{"$f":"SUM(FH42*1000)+FI42+0.19","v":668160.18999999994},{"$f":"IF(FC42=\"\",\"\",RANK(FJ42,FJ6:FJ65,0))","v":31},null,null,null,{"$f":"IF(FC42=\"\",\"\",RANK(FN47,FN11:FN65,0))","v":2},null,null,37,{"$f":"IF(FQ6<37,\"\",VLOOKUP(37,EY6:FL65,4,FALSE))","v":"Štěpán Radek"},{"$f":"IF(FQ6<37,\"\",VLOOKUP(37,EY7:FL66,10,FALSE))","v":642},null,null,{"$f":"IF(GA42=\"\",\"\",GI42)","v":""},7,"VRŠOVICE I.",null,null,null,null,null,null,{"$f":"SUM(GA42:GE42)","v":0},{"$f":"MAX(GA42:GE42)","v":0},{"$f":"SUM(GF42*1000)+GG42+0.19","v":0.19},{"$f":"IF(GA42=\"\",\"\",RANK(GH42,GH6:GH70,0))","v":""},null,null,null,{"$f":"IF(GA42=\"\",\"\",RANK(GL47,GL11:GL71,0))","v":""},null,null,37,{"$f":"IF(GO6<37,\"\",VLOOKUP(37,FW6:GI70,4,FALSE))","v":""},{"$f":"IF(GO6<37,\"\",VLOOKUP(37,FW6:GI70,10,FALSE))","v":""}]
[null,null,null,null,null,null,null,null,null,null,null,null,null,null,{"$f":"IF(S43=\"\",\"\",AA43)","v":6},null,null,"VĚCHTÍK ANTONÍN",123,205,193,151,158,{"$f":"SUM(S43:W43)","v":830},{"$f":"MAX(S43:W43)","v":205},{"$f":"SUM(X43*1000)+Y43+0.18","v":830205.18},{"$f":"IF(S43=\"\",\"\",RANK(Z43,Z6:Z65,0))","v":6},null,null,null,null,38,{"$f":"IF(AE6<38,\"\",VLOOKUP(38,O6:AA65,4,FALSE))","v":"BREJCHA JAROSLAV"},{"$f":"IF(AE6<38,\"\",VLOOKUP(38,O6:AA65,10,FALSE))","v":614},null,null,{"$f":"IF(AO43=\"\",\"\",AW43)","v":36},null,null,"KŘÁPEK ROMAN",135,145,127,111,114,{"$f":"SUM(AO43:AS43)","v":632},{"$f":"MAX(AO43:AS43)","v":145},{"$f":"SUM(AT43*1000)+AU43+0.18","v":632145.18000000005},{"$f":"IF(AO43=\"\",\"\",RANK(AV43,AV6:AV65,0))","v":36},null,null,null,null,38,{"$f":"IF(BA6<38,\"\",VLOOKUP(38,AK6:AW65,4,FALSE))","v":"KOLÁŘ LADISLAV"},{"$f":"IF(BA6<38,\"\",VLOOKUP(38,AK6:AW65,10,FALSE))","v":621},null,null,{"$f":"IF(BK43=\"\",\"\",BS43)","v":28},null,null,"RADOVÁ PETRA",121,167,117,149,130,{"$f":"SUM(BK43:BO43)","v":684},{"$f":"MAX(BK43:BO43)","v":167},{"$f":"SUM(BP43*1000)+BQ43+0.18","v":684167.18},{"$f":"IF(BK43=\"\",\"\",RANK(BR43,BR6:BR65,0))","v":28},null,null,null,null,null,null,38,{"$f":"IF(BY6<38,\"\",VLOOKUP(38,BG6:BS65,4,FALSE))","v":"MYSLIVEČEK JAROSLAV"},{"$f":"IF(BY6<38,\"\",VLOOKUP(38,BG6:BS65,10,FALSE))","v":631},null,null,{"$f":"IF(CI43=\"\",\"\",CQ43)","v":26},null,null,"ČÍHAL FRANTIŠEK",136,140,136,118,151,{"$f":"SUM(CI43:CM43)","v":681},{"$f":"MAX(CI43:CM43)","v":151},{"$f":"SUM(CN43*1000)+CO43+0.18","v":681151.18},{"$f":"IF(CI43=\"\",\"\",RANK(CP43,CP6:CP65,0))","v":26},null,null,null,null,null,null,38,{"$f":"IF(CW6<38,\"\",VLOOKUP(38,CE6:CQ65,4,FALSE))","v":"NOVOTNÁ PETRA"},{"$f":"IF(CW6<38,\"\",VLOOKUP(38,CE6:CQ65,10,FALSE))","v":594},null,null,{"$f":"IF(DG43=\"\",\"\",DO43)","v":7},null,null,"Kalfiřt Petr",156,158,159,192,157,{"$f":"SUM(DG43:DK43)","v":822},{"$f":"MAX(DG43:DK43)","v":192},{"$f":"SUM(DL43*1000)+DM43+0.18","v":822192.18},{"$f":"IF(DG43=\"\",\"\",RANK(DN43,DN6:DN65,0))","v":7},null,null,null,null,null,null,38,{"$f":"IF(DU6<38,\"\",VLOOKUP(38,DC6:DO65,4,FALSE))","v":"Křikavová Miroslava"},{"$f":"IF(DU6<38,\"\",VLOOKUP(38,DC6:DO65,10,FALSE))","v":640},null,null,{"$f":"IF(EE43=\"\",\"\",EM43)","v":16},null,null,"Krupová Martina",156,134,162,167,136,{"$f":"SUM(EE43:EI43)","v":755},{"$f":"MAX(EE43:EI43)","v":167},{"$f":"SUM(EJ43*1000)+EK43+0.18","v":755167.18},{"$f":"IF(EE43=\"\",\"\",RANK(EL43,EL6:EL65,0))","v":16},null,null,null,null,null,null,38,{"$f":"IF(ES6<38,\"\",VLOOKUP(38,EA6:EM65,4,FALSE))","v":"Katolický Zdeněk"},{"$f":"IF(ES6<38,\"\",VLOOKUP(38,EA6:EM65,10,FALSE))","v":627},null,null,{"$f":"IF(FC43=\"\",\"\",FK43)","v":14},null,null,"Růžička Ladislav",170,163,155,163,141,{"$f":"SUM(FC43:FG43)","v":792},{"$f":"MAX(FC43:FG43)","v":170},{"$f":"SUM(FH43*1000)+FI43+0.18","v":792170.18},{"$f":"IF(FC43=\"\",\"\",RANK(FJ43,FJ6:FJ65,0))","v":14},null,null,null,null,null,null,38,{"$f":"IF(FQ6<38,\"\",VLOOKUP(38,EY6:FL65,4,FALSE))","v":"Aunický František"},{"$f":"IF(FQ6<38,\"\",VLOOKUP(38,EY7:FL66,10,FALSE))","v":640},null,null,{"$f":"IF(GA43=\"\",\"\",GI43)","v":""},null,null,null,null,null,null,null,null,{"$f":"SUM(GA43:GE43)","v":0},{"$f":"MAX(GA43:GE43)","v":0},{"$f":"SUM(GF43*1000)+GG43+0.18","v":0.18},{"$f":"IF(GA43=\"\",\"\",RANK(GH43,GH6:GH70,0))","v":""},null,null,null,null,null,null,38,{"$f":"IF(GO6<38,\"\",VLOOKUP(38,FW6:GI70,4,FALSE))","v":""},{"$f":"IF(GO6<38,\"\",VLOOKUP(38,FW6:GI70,10,FALSE))","v":""}]
[null,null,null,null,null,null,null,null,null,null,null,null,null,null,{"$f":"IF(S44=\"\",\"\",AA44)","v":13},null,null,"HOLKUP JAN",128,149,155,168,155,{"$f":"SUM(S44:W44)","v":755},{"$f":"MAX(S44:W44)","v":168},{"$f":"SUM(X44*1000)+Y44+0.17","v":755168.17},{"$f":"IF(S44=\"\",\"\",RANK(Z44,Z6:Z65,0))","v":13},null,null,null,null,39,{"$f":"IF(AE6<39,\"\",VLOOKUP(39,O6:AA65,4,FALSE))","v":"POSPÍŠIL LUKÁŠ "},{"$f":"IF(AE6<39,\"\",VLOOKUP(39,O6:AA65,10,FALSE))","v":611},null,null,{"$f":"IF(AO44=\"\",\"\",AW44)","v":20},null,null,"JELÍNEK JAN",158,152,128,140,141,{"$f":"SUM(AO44:AS44)","v":719},{"$f":"MAX(AO44:AS44)","v":158},{"$f":"SUM(AT44*1000)+AU44+0.17","v":719158.17},{"$f":"IF(AO44=\"\",\"\",RANK(AV44,AV6:AV65,0))","v":20},null,null,null,null,39,{"$f":"IF(BA6<39,\"\",VLOOKUP(39,AK6:AW65,4,FALSE))","v":"BREJCHA JAROSLAV"},{"$f":"IF(BA6<39,\"\",VLOOKUP(39,AK6:AW65,10,FALSE))","v":618},null,null,{"$f":"IF(BK44=\"\",\"\",BS44)","v":3},null,null,"ONDŘICH FRANTIŠEK",166,197,159,168,205,{"$f":"SUM(BK44:BO44)","v":895},{"$f":"MAX(BK44:BO44)","v":205},{"$f":"SUM(BP44*1000)+BQ44+0.17","v":895205.17},{"$f":"IF(BK44=\"\",\"\",RANK(BR44,BR6:BR65,0))","v":3},null,null,null,null,null,null,39,{"$f":"IF(BY6<39,\"\",VLOOKUP(39,BG6:BS65,4,FALSE))","v":"FAY VLASTIMIL"},{"$f":"IF(BY6<39,\"\",VLOOKUP(39,BG6:BS65,10,FALSE))","v":611},null,null,{"$f":"IF(CI44=\"\",\"\",CQ44)","v":31},null,null,"KŘIKAVA MIROSLAV",100,125,122,182,122,{"$f":"SUM(CI44:CM44)","v":651},{"$f":"MAX(CI44:CM44)","v":182},{"$f":"SUM(CN44*1000)+CO44+0.17","v":651182.17000000004},{"$f":"IF(CI44=\"\",\"\",RANK(CP44,CP6:CP65,0))","v":31},null,null,null,null,null,null,39,{"$f":"IF(CW6<39,\"\",VLOOKUP(39,CE6:CQ65,4,FALSE))","v":"POSPÍŠIL LUKÁŠ"},{"$f":"IF(CW6<39,\"\",VLOOKUP(39,CE6:CQ65,10,FALSE))","v":583},null,null,{"$f":"IF(DG44=\"\",\"\",DO44)","v":36},null,null,"Štěpán Radek",125,98,183,131,130,{"$f":"SUM(DG44:DK44)","v":667},{"$f":"MAX(DG44:DK44)","v":183},{"$f":"SUM(DL44*1000)+DM44+0.17","v":667183.17000000004},{"$f":"IF(DG44=\"\",\"\",RANK(DN44,DN6:DN65,0))","v":36},null,null,null,null,null,null,39,{"$f":"IF(DU6<39,\"\",VLOOKUP(39,DC6:DO65,4,FALSE))","v":"Mottl Pavel"},{"$f":"IF(DU6<39,\"\",VLOOKUP(39,DC6:DO65,10,FALSE))","v":630},null,null,{"$f":"IF(EE44=\"\",\"\",EM44)","v":9},null,null,"Holkup Jan",160,228,135,165,135,{"$f":"SUM(EE44:EI44)","v":823},{"$f":"MAX(EE44:EI44)","v":228},{"$f":"SUM(EJ44*1000)+EK44+0.17","v":823228.17},{"$f":"IF(EE44=\"\",\"\",RANK(EL44,EL6:EL65,0))","v":9},null,null,null,null,null,null,39,{"$f":"IF(ES6<39,\"\",VLOOKUP(39,EA6:EM65,4,FALSE))","v":"Křikava Miroslav"},{"$f":"IF(ES6<39,\"\",VLOOKUP(39,EA6:EM65,10,FALSE))","v":626},null,null,{"$f":"IF(FC44=\"\",\"\",FK44)","v":8},null,null,"Jelínek Jan",162,149,156,169,180,{"$f":"SUM(FC44:FG44)","v":816},{"$f":"MAX(FC44:FG44)","v":180},{"$f":"SUM(FH44*1000)+FI44+0.17","v":816180.17},{"$f":"IF(FC44=\"\",\"\",RANK(FJ44,FJ6:FJ65,0))","v":8},null,null,null,null,null,null,39,{"$f":"IF(FQ6<39,\"\",VLOOKUP(39,EY6:FL65,4,FALSE))","v":"Pipek Pavel"},{"$f":"IF(FQ6<39,\"\",VLOOKUP(39,EY6:FL65,10,FALSE))","v":632},null,null,{"$f":"IF(GA44=\"\",\"\",GI44)","v":""},null,null,null,null,null,null,null,null,{"$f":"SUM(GA44:GE44)","v":0},{"$f":"MAX(GA44:GE44)","v":0},{"$f":"SUM(GF44*1000)+GG44+0.17","v":0.17},{"$f":"IF(GA44=\"\",\"\",RANK(GH44,GH6:GH70,0))","v":""},null,null,null,null,null,null,39,{"$f":"IF(GO6<39,\"\",VLOOKUP(39,FW6:GI70,4,FALSE))","v":""},{"$f":"IF(GO6<39,\"\",VLOOKUP(39,FW6:GI70,10,FALSE))","v":""}]
[null,null,null,null,null,null,null,null,null,null,null,null,null,null,{"$f":"IF(S45=\"\",\"\",AA45)","v":37},null,null,"SKRUŽNÁ PAVLA",117,141,103,115,140,{"$f":"SUM(S45:W45)","v":616},{"$f":"MAX(S45:W45)","v":141},{"$f":"SUM(X45*1000)+Y45+0.16","v":616141.16},{"$f":"IF(S45=\"\",\"\",RANK(Z45,Z6:Z65,0))","v":37},null,null,null,null,40,{"$f":"IF(AE6<40,\"\",VLOOKUP(40,O6:AA65,4,FALSE))","v":"NOVOTNÁ PETRA"},{"$f":"IF(AE6<40,\"\",VLOOKUP(40,O6:AA65,10,FALSE))","v":590},null,null,{"$f":"IF(AO45=\"\",\"\",AW45)","v":1},null,null,"LAZUR VLADIMÍR",223,197,227,147,151,{"$f":"SUM(AO45:AS45)","v":945},{"$f":"MAX(AO45:AS45)","v":227},{"$f":"SUM(AT45*1000)+AU45+0.16","v":945227.16},{"$f":"IF(AO45=\"\",\"\",RANK(AV45,AV6:AV65,0))","v":1},null,null,null,null,40,{"$f":"IF(BA6<40,\"\",VLOOKUP(40,AK6:AW65,4,FALSE))","v":"KUTINA PAVEL"},{"$f":"IF(BA6<40,\"\",VLOOKUP(40,AK6:AW65,10,FALSE))","v":611},null,null,{"$f":"IF(BK45=\"\",\"\",BS45)","v":4},null,null,"MAŠÁT PETR",150,205,186,145,173,{"$f":"SUM(BK45:BO45)","v":859},{"$f":"MAX(BK45:BO45)","v":205},{"$f":"SUM(BP45*1000)+BQ45+0.16","v":859205.16},{"$f":"IF(BK45=\"\",\"\",RANK(BR45,BR6:BR65,0))","v":4},null,null,null,null,null,null,40,{"$f":"IF(BY6<40,\"\",VLOOKUP(40,BG6:BS65,4,FALSE))","v":"AUNICKÝ FRANTIŠEK"},{"$f":"IF(BY6<40,\"\",VLOOKUP(40,BG6:BS65,10,FALSE))","v":605},null,null,{"$f":"IF(CI45=\"\",\"\",CQ45)","v":35},null,null,"RŮŽIČKA VÁCLAV",143,173,117,75,111,{"$f":"SUM(CI45:CM45)","v":619},{"$f":"MAX(CI45:CM45)","v":173},{"$f":"SUM(CN45*1000)+CO45+0.16","v":619173.16},{"$f":"IF(CI45=\"\",\"\",RANK(CP45,CP6:CP65,0))","v":35},null,null,null,null,null,null,40,{"$f":"IF(CW6<40,\"\",VLOOKUP(40,CE6:CQ65,4,FALSE))","v":"PIPEK PAVEL"},{"$f":"IF(CW6<40,\"\",VLOOKUP(40,CE6:CQ65,10,FALSE))","v":577},null,null,{"$f":"IF(DG45=\"\",\"\",DO45)","v":17},null,null,"Pecka Jiří",153,148,144,128,178,{"$f":"SUM(DG45:DK45)","v":751},{"$f":"MAX(DG45:DK45)","v":178},{"$f":"SUM(DL45*1000)+DM45+0.16","v":751178.16},{"$f":"IF(DG45=\"\",\"\",RANK(DN45,DN6:DN65,0))","v":17},null,null,null,null,null,null,40,{"$f":"IF(DU6<40,\"\",VLOOKUP(40,DC6:DO65,4,FALSE))","v":"Aunický František"},{"$f":"IF(DU6<40,\"\",VLOOKUP(40,DC6:DO65,10,FALSE))","v":619},null,null,{"$f":"IF(EE45=\"\",\"\",EM45)","v":24},null,null,"Kazda Jan",149,138,159,127,121,{"$f":"SUM(EE45:EI45)","v":694},{"$f":"MAX(EE45:EI45)","v":159},{"$f":"SUM(EJ45*1000)+EK45+0.16","v":694159.16},{"$f":"IF(EE45=\"\",\"\",RANK(EL45,EL6:EL65,0))","v":24},null,null,null,null,null,null,40,{"$f":"IF(ES6<40,\"\",VLOOKUP(40,EA6:EM65,4,FALSE))","v":"Pavlíček Rudolf"},{"$f":"IF(ES6<40,\"\",VLOOKUP(40,EA6:EM65,10,FALSE))","v":623},null,null,{"$f":"IF(FC45=\"\",\"\",FK45)","v":7},null,null,"Šafařík Luděk",155,193,179,157,149,{"$f":"SUM(FC45:FG45)","v":833},{"$f":"MAX(FC45:FG45)","v":193},{"$f":"SUM(FH45*1000)+FI45+0.16","v":833193.16},{"$f":"IF(FC45=\"\",\"\",RANK(FJ45,FJ6:FJ65,0))","v":7},null,null,null,null,null,null,40,{"$f":"IF(FQ6<40,\"\",VLOOKUP(40,EY6:FL65,4,FALSE))","v":"Douša Adam"},{"$f":"IF(FQ6<40,\"\",VLOOKUP(40,EY6:FL65,10,FALSE))","v":631},null,null,{"$f":"IF(GA45=\"\",\"\",GI45)","v":""},null,null,null,null,null,null,null,null,{"$f":"SUM(GA45:GE45)","v":0},{"$f":"MAX(GA45:GE45)","v":0},{"$f":"SUM(GF45*1000)+GG45+0.16","v":0.16},{"$f":"IF(GA45=\"\",\"\",RANK(GH45,GH6:GH70,0))","v":""},null,null,null,null,null,null,40,{"$f":"IF(GO6<40,\"\",VLOOKUP(40,FW6:GI70,4,FALSE))","v":""},{"$f":"IF(GO6<40,\"\",VLOOKUP(40,FW6:GI70,10,FALSE))","v":""}]
[null,null,null,null,null,null,null,null,null,null,null,null,null,null,{"$f":"IF(S46=\"\",\"\",AA46)","v":26},null,null,"KOVÁŘ JAROSLAV",121,151,119,152,130,{"$f":"SUM(S46:W46)","v":673},{"$f":"MAX(S46:W46)","v":152},{"$f":"SUM(X46*1000)+Y46+0.15","v":673152.15},{"$f":"IF(S46=\"\",\"\",RANK(Z46,Z6:Z65,0))","v":26},null,null,null,null,41,{"$f":"IF(AE6<41,\"\",VLOOKUP(41,O6:AA65,4,FALSE))","v":"VESELÝ VLASTIMIL"},{"$f":"IF(AE6<41,\"\",VLOOKUP(41,O6:AA65,10,FALSE))","v":589},null,null,{"$f":"IF(AO46=\"\",\"\",AW46)","v":3},null,null,"ŠAFAŘÍK LUDĚK",168,181,156,223,177,{"$f":"SUM(AO46:AS46)","v":905},{"$f":"MAX(AO46:AS46)","v":223},{"$f":"SUM(AT46*1000)+AU46+0.15","v":905223.15},{"$f":"IF(AO46=\"\",\"\",RANK(AV46,AV6:AV65,0))","v":3},null,null,null,null,41,{"$f":"IF(BA6<41,\"\",VLOOKUP(41,AK6:AW65,4,FALSE))","v":"PLECHÁČEK MIROSLAV"},{"$f":"IF(BA6<41,\"\",VLOOKUP(41,AK6:AW65,10,FALSE))","v":608},null,null,{"$f":"IF(BK46=\"\",\"\",BS46)","v":25},null,null,"CARVAN PAVEL",170,127,138,133,137,{"$f":"SUM(BK46:BO46)","v":705},{"$f":"MAX(BK46:BO46)","v":170},{"$f":"SUM(BP46*1000)+BQ46+0.15","v":705170.15},{"$f":"IF(BK46=\"\",\"\",RANK(BR46,BR6:BR65,0))","v":25},null,null,null,null,null,null,41,{"$f":"IF(BY6<41,\"\",VLOOKUP(41,BG6:BS65,4,FALSE))","v":"KUTINA PAVEL"},{"$f":"IF(BY6<41,\"\",VLOOKUP(41,BG6:BS65,10,FALSE))","v":599},null,null,{"$f":"IF(CI46=\"\",\"\",CQ46)","v":36},null,null,"TICHÝ HUGO",119,110,122,144,123,{"$f":"SUM(CI46:CM46)","v":618},{"$f":"MAX(CI46:CM46)","v":144},{"$f":"SUM(CN46*1000)+CO46+0.15","v":618144.15},{"$f":"IF(CI46=\"\",\"\",RANK(CP46,CP6:CP65,0))","v":36},null,null,null,null,null,null,41,{"$f":"IF(CW6<41,\"\",VLOOKUP(41,CE6:CQ65,4,FALSE))","v":"KOVÁŘ JAROSLAV"},{"$f":"IF(CW6<41,\"\",VLOOKUP(41,CE6:CQ65,10,FALSE))","v":569},null,null,{"$f":"IF(DG46=\"\",\"\",DO46)","v":10},null,null,"Křemenák Petr",174,127,186,145,169,{"$f":"SUM(DG46:DK46)","v":801},{"$f":"MAX(DG46:DK46)","v":186},{"$f":"SUM(DL46*1000)+DM46+0.15","v":801186.15},{"$f":"IF(DG46=\"\",\"\",RANK(DN46,DN6:DN65,0))","v":10},null,null,null,null,null,null,41,{"$f":"IF(DU6<41,\"\",VLOOKUP(41,DC6:DO65,4,FALSE))","v":"Křikava Miroslav"},{"$f":"IF(DU6<41,\"\",VLOOKUP(41,DC6:DO65,10,FALSE))","v":619},null,null,{"$f":"IF(EE46=\"\",\"\",EM46)","v":46},null,null,"Kovář Jaroslav",124,133,90,128,121,{"$f":"SUM(EE46:EI46)","v":596},{"$f":"MAX(EE46:EI46)","v":133},{"$f":"SUM(EJ46*1000)+EK46+0.15","v":596133.15},{"$f":"IF(EE46=\"\",\"\",RANK(EL46,EL6:EL65,0))","v":46},null,null,null,null,null,null,41,{"$f":"IF(ES6<41,\"\",VLOOKUP(41,EA6:EM65,4,FALSE))","v":"Táborský František"},{"$f":"IF(ES6<41,\"\",VLOOKUP(41,EA6:EM65,10,FALSE))","v":615},null,null,{"$f":"IF(FC46=\"\",\"\",FK46)","v":3},null,null,"Lazur Vladimír",185,148,223,128,179,{"$f":"SUM(FC46:FG46)","v":863},{"$f":"MAX(FC46:FG46)","v":223},{"$f":"SUM(FH46*1000)+FI46+0.15","v":863223.15},{"$f":"IF(FC46=\"\",\"\",RANK(FJ46,FJ6:FJ65,0))","v":3},null,null,null,null,null,null,41,{"$f":"IF(FQ6<41,\"\",VLOOKUP(41,EY6:FL65,4,FALSE))","v":"Mottl Pavel"},{"$f":"IF(FQ6<41,\"\",VLOOKUP(41,EY6:FL65,10,FALSE))","v":628},null,null,{"$f":"IF(GA46=\"\",\"\",GI46)","v":""},null,null,null,null,null,null,null,null,{"$f":"SUM(GA46:GE46)","v":0},{"$f":"MAX(GA46:GE46)","v":0},{"$f":"SUM(GF46*1000)+GG46+0.15","v":0.15},{"$f":"IF(GA46=\"\",\"\",RANK(GH46,GH6:GH70,0))","v":""},null,null,null,null,null,null,41,{"$f":"IF(GO6<41,\"\",VLOOKUP(41,FW6:GI70,4,FALSE))","v":""},{"$f":"IF(GO6<41,\"\",VLOOKUP(41,FW6:GI70,10,FALSE))","v":""}]
[null,null,null,null,null,null,null,null,null,null,null,null,null,null,null,null,null,null,{"$f":"SUM(S42:S46)","v":632},{"$f":"SUM(T42:T46)","v":765},{"$f":"SUM(U42:U46)","v":706},{"$f":"SUM(V42:V46)","v":787},{"$f":"SUM(W42:W46)","v":783},null,null,null,null,{"$f":"SUM(S47:W47)","v":3673},null,null,null,42,{"$f":"IF(AE6<42,\"\",VLOOKUP(42,O6:AA65,4,FALSE))","v":"ČERMÁK TOMÁŠ"},{"$f":"IF(AE6<42,\"\",VLOOKUP(42,O6:AA65,10,FALSE))","v":577},null,null,null,null,null,null,{"$f":"SUM(AO42:AO46)","v":856},{"$f":"SUM(AP42:AP46)","v":814},{"$f":"SUM(AQ42:AQ46)","v":784},{"$f":"SUM(AR42:AR46)","v":788},{"$f":"SUM(AS42:AS46)","v":727},null,null,null,null,{"$f":"SUM(AO47:AS47)","v":3969},null,null,null,42,{"$f":"IF(BA6<42,\"\",VLOOKUP(42,AK6:AW65,4,FALSE))","v":"AUNICKÝ FRANTIŠEK"},{"$f":"IF(BA6<42,\"\",VLOOKUP(42,AK6:AW65,10,FALSE))","v":604},null,null,null,null,null,null,{"$f":"SUM(BK42:BK46)","v":768},{"$f":"SUM(BL42:BL46)","v":841},{"$f":"SUM(BM42:BM46)","v":717},{"$f":"SUM(BN42:BN46)","v":774},{"$f":"SUM(BO42:BO46)","v":776},null,null,null,null,{"$f":"SUM(BK47:BO47)","v":3876},{"$f":"MAX(BK47:BO47)","v":841},{"$f":"IF(BK42=\"\",\"\",SUM(BT47*10000)+BU47)","v":38760841},null,null,null,42,{"$f":"IF(BY6<42,\"\",VLOOKUP(42,BG6:BS65,4,FALSE))","v":"ŠAFÁŘ LADISLAV"},{"$f":"IF(BY6<42,\"\",VLOOKUP(42,BG6:BS65,10,FALSE))","v":593},null,null,null,null,null,null,{"$f":"SUM(CI42:CI46)","v":609},{"$f":"SUM(CJ42:CJ46)","v":685},{"$f":"SUM(CK42:CK46)","v":678},{"$f":"SUM(CL42:CL46)","v":705},{"$f":"SUM(CM42:CM46)","v":653},null,null,null,null,{"$f":"SUM(CI47:CM47)","v":3330},{"$f":"MAX(CI47:CM47)","v":705},{"$f":"IF(CI42=\"\",\"\",SUM(CR47*1000)+CS47)","v":3330705},null,null,null,42,{"$f":"IF(CW6<42,\"\",VLOOKUP(42,CE6:CQ65,4,FALSE))","v":"ŘEHÁK JAROSLAV"},{"$f":"IF(CW6<42,\"\",VLOOKUP(42,CE6:CQ65,10,FALSE))","v":560},null,null,null,null,null,null,{"$f":"SUM(DG42:DG46)","v":760},{"$f":"SUM(DH42:DH46)","v":663},{"$f":"SUM(DI42:DI46)","v":864},{"$f":"SUM(DJ42:DJ46)","v":749},{"$f":"SUM(DK42:DK46)","v":762},null,null,null,null,{"$f":"SUM(DG47:DK47)","v":3798},{"$f":"MAX(DG47:DK47)","v":864},{"$f":"IF(DG42=\"\",\"\",SUM(DP47*1000)+DQ47)","v":3798864},null,null,null,42,{"$f":"IF(DU6<42,\"\",VLOOKUP(42,DC6:DO65,4,FALSE))","v":"Novotná Petra"},{"$f":"IF(DU6<42,\"\",VLOOKUP(42,DC6:DO65,10,FALSE))","v":606},null,null,null,null,null,null,{"$f":"SUM(EE42:EE46)","v":749},{"$f":"SUM(EF42:EF46)","v":802},{"$f":"SUM(EG42:EG46)","v":722},{"$f":"SUM(EH42:EH46)","v":769},{"$f":"SUM(EI42:EI46)","v":673},null,null,null,null,{"$f":"SUM(EE47:EI47)","v":3715},{"$f":"MAX(EE47:EI47)","v":802},{"$f":"IF(EE42=\"\",\"\",SUM(EN47*1000)+EO47)","v":3715802},null,null,null,42,{"$f":"IF(ES6<42,\"\",VLOOKUP(42,EA6:EM65,4,FALSE))","v":"Sehnal Ivan"},{"$f":"IF(ES6<42,\"\",VLOOKUP(42,EA6:EM65,10,FALSE))","v":612},null,null,null,null,null,null,{"$f":"SUM(FC42:FC46)","v":776},{"$f":"SUM(FD42:FD46)","v":778},{"$f":"SUM(FE42:FE46)","v":873},{"$f":"SUM(FF42:FF46)","v":747},{"$f":"SUM(FG42:FG46)","v":798},null,null,null,null,{"$f":"SUM(FC47:FG47)","v":3972},{"$f":"MAX(FC47:FG47)","v":873},{"$f":"IF(FC42=\"\",\"\",SUM(FL47*1000)+FM47)","v":3972873},null,null,null,42,{"$f":"IF(FQ6<42,\"\",VLOOKUP(42,EY6:FL65,4,FALSE))","v":"Brož Stanislav"},{"$f":"IF(FQ6<42,\"\",VLOOKUP(42,EY6:FL65,10,FALSE))","v":625},null,null,null,null,null,null,{"$f":"SUM(GA42:GA46)","v":0},{"$f":"SUM(GB42:GB46)","v":0},{"$f":"SUM(GC42:GC46)","v":0},{"$f":"SUM(GD42:GD46)","v":0},{"$f":"SUM(GE42:GE46)","v":0},null,null,null,null,{"$f":"SUM(GA47:GE47)","v":0},{"$f":"MAX(GA47:GE47)","v":0},{"$f":"IF(GA42=\"\",\"\",SUM(GJ47*1000)+GK47)","v":""},null,null,null,42,{"$f":"IF(GO6<42,\"\",VLOOKUP(42,FW6:GI70,4,FALSE))","v":""},{"$f":"IF(GO6<42,\"\",VLOOKUP(42,FW6:GI70,10,FALSE))","v":""}]
[null,null,null,null,null,null,null,null,null,null,null,null,null,null,{"$f":"IF(S48=\"\",\"\",AA48)","v":46},8,"VRŠOVICE II.","AUNICKÝ FRANTIŠEK",126,114,104,119,97,{"$f":"SUM(S48:W48)","v":560},{"$f":"MAX(S48:W48)","v":126},{"$f":"SUM(X48*1000)+Y48+0.14","v":560126.14},{"$f":"IF(S48=\"\",\"\",RANK(Z48,Z6:Z65,0))","v":46},null,{"$f":"RANK(AB53,AB11:AB65,0)","v":8},null,null,43,{"$f":"IF(AE6<43,\"\",VLOOKUP(43,O6:AA65,4,FALSE))","v":"KŘIKAVA MIROSLAV"},{"$f":"IF(AE6<43,\"\",VLOOKUP(43,O6:AA65,10,FALSE))","v":572},null,null,{"$f":"IF(AO48=\"\",\"\",AW48)","v":22},8,"HOSTIVAŘ II.","ŠAFÁŘ LADISLAV",159,185,109,115,140,{"$f":"SUM(AO48:AS48)","v":708},{"$f":"MAX(AO48:AS48)","v":185},{"$f":"SUM(AT48*1000)+AU48+0.14","v":708185.14},{"$f":"IF(AO48=\"\",\"\",RANK(AV48,AV6:AV65,0))","v":22},null,{"$f":"RANK(AX53,AX11:AX65,0)","v":10},null,null,43,{"$f":"IF(BA6<43,\"\",VLOOKUP(43,AK6:AW65,4,FALSE))","v":"FAY VLASTIMIL"},{"$f":"IF(BA6<43,\"\",VLOOKUP(43,AK6:AW65,10,FALSE))","v":603},null,null,{"$f":"IF(BK48=\"\",\"\",BS48)","v":34},8,"KAČEROV II.","DOUŠA ADAM",148,153,119,123,129,{"$f":"SUM(BK48:BO48)","v":672},{"$f":"MAX(BK48:BO48)","v":153},{"$f":"SUM(BP48*1000)+BQ48+0.14","v":672153.14},{"$f":"IF(BK48=\"\",\"\",RANK(BR48,BR6:BR65,0))","v":34},null,null,null,{"$f":"IF(BK48=\"\",\"\",RANK(BV53,BV11:BV65,0))","v":6},null,null,43,{"$f":"IF(BY6<43,\"\",VLOOKUP(43,BG6:BS65,4,FALSE))","v":"NOVOTNÁ JANA"},{"$f":"IF(BY6<43,\"\",VLOOKUP(43,BG6:BS65,10,FALSE))","v":581},null,null,{"$f":"IF(CI48=\"\",\"\",CQ48)","v":6},8,"ŘEPY II.","SLADOVNÍK MILOSLAV",166,170,161,186,159,{"$f":"SUM(CI48:CM48)","v":842},{"$f":"MAX(CI48:CM48)","v":186},{"$f":"SUM(CN48*1000)+CO48+0.14","v":842186.14},{"$f":"IF(CI48=\"\",\"\",RANK(CP48,CP6:CP65,0))","v":6},null,null,null,{"$f":"IF(CI48=\"\",\"\",RANK(CT53,CT11:CT65,0))","v":1},null,null,43,{"$f":"IF(CW6<43,\"\",VLOOKUP(43,CE6:CQ65,4,FALSE))","v":"KOLLÁR PAVEL"},{"$f":"IF(CW6<43,\"\",VLOOKUP(43,CE6:CQ65,10,FALSE))","v":558},null,null,{"$f":"IF(DG48=\"\",\"\",DO48)","v":37},8,"KLÍČOV II.","Řehák Jaroslav",121,125,158,116,129,{"$f":"SUM(DG48:DK48)","v":649},{"$f":"MAX(DG48:DK48)","v":158},{"$f":"SUM(DL48*1000)+DM48+0.14","v":649158.14},{"$f":"IF(DG48=\"\",\"\",RANK(DN48,DN6:DN65,0))","v":37},null,null,null,{"$f":"IF(DG48=\"\",\"\",RANK(DR53,DR11:DR65,0))","v":10},null,null,43,{"$f":"IF(DU6<43,\"\",VLOOKUP(43,DC6:DO65,4,FALSE))","v":"Novotná Jana"},{"$f":"IF(DU6<43,\"\",VLOOKUP(43,DC6:DO65,10,FALSE))","v":585},null,null,{"$f":"IF(EE48=\"\",\"\",EM48)","v":47},8,"VRŠOVICE II.","Aunický František",112,76,127,177,101,{"$f":"SUM(EE48:EI48)","v":593},{"$f":"MAX(EE48:EI48)","v":177},{"$f":"SUM(EJ48*1000)+EK48+0.14","v":593177.14},{"$f":"IF(EE48=\"\",\"\",RANK(EL48,EL6:EL65,0))","v":47},null,null,null,{"$f":"IF(EE48=\"\",\"\",RANK(EP53,EP11:EP65,0))","v":10},null,null,43,{"$f":"IF(ES6<43,\"\",VLOOKUP(43,EA6:EM65,4,FALSE))","v":"Růžička Václav"},{"$f":"IF(ES6<43,\"\",VLOOKUP(43,EA6:EM65,10,FALSE))","v":598},null,null,{"$f":"IF(FC48=\"\",\"\",FK48)","v":33},8,"HOSTIVAŘ II.","Šafář Ladislav",135,124,135,121,137,{"$f":"SUM(FC48:FG48)","v":652},{"$f":"MAX(FC48:FG48)","v":137},{"$f":"SUM(FH48*1000)+FI48+0.14","v":652137.14},{"$f":"IF(FC48=\"\",\"\",RANK(FJ48,FJ6:FJ65,0))","v":33},null,null,null,{"$f":"IF(FC48=\"\",\"\",RANK(FN53,FN11:FN65,0))","v":6},null,null,43,{"$f":"IF(FQ6<43,\"\",VLOOKUP(43,EY6:FL65,4,FALSE))","v":"Pavlíček Rudolf"},{"$f":"IF(FQ6<43,\"\",VLOOKUP(43,EY7:FL66,10,FALSE))","v":619},null,null,{"$f":"IF(GA48=\"\",\"\",GI48)","v":""},8,"VRŠOVICE II.",null,null,null,null,null,null,{"$f":"SUM(GA48:GE48)","v":0},{"$f":"MAX(GA48:GE48)","v":0},{"$f":"SUM(GF48*1000)+GG48+0.14","v":0.14000000000000001},{"$f":"IF(GA48=\"\",\"\",RANK(GH48,GH6:GH70,0))","v":""},null,null,null,{"$f":"IF(GA48=\"\",\"\",RANK(GL53,GL11:GL71,0))","v":""},null,null,43,{"$f":"IF(GO6<43,\"\",VLOOKUP(43,FW6:GI70,4,FALSE))","v":""},{"$f":"IF(GO6<43,\"\",VLOOKUP(43,FW6:GI70,10,FALSE))","v":""}]
[null,null,null,null,null,null,null,null,null,null,null,null,null,null,{"$f":"IF(S49=\"\",\"\",AA49)","v":30},null,null,"KAZDA JAN",124,116,157,134,124,{"$f":"SUM(S49:W49)","v":655},{"$f":"MAX(S49:W49)","v":157},{"$f":"SUM(X49*1000)+Y49+0.13","v":655157.13},{"$f":"IF(S49=\"\",\"\",RANK(Z49,Z6:Z65,0))","v":30},null,null,null,null,44,{"$f":"IF(AE6<44,\"\",VLOOKUP(44,O6:AA65,4,FALSE))","v":"KOLLÁR PAVEL"},{"$f":"IF(AE6<44,\"\",VLOOKUP(44,O6:AA65,10,FALSE))","v":571},null,null,{"$f":"IF(AO49=\"\",\"\",AW49)","v":26},null,null,"BERGER MICHAL",140,144,144,129,132,{"$f":"SUM(AO49:AS49)","v":689},{"$f":"MAX(AO49:AS49)","v":144},{"$f":"SUM(AT49*1000)+AU49+0.13","v":689144.13},{"$f":"IF(AO49=\"\",\"\",RANK(AV49,AV6:AV65,0))","v":26},null,null,null,null,44,{"$f":"IF(BA6<44,\"\",VLOOKUP(44,AK6:AW65,4,FALSE))","v":"LAZUROVÁ JIŘINA"},{"$f":"IF(BA6<44,\"\",VLOOKUP(44,AK6:AW65,10,FALSE))","v":598},null,null,{"$f":"IF(BK49=\"\",\"\",BS49)","v":19},null,null,"BROŽ STANISLAV",156,167,144,107,168,{"$f":"SUM(BK49:BO49)","v":742},{"$f":"MAX(BK49:BO49)","v":168},{"$f":"SUM(BP49*1000)+BQ49+0.13","v":742168.13},{"$f":"IF(BK49=\"\",\"\",RANK(BR49,BR6:BR65,0))","v":19},null,null,null,null,null,null,44,{"$f":"IF(BY6<44,\"\",VLOOKUP(44,BG6:BS65,4,FALSE))","v":"POSPÍŠIL LUKÁŠ"},{"$f":"IF(BY6<44,\"\",VLOOKUP(44,BG6:BS65,10,FALSE))","v":573},null,null,{"$f":"IF(CI49=\"\",\"\",CQ49)","v":16},null,null,"ALBA VLADIMÍR",161,148,131,148,150,{"$f":"SUM(CI49:CM49)","v":738},{"$f":"MAX(CI49:CM49)","v":161},{"$f":"SUM(CN49*1000)+CO49+0.13","v":738161.13},{"$f":"IF(CI49=\"\",\"\",RANK(CP49,CP6:CP65,0))","v":16},null,null,null,null,null,null,44,{"$f":"IF(CW6<44,\"\",VLOOKUP(44,CE6:CQ65,4,FALSE))","v":"VYCHNEROVÁ MICHAELA"},{"$f":"IF(CW6<44,\"\",VLOOKUP(44,CE6:CQ65,10,FALSE))","v":556},null,null,{"$f":"IF(DG49=\"\",\"\",DO49)","v":50},null,null,"Šafrová Martina",108,81,106,115,108,{"$f":"SUM(DG49:DK49)","v":518},{"$f":"MAX(DG49:DK49)","v":115},{"$f":"SUM(DL49*1000)+DM49+0.13","v":518115.13},{"$f":"IF(DG49=\"\",\"\",RANK(DN49,DN6:DN65,0))","v":50},null,null,null,null,null,null,44,{"$f":"IF(DU6<44,\"\",VLOOKUP(44,DC6:DO65,4,FALSE))","v":"Pavlíček Rudolf"},{"$f":"IF(DU6<44,\"\",VLOOKUP(44,DC6:DO65,10,FALSE))","v":564},null,null,{"$f":"IF(EE49=\"\",\"\",EM49)","v":40},null,null,"Pavlíček Rudolf",94,120,94,170,145,{"$f":"SUM(EE49:EI49)","v":623},{"$f":"MAX(EE49:EI49)","v":170},{"$f":"SUM(EJ49*1000)+EK49+0.13","v":623170.13},{"$f":"IF(EE49=\"\",\"\",RANK(EL49,EL6:EL65,0))","v":40},null,null,null,null,null,null,44,{"$f":"IF(ES6<44,\"\",VLOOKUP(44,EA6:EM65,4,FALSE))","v":"Fay Vlastimil"},{"$f":"IF(ES6<44,\"\",VLOOKUP(44,EA6:EM65,10,FALSE))","v":598},null,null,{"$f":"IF(FC49=\"\",\"\",FK49)","v":21},null,null,"Berger Michal",133,137,172,132,155,{"$f":"SUM(FC49:FG49)","v":729},{"$f":"MAX(FC49:FG49)","v":172},{"$f":"SUM(FH49*1000)+FI49+0.13","v":729172.13},{"$f":"IF(FC49=\"\",\"\",RANK(FJ49,FJ6:FJ65,0))","v":21},null,null,null,null,null,null,44,{"$f":"IF(FQ6<44,\"\",VLOOKUP(44,EY7:FL66,4,FALSE))","v":"Kutina Pavel"},{"$f":"IF(FQ6<44,\"\",VLOOKUP(44,EY6:FL65,10,FALSE))","v":615},null,null,{"$f":"IF(GA49=\"\",\"\",GI49)","v":""},null,null,null,null,null,null,null,null,{"$f":"SUM(GA49:GE49)","v":0},{"$f":"MAX(GA49:GE49)","v":0},{"$f":"SUM(GF49*1000)+GG49+0.13","v":0.13},{"$f":"IF(GA49=\"\",\"\",RANK(GH49,GH6:GH70,0))","v":""},null,null,null,null,null,null,44,{"$f":"IF(GO6<44,\"\",VLOOKUP(44,FW6:GI70,4,FALSE))","v":""},{"$f":"IF(GO6<44,\"\",VLOOKUP(44,FW6:GI70,10,FALSE))","v":""}]
[null,null,null,null,null,null,null,null,null,null,null,null,null,null,{"$f":"IF(S50=\"\",\"\",AA50)","v":41},null,null,"VESELÝ VLASTIMIL",127,124,99,134,105,{"$f":"SUM(S50:W50)","v":589},{"$f":"MAX(S50:W50)","v":134},{"$f":"SUM(X50*1000)+Y50+0.12","v":589134.12},{"$f":"IF(S50=\"\",\"\",RANK(Z50,Z6:Z65,0))","v":41},null,null,null,null,45,{"$f":"IF(AE6<45,\"\",VLOOKUP(45,O6:AA65,4,FALSE))","v":"FAY VLASTIMIL"},{"$f":"IF(AE6<45,\"\",VLOOKUP(45,O6:AA65,10,FALSE))","v":571},null,null,{"$f":"IF(AO50=\"\",\"\",AW50)","v":49},null,null,"BERGEROVÁ MARCELA",85,85,109,107,118,{"$f":"SUM(AO50:AS50)","v":504},{"$f":"MAX(AO50:AS50)","v":118},{"$f":"SUM(AT50*1000)+AU50+0.12","v":504118.12},{"$f":"IF(AO50=\"\",\"\",RANK(AV50,AV6:AV65,0))","v":49},null,null,null,null,45,{"$f":"IF(BA6<45,\"\",VLOOKUP(45,AK6:AW65,4,FALSE))","v":"MOTTL PAVEL"},{"$f":"IF(BA6<45,\"\",VLOOKUP(45,AK6:AW65,10,FALSE))","v":596},null,null,{"$f":"IF(BK50=\"\",\"\",BS50)","v":5},null,null,"STEJSKAL MARTIN",152,228,196,158,112,{"$f":"SUM(BK50:BO50)","v":846},{"$f":"MAX(BK50:BO50)","v":228},{"$f":"SUM(BP50*1000)+BQ50+0.12","v":846228.12},{"$f":"IF(BK50=\"\",\"\",RANK(BR50,BR6:BR65,0))","v":5},null,null,null,null,null,null,45,{"$f":"IF(BY6<45,\"\",VLOOKUP(45,BG6:BS65,4,FALSE))","v":"ŘEHÁK JAROSLAV"},{"$f":"IF(BY6<45,\"\",VLOOKUP(45,BG6:BS65,10,FALSE))","v":567},null,null,{"$f":"IF(CI50=\"\",\"\",CQ50)","v":12},null,null,"MOTTL PAVEL",124,169,137,193,150,{"$f":"SUM(CI50:CM50)","v":773},{"$f":"MAX(CI50:CM50)","v":193},{"$f":"SUM(CN50*1000)+CO50+0.12","v":773193.12},{"$f":"IF(CI50=\"\",\"\",RANK(CP50,CP6:CP65,0))","v":12},null,null,null,null,null,null,45,{"$f":"IF(CW6<45,\"\",VLOOKUP(45,CE6:CQ65,4,FALSE))","v":"HÁJEK MOJMÍR"},{"$f":"IF(CW6<45,\"\",VLOOKUP(45,CE6:CQ65,10,FALSE))","v":549},null,null,{"$f":"IF(DG50=\"\",\"\",DO50)","v":42},null,null,"Novotná Petra",91,129,139,126,121,{"$f":"SUM(DG50:DK50)","v":606},{"$f":"MAX(DG50:DK50)","v":139},{"$f":"SUM(DL50*1000)+DM50+0.12","v":606139.12},{"$f":"IF(DG50=\"\",\"\",RANK(DN50,DN6:DN65,0))","v":42},null,null,null,null,null,null,45,{"$f":"IF(DU6<45,\"\",VLOOKUP(45,DC6:DO65,4,FALSE))","v":"Čermák Tomáš"},{"$f":"IF(DU6<45,\"\",VLOOKUP(45,DC6:DO65,10,FALSE))","v":561},null,null,{"$f":"IF(EE50=\"\",\"\",EM50)","v":44},null,null,"Fay Vlastimil",94,134,122,119,129,{"$f":"SUM(EE50:EI50)","v":598},{"$f":"MAX(EE50:EI50)","v":134},{"$f":"SUM(EJ50*1000)+EK50+0.12","v":598134.12},{"$f":"IF(EE50=\"\",\"\",RANK(EL50,EL6:EL65,0))","v":44},null,null,null,null,null,null,45,{"$f":"IF(ES6<45,\"\",VLOOKUP(45,EA6:EM65,4,FALSE))","v":"Tichý Hugo"},{"$f":"IF(ES6<45,\"\",VLOOKUP(45,EA6:EM65,10,FALSE))","v":597},null,null,{"$f":"IF(FC50=\"\",\"\",FK50)","v":48},null,null,"Lazurová Jiřina",102,116,115,132,86,{"$f":"SUM(FC50:FG50)","v":551},{"$f":"MAX(FC50:FG50)","v":132},{"$f":"SUM(FH50*1000)+FI50+0.12","v":551132.12},{"$f":"IF(FC50=\"\",\"\",RANK(FJ50,FJ6:FJ65,0))","v":48},null,null,null,null,null,null,45,{"$f":"IF(FQ6<45,\"\",VLOOKUP(45,EY6:FL65,4,FALSE))","v":"Růžička Václav"},{"$f":"IF(FQ6<45,\"\",VLOOKUP(45,EY6:FL65,10,FALSE))","v":586},null,null,{"$f":"IF(GA50=\"\",\"\",GI50)","v":""},null,null,null,null,null,null,null,null,{"$f":"SUM(GA50:GE50)","v":0},{"$f":"MAX(GA50:GE50)","v":0},{"$f":"SUM(GF50*1000)+GG50+0.12","v":0.12},{"$f":"IF(GA50=\"\",\"\",RANK(GH50,GH6:GH70,0))","v":""},null,null,null,null,null,null,45,{"$f":"IF(GO6<45,\"\",VLOOKUP(45,FW6:GI70,4,FALSE))","v":""},{"$f":"IF(GO6<45,\"\",VLOOKUP(45,FW6:GI70,10,FALSE))","v":""}]
[null,null,null,null,null,null,null,null,null,null,null,null,null,null,{"$f":"IF(S51=\"\",\"\",AA51)","v":45},null,null,"FAY VLASTIMIL",138,83,110,134,106,{"$f":"SUM(S51:W51)","v":571},{"$f":"MAX(S51:W51)","v":138},{"$f":"SUM(X51*1000)+Y51+0.11","v":571138.11},{"$f":"IF(S51=\"\",\"\",RANK(Z51,Z6:Z65,0))","v":45},null,null,null,null,46,{"$f":"IF(AE6<46,\"\",VLOOKUP(46,O6:AA65,4,FALSE))","v":"AUNICKÝ FRANTIŠEK"},{"$f":"IF(AE6<46,\"\",VLOOKUP(46,O6:AA65,10,FALSE))","v":560},null,null,{"$f":"IF(AO51=\"\",\"\",AW51)","v":50},null,null,"KALOŠOVÁ DAGMAR",99,89,98,99,113,{"$f":"SUM(AO51:AS51)","v":498},{"$f":"MAX(AO51:AS51)","v":113},{"$f":"SUM(AT51*1000)+AU51+0.11","v":498113.11},{"$f":"IF(AO51=\"\",\"\",RANK(AV51,AV6:AV65,0))","v":50},null,null,null,null,46,{"$f":"IF(BA6<46,\"\",VLOOKUP(46,AK6:AW65,4,FALSE))","v":"ŘEHÁK JAROSLAV"},{"$f":"IF(BA6<46,\"\",VLOOKUP(46,AK6:AW65,10,FALSE))","v":573},null,null,{"$f":"IF(BK51=\"\",\"\",BS51)","v":29},null,null,"BREJCHA JAROSLAV",151,117,158,120,137,{"$f":"SUM(BK51:BO51)","v":683},{"$f":"MAX(BK51:BO51)","v":158},{"$f":"SUM(BP51*1000)+BQ51+0.11","v":683158.11},{"$f":"IF(BK51=\"\",\"\",RANK(BR51,BR6:BR65,0))","v":29},null,null,null,null,null,null,46,{"$f":"IF(BY6<46,\"\",VLOOKUP(46,BG6:BS65,4,FALSE))","v":"ČERMÁK TOMÁŠ"},{"$f":"IF(BY6<46,\"\",VLOOKUP(46,BG6:BS65,10,FALSE))","v":564},null,null,{"$f":"IF(CI51=\"\",\"\",CQ51)","v":9},null,null,"KROČIL TOMÁŠ",146,218,142,138,147,{"$f":"SUM(CI51:CM51)","v":791},{"$f":"MAX(CI51:CM51)","v":218},{"$f":"SUM(CN51*1000)+CO51+0.11","v":791218.11},{"$f":"IF(CI51=\"\",\"\",RANK(CP51,CP6:CP65,0))","v":9},null,null,null,null,null,null,46,{"$f":"IF(CW6<46,\"\",VLOOKUP(46,CE6:CQ65,4,FALSE))","v":"TÁBORSKÝ FRANTIŠEK"},{"$f":"IF(CW6<46,\"\",VLOOKUP(46,CE6:CQ65,10,FALSE))","v":535},null,null,{"$f":"IF(DG51=\"\",\"\",DO51)","v":43},null,null,"Novotná Jana",99,105,134,97,150,{"$f":"SUM(DG51:DK51)","v":585},{"$f":"MAX(DG51:DK51)","v":150},{"$f":"SUM(DL51*1000)+DM51+0.11","v":585150.11},{"$f":"IF(DG51=\"\",\"\",RANK(DN51,DN6:DN65,0))","v":43},null,null,null,null,null,null,46,{"$f":"IF(DU6<46,\"\",VLOOKUP(46,DC6:DO65,4,FALSE))","v":"Katolický Zdenek"},{"$f":"IF(DU6<46,\"\",VLOOKUP(46,DC6:DO65,10,FALSE))","v":557},null,null,{"$f":"IF(EE51=\"\",\"\",EM51)","v":14},null,null,"Bošek Jan",169,142,160,161,141,{"$f":"SUM(EE51:EI51)","v":773},{"$f":"MAX(EE51:EI51)","v":169},{"$f":"SUM(EJ51*1000)+EK51+0.11","v":773169.11},{"$f":"IF(EE51=\"\",\"\",RANK(EL51,EL6:EL65,0))","v":14},null,null,null,null,null,null,46,{"$f":"IF(ES6<46,\"\",VLOOKUP(46,EA6:EM65,4,FALSE))","v":"Kovář Jaroslav"},{"$f":"IF(ES6<46,\"\",VLOOKUP(46,EA6:EM65,10,FALSE))","v":596},null,null,{"$f":"IF(FC51=\"\",\"\",FK51)","v":23},null,null,"Mysliveček Jaroslav",153,150,115,173,126,{"$f":"SUM(FC51:FG51)","v":717},{"$f":"MAX(FC51:FG51)","v":173},{"$f":"SUM(FH51*1000)+FI51+0.11","v":717173.11},{"$f":"IF(FC51=\"\",\"\",RANK(FJ51,FJ6:FJ65,0))","v":23},null,null,null,null,null,null,46,{"$f":"IF(FQ6<46,\"\",VLOOKUP(46,EY6:FL65,4,FALSE))","v":"Pelikán Stanislav"},{"$f":"IF(FQ6<46,\"\",VLOOKUP(46,EY6:FL65,10,FALSE))","v":578},null,null,{"$f":"IF(GA51=\"\",\"\",GI51)","v":""},null,null,null,null,null,null,null,null,{"$f":"SUM(GA51:GE51)","v":0},{"$f":"MAX(GA51:GE51)","v":0},{"$f":"SUM(GF51*1000)+GG51+0.11","v":0.11},{"$f":"IF(GA51=\"\",\"\",RANK(GH51,GH6:GH70,0))","v":""},null,null,null,null,null,null,46,{"$f":"IF(GO6<46,\"\",VLOOKUP(46,FW6:GI70,4,FALSE))","v":""},{"$f":"IF(GO6<46,\"\",VLOOKUP(46,FW6:GI70,10,FALSE))","v":""}]
[null,null,null,null,null,null,null,null,null,null,null,null,null,null,{"$f":"IF(S52=\"\",\"\",AA52)","v":39},null,null,"POSPÍŠIL LUKÁŠ ",170,122,100,128,91,{"$f":"SUM(S52:W52)","v":611},{"$f":"MAX(S52:W52)","v":170},{"$f":"SUM(X52*1000)+Y52+0.1","v":611170.1},{"$f":"IF(S52=\"\",\"\",RANK(Z52,Z6:Z65,0))","v":39},null,null,null,null,47,{"$f":"IF(AE6<47,\"\",VLOOKUP(47,O6:AA65,4,FALSE))","v":"ŘEHÁK JAROSLAV"},{"$f":"IF(AE6<47,\"\",VLOOKUP(47,O6:AA65,10,FALSE))","v":553},null,null,{"$f":"IF(AO52=\"\",\"\",AW52)","v":44},null,null,"LAZUROVÁ JIŘINA",115,96,134,117,136,{"$f":"SUM(AO52:AS52)","v":598},{"$f":"MAX(AO52:AS52)","v":136},{"$f":"SUM(AT52*1000)+AU52+0.1","v":598136.1},{"$f":"IF(AO52=\"\",\"\",RANK(AV52,AV6:AV65,0))","v":44},null,null,null,null,47,{"$f":"IF(BA6<47,\"\",VLOOKUP(47,AK6:AW65,4,FALSE))","v":"TÁBORSKÝ FRANTIŠEK"},{"$f":"IF(BA6<47,\"\",VLOOKUP(47,AK6:AW65,10,FALSE))","v":563},null,null,{"$f":"IF(BK52=\"\",\"\",BS52)","v":41},null,null,"KUTINA PAVEL",97,101,119,128,154,{"$f":"SUM(BK52:BO52)","v":599},{"$f":"MAX(BK52:BO52)","v":154},{"$f":"SUM(BP52*1000)+BQ52+0.1","v":599154.1},{"$f":"IF(BK52=\"\",\"\",RANK(BR52,BR6:BR65,0))","v":41},null,null,null,null,null,null,47,{"$f":"IF(BY6<47,\"\",VLOOKUP(47,BG6:BS65,4,FALSE))","v":"KŘIKAVA MIROSLAV"},{"$f":"IF(BY6<47,\"\",VLOOKUP(47,BG6:BS65,10,FALSE))","v":536},null,null,{"$f":"IF(CI52=\"\",\"\",CQ52)","v":1},null,null,"POSPÍŠIL VÁCLAV",187,192,175,168,179,{"$f":"SUM(CI52:CM52)","v":901},{"$f":"MAX(CI52:CM52)","v":192},{"$f":"SUM(CN52*1000)+CO52+0.1","v":901192.1},{"$f":"IF(CI52=\"\",\"\",RANK(CP52,CP6:CP65,0))","v":1},null,null,null,null,null,null,47,{"$f":"IF(CW6<47,\"\",VLOOKUP(47,CE6:CQ65,4,FALSE))","v":"KALOŠOVÁ DAGMAR"},{"$f":"IF(CW6<47,\"\",VLOOKUP(47,CE6:CQ65,10,FALSE))","v":533},null,null,{"$f":"IF(DG52=\"\",\"\",DO52)","v":47},null,null,"Neshyba Jaroslav",140,112,97,109,92,{"$f":"SUM(DG52:DK52)","v":550},{"$f":"MAX(DG52:DK52)","v":140},{"$f":"SUM(DL52*1000)+DM52+0.1","v":550140.1},{"$f":"IF(DG52=\"\",\"\",RANK(DN52,DN6:DN65,0))","v":47},null,null,null,null,null,null,47,{"$f":"IF(DU6<47,\"\",VLOOKUP(47,DC6:DO65,4,FALSE))","v":"Neshyba Jaroslav"},{"$f":"IF(DU6<47,\"\",VLOOKUP(47,DC6:DO65,10,FALSE))","v":550},null,null,{"$f":"IF(EE52=\"\",\"\",EM52)","v":50},null,null,"Hyková Lucie",82,56,65,49,81,{"$f":"SUM(EE52:EI52)","v":333},{"$f":"MAX(EE52:EI52)","v":82},{"$f":"SUM(EJ52*1000)+EK52+0.1","v":333082.09999999998},{"$f":"IF(EE52=\"\",\"\",RANK(EL52,EL6:EL65,0))","v":50},null,null,null,null,null,null,47,{"$f":"IF(ES6<47,\"\",VLOOKUP(47,EA6:EM65,4,FALSE))","v":"Aunický František"},{"$f":"IF(ES6<47,\"\",VLOOKUP(47,EA6:EM65,10,FALSE))","v":593},null,null,{"$f":"IF(FC52=\"\",\"\",FK52)","v":29},null,null,"Kollár Pavel",141,144,113,140,134,{"$f":"SUM(FC52:FG52)","v":672},{"$f":"MAX(FC52:FG52)","v":144},{"$f":"SUM(FH52*1000)+FI52+0.1","v":672144.1},{"$f":"IF(FC52=\"\",\"\",RANK(FJ52,FJ6:FJ65,0))","v":29},null,null,null,null,null,null,47,{"$f":"IF(FQ6<47,\"\",VLOOKUP(47,EY6:FL65,4,FALSE))","v":"Pospíšil Lukáš"},{"$f":"IF(FQ6<47,\"\",VLOOKUP(47,EY6:FL65,10,FALSE))","v":575},null,null,{"$f":"IF(GA52=\"\",\"\",GI52)","v":""},null,null,null,null,null,null,null,null,{"$f":"SUM(GA52:GE52)","v":0},{"$f":"MAX(GA52:GE52)","v":0},{"$f":"SUM(GF52*1000)+GG52+0.1","v":0.1},{"$f":"IF(GA52=\"\",\"\",RANK(GH52,GH6:GH70,0))","v":""},null,null,null,null,null,null,47,{"$f":"IF(GO6<47,\"\",VLOOKUP(47,FW6:GI70,4,FALSE))","v":""},{"$f":"IF(GO6<47,\"\",VLOOKUP(47,FW6:GI70,10,FALSE))","v":""}]
[null,null,null,null,null,null,null,null,null,null,null,null,null,null,null,null,null,null,{"$f":"SUM(S48:S52)","v":685},{"$f":"SUM(T48:T52)","v":559},{"$f":"SUM(U48:U52)","v":570},{"$f":"SUM(V48:V52)","v":649},{"$f":"SUM(W48:W52)","v":523},null,null,null,null,{"$f":"SUM(S53:W53)","v":2986},null,null,null,48,{"$f":"IF(AE6<48,\"\",VLOOKUP(48,O6:AA65,4,FALSE))","v":"TÁBORSKÝ FRANTIŠEK"},{"$f":"IF(AE6<48,\"\",VLOOKUP(48,O6:AA65,10,FALSE))","v":530},null,null,null,null,null,null,{"$f":"SUM(AO48:AO52)","v":598},{"$f":"SUM(AP48:AP52)","v":599},{"$f":"SUM(AQ48:AQ52)","v":594},{"$f":"SUM(AR48:AR52)","v":567},{"$f":"SUM(AS48:AS52)","v":639},null,null,null,null,{"$f":"SUM(AO53:AS53)","v":2997},null,null,null,48,{"$f":"IF(BA6<48,\"\",VLOOKUP(48,AK6:AW65,4,FALSE))","v":"KŘIKAVA MIROSLAV"},{"$f":"IF(BA6<48,\"\",VLOOKUP(48,AK6:AW65,10,FALSE))","v":548},null,null,null,null,null,null,{"$f":"SUM(BK48:BK52)","v":704},{"$f":"SUM(BL48:BL52)","v":766},{"$f":"SUM(BM48:BM52)","v":736},{"$f":"SUM(BN48:BN52)","v":636},{"$f":"SUM(BO48:BO52)","v":700},null,null,null,null,{"$f":"SUM(BK53:BO53)","v":3542},{"$f":"MAX(BK53:BO53)","v":766},{"$f":"IF(BK48=\"\",\"\",SUM(BT53*10000)+BU53)","v":35420766},null,null,null,48,{"$f":"IF(BY6<48,\"\",VLOOKUP(48,BG6:BS65,4,FALSE))","v":"KOLLÁR PAVEL"},{"$f":"IF(BY6<48,\"\",VLOOKUP(48,BG6:BS65,10,FALSE))","v":529},null,null,null,null,null,null,{"$f":"SUM(CI48:CI52)","v":784},{"$f":"SUM(CJ48:CJ52)","v":897},{"$f":"SUM(CK48:CK52)","v":746},{"$f":"SUM(CL48:CL52)","v":833},{"$f":"SUM(CM48:CM52)","v":785},null,null,null,null,{"$f":"SUM(CI53:CM53)","v":4045},{"$f":"MAX(CI53:CM53)","v":897},{"$f":"IF(CI48=\"\",\"\",SUM(CR53*1000)+CS53)","v":4045897},null,null,null,48,{"$f":"IF(CW6<48,\"\",VLOOKUP(48,CE6:CQ65,4,FALSE))","v":"BERGEROVÁ MARCELA"},{"$f":"IF(CW6<48,\"\",VLOOKUP(48,CE6:CQ65,10,FALSE))","v":511},null,null,null,null,null,null,{"$f":"SUM(DG48:DG52)","v":559},{"$f":"SUM(DH48:DH52)","v":552},{"$f":"SUM(DI48:DI52)","v":634},{"$f":"SUM(DJ48:DJ52)","v":563},{"$f":"SUM(DK48:DK52)","v":600},null,null,null,null,{"$f":"SUM(DG53:DK53)","v":2908},{"$f":"MAX(DG53:DK53)","v":634},{"$f":"IF(DG48=\"\",\"\",SUM(DP53*1000)+DQ53)","v":2908634},null,null,null,48,{"$f":"IF(DU6<48,\"\",VLOOKUP(48,DC6:DO65,4,FALSE))","v":"Fay Vlastimil"},{"$f":"IF(DU6<48,\"\",VLOOKUP(48,DC6:DO65,10,FALSE))","v":539},null,null,null,null,null,null,{"$f":"SUM(EE48:EE52)","v":551},{"$f":"SUM(EF48:EF52)","v":528},{"$f":"SUM(EG48:EG52)","v":568},{"$f":"SUM(EH48:EH52)","v":676},{"$f":"SUM(EI48:EI52)","v":597},null,null,null,null,{"$f":"SUM(EE53:EI53)","v":2920},{"$f":"MAX(EE53:EI53)","v":676},{"$f":"IF(EE48=\"\",\"\",SUM(EN53*1000)+EO53)","v":2920676},null,null,null,48,{"$f":"IF(ES6<48,\"\",VLOOKUP(48,EA6:EM65,4,FALSE))","v":"Čermák Tomáš"},{"$f":"IF(ES6<48,\"\",VLOOKUP(48,EA6:EM65,10,FALSE))","v":585},null,null,null,null,null,null,{"$f":"SUM(FC48:FC52)","v":664},{"$f":"SUM(FD48:FD52)","v":671},{"$f":"SUM(FE48:FE52)","v":650},{"$f":"SUM(FF48:FF52)","v":698},{"$f":"SUM(FG48:FG52)","v":638},null,null,null,null,{"$f":"SUM(FC53:FG53)","v":3321},{"$f":"MAX(FC53:FG53)","v":698},{"$f":"IF(FC48=\"\",\"\",SUM(FL53*1000)+FM53)","v":3321698},null,null,null,48,{"$f":"IF(FQ6<48,\"\",VLOOKUP(48,EY6:FL65,4,FALSE))","v":"Lazurová Jiřina"},{"$f":"IF(FQ6<48,\"\",VLOOKUP(48,EY6:FL65,10,FALSE))","v":551},null,null,null,null,null,null,{"$f":"SUM(GA48:GA52)","v":0},{"$f":"SUM(GB48:GB52)","v":0},{"$f":"SUM(GC48:GC52)","v":0},{"$f":"SUM(GD48:GD52)","v":0},{"$f":"SUM(GE48:GE52)","v":0},null,null,null,null,{"$f":"SUM(GA53:GE53)","v":0},{"$f":"MAX(GA53:GE53)","v":0},{"$f":"IF(GA48=\"\",\"\",SUM(GJ53*1000)+GK53)","v":""},null,null,null,48,{"$f":"IF(GO6<48,\"\",VLOOKUP(48,FW6:GI70,4,FALSE))","v":""},{"$f":"IF(GO6<48,\"\",VLOOKUP(48,FW6:GI70,10,FALSE))","v":""}]
[null,null,null,null,null,null,null,null,null,null,null,null,null,null,{"$f":"IF(S54=\"\",\"\",AA54)","v":8},9,"KLÍČOV I.","PECKA JIŘÍ",159,144,192,162,157,{"$f":"SUM(S54:W54)","v":814},{"$f":"MAX(S54:W54)","v":192},{"$f":"SUM(X54*1000)+Y54+0.09","v":814192.09},{"$f":"IF(S54=\"\",\"\",RANK(Z54,Z6:Z65,0))","v":8},null,{"$f":"RANK(AB59,AB11:AB65,0)","v":4},null,null,49,{"$f":"IF(AE6<49,\"\",VLOOKUP(49,O6:AA65,4,FALSE))","v":"KALOŠOVÁ DAGMAR"},{"$f":"IF(AE6<49,\"\",VLOOKUP(49,O6:AA65,10,FALSE))","v":496},null,null,{"$f":"IF(AO54=\"\",\"\",AW54)","v":5},9,"VRŠOVICE I.","KRUPA JOSEF",178,183,170,189,171,{"$f":"SUM(AO54:AS54)","v":891},{"$f":"MAX(AO54:AS54)","v":189},{"$f":"SUM(AT54*1000)+AU54+0.09","v":891189.09},{"$f":"IF(AO54=\"\",\"\",RANK(AV54,AV6:AV65,0))","v":5},null,{"$f":"RANK(AX59,AX11:AX65,0)","v":1},null,null,49,{"$f":"IF(BA6<49,\"\",VLOOKUP(49,AK6:AW65,4,FALSE))","v":"BERGEROVÁ MARCELA"},{"$f":"IF(BA6<49,\"\",VLOOKUP(49,AK6:AW65,10,FALSE))","v":504},null,null,{"$f":"IF(BK54=\"\",\"\",BS54)","v":38},9,"HOSTIVAŘ I.","MYSLIVEČEK JAROSLAV",121,141,112,150,107,{"$f":"SUM(BK54:BO54)","v":631},{"$f":"MAX(BK54:BO54)","v":150},{"$f":"SUM(BP54*1000)+BQ54+0.09","v":631150.09},{"$f":"IF(BK54=\"\",\"\",RANK(BR54,BR6:BR65,0))","v":38},null,null,null,{"$f":"IF(BK54=\"\",\"\",RANK(BV59,BV11:BV65,0))","v":4},null,null,49,{"$f":"IF(BY6<49,\"\",VLOOKUP(49,BG6:BS65,4,FALSE))","v":"VYCHNEROVÁ MICHALA"},{"$f":"IF(BY6<49,\"\",VLOOKUP(49,BG6:BS65,10,FALSE))","v":508},null,null,{"$f":"IF(CI54=\"\",\"\",CQ54)","v":17},9,"KAČEROV I.","HÜBNER JIŘÍ",125,105,179,164,152,{"$f":"SUM(CI54:CM54)","v":725},{"$f":"MAX(CI54:CM54)","v":179},{"$f":"SUM(CN54*1000)+CO54+0.09","v":725179.09},{"$f":"IF(CI54=\"\",\"\",RANK(CP54,CP6:CP65,0))","v":17},null,null,null,{"$f":"IF(CI54=\"\",\"\",RANK(CT59,CT11:CT65,0))","v":3},null,null,49,{"$f":"IF(CW6<49,\"\",VLOOKUP(49,CE6:CQ65,4,FALSE))","v":"SVÍTIL PAVEL"},{"$f":"IF(CW6<49,\"\",VLOOKUP(49,CE6:CQ65,10,FALSE))","v":490},null,null,{"$f":"IF(DG54=\"\",\"\",DO54)","v":4},9,"ŘEPY I.","Kocúr Jaroslav",187,148,161,204,154,{"$f":"SUM(DG54:DK54)","v":854},{"$f":"MAX(DG54:DK54)","v":204},{"$f":"SUM(DL54*1000)+DM54+0.09","v":854204.09},{"$f":"IF(DG54=\"\",\"\",RANK(DN54,DN6:DN65,0))","v":4},null,null,null,{"$f":"IF(DG54=\"\",\"\",RANK(DR59,DR11:DR65,0))","v":5},null,null,49,{"$f":"IF(DU6<49,\"\",VLOOKUP(49,DC6:DO65,4,FALSE))","v":"Dvořák Petr"},{"$f":"IF(DU6<49,\"\",VLOOKUP(49,DC6:DO65,10,FALSE))","v":524},null,null,{"$f":"IF(EE54=\"\",\"\",EM54)","v":6},9,"KLÍČOV I.","Pecka Jiří",174,172,155,212,141,{"$f":"SUM(EE54:EI54)","v":854},{"$f":"MAX(EE54:EI54)","v":212},{"$f":"SUM(EJ54*1000)+EK54+0.09","v":854212.09},{"$f":"IF(EE54=\"\",\"\",RANK(EL54,EL6:EL65,0))","v":6},null,null,null,{"$f":"IF(EE54=\"\",\"\",RANK(EP59,EP11:EP65,0))","v":2},null,null,49,{"$f":"IF(ES6<49,\"\",VLOOKUP(49,EA6:EM65,4,FALSE))","v":"Pipek Pavel"},{"$f":"IF(ES6<49,\"\",VLOOKUP(49,EA6:EM65,10,FALSE))","v":538},null,null,{"$f":"IF(FC54=\"\",\"\",FK54)","v":4},9,"VRŠOVICE I.","Krupa Jozef",180,179,167,144,190,{"$f":"SUM(FC54:FG54)","v":860},{"$f":"MAX(FC54:FG54)","v":190},{"$f":"SUM(FH54*1000)+FI54+0.09","v":860190.09},{"$f":"IF(FC54=\"\",\"\",RANK(FJ54,FJ6:FJ65,0))","v":4},null,null,null,{"$f":"IF(FC54=\"\",\"\",RANK(FN59,FN11:FN65,0))","v":4},null,null,49,{"$f":"IF(FQ6<49,\"\",VLOOKUP(49,EY6:FL65,4,FALSE))","v":"Táborský František"},{"$f":"IF(FQ6<49,\"\",VLOOKUP(49,EY6:FL65,10,FALSE))","v":544},null,null,{"$f":"IF(GA54=\"\",\"\",GI54)","v":""},9,"KLÍČOV I.",null,null,null,null,null,null,{"$f":"SUM(GA54:GE54)","v":0},{"$f":"MAX(GA54:GE54)","v":0},{"$f":"SUM(GF54*1000)+GG54+0.09","v":0.09},{"$f":"IF(GA54=\"\",\"\",RANK(GH54,GH6:GH70,0))","v":""},null,null,null,{"$f":"IF(GA54=\"\",\"\",RANK(GL59,GL11:GL71,0))","v":""},null,null,49,{"$f":"IF(GO6<49,\"\",VLOOKUP(49,FW6:GI70,4,FALSE))","v":""},{"$f":"IF(GO6<49,\"\",VLOOKUP(49,FW6:GI70,10,FALSE))","v":""}]
[null,null,null,null,null,null,null,null,null,null,null,null,null,null,{"$f":"IF(S55=\"\",\"\",AA55)","v":4},null,null,"NOVOTNÝ LUKÁŠ",178,170,148,175,189,{"$f":"SUM(S55:W55)","v":860},{"$f":"MAX(S55:W55)","v":189},{"$f":"SUM(X55*1000)+Y55+0.08","v":860189.08},{"$f":"IF(S55=\"\",\"\",RANK(Z55,Z6:Z65,0))","v":4},null,null,null,null,50,{"$f":"IF(AE6<50,\"\",VLOOKUP(50,O6:AA65,4,FALSE))","v":"KUTINA PAVEL"},{"$f":"IF(AE6<50,\"\",VLOOKUP(50,O6:AA65,10,FALSE))","v":473},null,null,{"$f":"IF(AO55=\"\",\"\",AW55)","v":14},null,null,"HOLKUP JAN",139,182,152,161,156,{"$f":"SUM(AO55:AS55)","v":790},{"$f":"MAX(AO55:AS55)","v":182},{"$f":"SUM(AT55*1000)+AU55+0.08","v":790182.08},{"$f":"IF(AO55=\"\",\"\",RANK(AV55,AV6:AV65,0))","v":14},null,null,null,null,50,{"$f":"IF(BA6<50,\"\",VLOOKUP(50,AK6:AW65,4,FALSE))","v":"KALOŠOVÁ DAGMAR"},{"$f":"IF(BA6<50,\"\",VLOOKUP(50,AK6:AW65,10,FALSE))","v":498},null,null,{"$f":"IF(BK55=\"\",\"\",BS55)","v":48},null,null,"KOLLÁR PAVEL",99,115,99,97,119,{"$f":"SUM(BK55:BO55)","v":529},{"$f":"MAX(BK55:BO55)","v":119},{"$f":"SUM(BP55*1000)+BQ55+0.08","v":529119.07999999996},{"$f":"IF(BK55=\"\",\"\",RANK(BR55,BR6:BR65,0))","v":48},null,null,null,null,null,null,50,{"$f":"IF(BY6<50,\"\",VLOOKUP(50,BG6:BS65,4,FALSE))","v":"SVÍTIL PAVEL"},{"$f":"IF(BY6<50,\"\",VLOOKUP(50,BG6:BS65,10,FALSE))","v":480},null,null,{"$f":"IF(CI55=\"\",\"\",CQ55)","v":20},null,null,"TOMÁŠEK ZDENĚK",132,157,137,166,131,{"$f":"SUM(CI55:CM55)","v":723},{"$f":"MAX(CI55:CM55)","v":166},{"$f":"SUM(CN55*1000)+CO55+0.08","v":723166.08},{"$f":"IF(CI55=\"\",\"\",RANK(CP55,CP6:CP65,0))","v":20},null,null,null,null,null,null,50,{"$f":"IF(CW6<50,\"\",VLOOKUP(50,CE6:CQ65,4,FALSE))","v":"ŠTARKOVÁ TEREZA"},{"$f":"IF(CW6<50,\"\",VLOOKUP(50,CE6:CQ65,10,FALSE))","v":487},null,null,{"$f":"IF(DG55=\"\",\"\",DO55)","v":35},null,null,"Sladovník Miloslav",126,149,102,161,130,{"$f":"SUM(DG55:DK55)","v":668},{"$f":"MAX(DG55:DK55)","v":161},{"$f":"SUM(DL55*1000)+DM55+0.08","v":668161.07999999996},{"$f":"IF(DG55=\"\",\"\",RANK(DN55,DN6:DN65,0))","v":35},null,null,null,null,null,null,50,{"$f":"IF(DU6<50,\"\",VLOOKUP(50,DC6:DO65,4,FALSE))","v":"Šafrová Martina"},{"$f":"IF(DU6<50,\"\",VLOOKUP(50,DC6:DO65,10,FALSE))","v":518},null,null,{"$f":"IF(EE55=\"\",\"\",EM55)","v":20},null,null,"Štěpán Radek",119,122,136,157,182,{"$f":"SUM(EE55:EI55)","v":716},{"$f":"MAX(EE55:EI55)","v":182},{"$f":"SUM(EJ55*1000)+EK55+0.08","v":716182.08},{"$f":"IF(EE55=\"\",\"\",RANK(EL55,EL6:EL65,0))","v":20},null,null,null,null,null,null,50,{"$f":"IF(ES6<50,\"\",VLOOKUP(50,EA6:EM65,4,FALSE))","v":"Hyková Lucie"},{"$f":"IF(ES6<50,\"\",VLOOKUP(50,EA6:EM65,10,FALSE))","v":333},null,null,{"$f":"IF(FC55=\"\",\"\",FK55)","v":16},null,null,"Věchtík Antoním",145,150,152,155,164,{"$f":"SUM(FC55:FG55)","v":766},{"$f":"MAX(FC55:FG55)","v":164},{"$f":"SUM(FH55*1000)+FI55+0.08","v":766164.08},{"$f":"IF(FC55=\"\",\"\",RANK(FJ55,FJ6:FJ65,0))","v":16},null,null,null,null,null,null,50,{"$f":"IF(FQ6<50,\"\",VLOOKUP(50,EY6:FL65,4,FALSE))","v":"Hyková Lucie"},{"$f":"IF(FQ6<50,\"\",VLOOKUP(50,EY6:FL65,10,FALSE))","v":400},null,null,{"$f":"IF(GA55=\"\",\"\",GI55)","v":""},null,null,null,null,null,null,null,null,{"$f":"SUM(GA55:GE55)","v":0},{"$f":"MAX(GA55:GE55)","v":0},{"$f":"SUM(GF55*1000)+GG55+0.08","v":0.08},{"$f":"IF(GA55=\"\",\"\",RANK(GH55,GH6:GH70,0))","v":""},null,null,null,null,null,null,50,{"$f":"IF(GO6<50,\"\",VLOOKUP(50,FW6:GI70,4,FALSE))","v":""},{"$f":"IF(GO6<50,\"\",VLOOKUP(50,FW6:GI70,10,FALSE))","v":""}]
[null,null,null,null,null,null,null,null,null,null,null,null,null,null,{"$f":"IF(S56=\"\",\"\",AA56)","v":25},null,null,"KALFIŘT PETR",133,166,140,139,102,{"$f":"SUM(S56:W56)","v":680},{"$f":"MAX(S56:W56)","v":166},{"$f":"SUM(X56*1000)+Y56+0.07","v":680166.07},{"$f":"IF(S56=\"\",\"\",RANK(Z56,Z6:Z65,0))","v":25},null,null,null,null,null,null,null,null,null,{"$f":"IF(AO56=\"\",\"\",AW56)","v":18},null,null,"SKRUŽNÁ PAVLA",110,145,186,146,151,{"$f":"SUM(AO56:AS56)","v":738},{"$f":"MAX(AO56:AS56)","v":186},{"$f":"SUM(AT56*1000)+AU56+0.07","v":738186.07},{"$f":"IF(AO56=\"\",\"\",RANK(AV56,AV6:AV65,0))","v":18},null,null,null,null,null,null,null,null,null,{"$f":"IF(BK56=\"\",\"\",BS56)","v":14},null,null,"JELÍNEK JAN",156,104,160,190,160,{"$f":"SUM(BK56:BO56)","v":770},{"$f":"MAX(BK56:BO56)","v":190},{"$f":"SUM(BP56*1000)+BQ56+0.07","v":770190.07},{"$f":"IF(BK56=\"\",\"\",RANK(BR56,BR6:BR65,0))","v":14},null,null,null,null,null,null,null,null,null,null,null,{"$f":"IF(CI56=\"\",\"\",CQ56)","v":30},null,null,"ONDŘICH FRANTIŠEK",118,139,133,147,127,{"$f":"SUM(CI56:CM56)","v":664},{"$f":"MAX(CI56:CM56)","v":147},{"$f":"SUM(CN56*1000)+CO56+0.07","v":664147.06999999995},{"$f":"IF(CI56=\"\",\"\",RANK(CP56,CP6:CP65,0))","v":30},null,null,null,null,null,null,null,null,null,null,null,{"$f":"IF(DG56=\"\",\"\",DO56)","v":49},null,null,"Dvořák Petr",140,112,100,79,93,{"$f":"SUM(DG56:DK56)","v":524},{"$f":"MAX(DG56:DK56)","v":140},{"$f":"SUM(DL56*1000)+DM56+0.07","v":524140.07},{"$f":"IF(DG56=\"\",\"\",RANK(DN56,DN6:DN65,0))","v":49},null,null,null,null,null,null,null,null,null,null,null,{"$f":"IF(EE56=\"\",\"\",EM56)","v":21},null,null,"Troller Pavel",156,177,120,127,121,{"$f":"SUM(EE56:EI56)","v":701},{"$f":"MAX(EE56:EI56)","v":177},{"$f":"SUM(EJ56*1000)+EK56+0.07","v":701177.07},{"$f":"IF(EE56=\"\",\"\",RANK(EL56,EL6:EL65,0))","v":21},null,null,null,null,null,null,null,null,null,null,null,{"$f":"IF(FC56=\"\",\"\",FK56)","v":18},null,null,"Podhola Martin",124,168,158,166,141,{"$f":"SUM(FC56:FG56)","v":757},{"$f":"MAX(FC56:FG56)","v":168},{"$f":"SUM(FH56*1000)+FI56+0.07","v":757168.07},{"$f":"IF(FC56=\"\",\"\",RANK(FJ56,FJ6:FJ65,0))","v":18},null,null,null,null,null,null,null,null,null,null,null,{"$f":"IF(GA56=\"\",\"\",GI56)","v":""},null,null,null,null,null,null,null,null,{"$f":"SUM(GA56:GE56)","v":0},{"$f":"MAX(GA56:GE56)","v":0},{"$f":"SUM(GF56*1000)+GG56+0.07","v":7.0000000000000007E-2},{"$f":"IF(GA56=\"\",\"\",RANK(GH56,GH6:GH70,0))","v":""},null,null,null,null,null,null,51,{"$f":"IF(GO6<51,\"\",VLOOKUP(51,FW6:GI70,4,FALSE))","v":""},{"$f":"IF(GO6<51,\"\",VLOOKUP(51,FW6:GI70,10,FALSE))","v":""}]
[null,null,null,null,null,null,null,null,null,null,null,null,null,null,{"$f":"IF(S57=\"\",\"\",AA57)","v":21},null,null,"KŘEMENÁK PETR",156,143,171,128,109,{"$f":"SUM(S57:W57)","v":707},{"$f":"MAX(S57:W57)","v":171},{"$f":"SUM(X57*1000)+Y57+0.06","v":707171.06},{"$f":"IF(S57=\"\",\"\",RANK(Z57,Z6:Z65,0))","v":21},null,null,null,null,null,null,null,null,null,{"$f":"IF(AO57=\"\",\"\",AW57)","v":29},null,null,"POSPÍŠIL LUKÁŠ",121,161,148,129,124,{"$f":"SUM(AO57:AS57)","v":683},{"$f":"MAX(AO57:AS57)","v":161},{"$f":"SUM(AT57*1000)+AU57+0.06","v":683161.06},{"$f":"IF(AO57=\"\",\"\",RANK(AV57,AV6:AV65,0))","v":29},null,null,null,null,null,null,null,null,null,{"$f":"IF(BK57=\"\",\"\",BS57)","v":2},null,null,"ŠAFAŘÍK LUDĚK",179,205,179,135,199,{"$f":"SUM(BK57:BO57)","v":897},{"$f":"MAX(BK57:BO57)","v":205},{"$f":"SUM(BP57*1000)+BQ57+0.06","v":897205.06},{"$f":"IF(BK57=\"\",\"\",RANK(BR57,BR6:BR65,0))","v":2},null,null,null,null,null,null,null,null,null,null,null,{"$f":"IF(CI57=\"\",\"\",CQ57)","v":4},null,null,"MAŠÁT PETR",153,243,158,157,143,{"$f":"SUM(CI57:CM57)","v":854},{"$f":"MAX(CI57:CM57)","v":243},{"$f":"SUM(CN57*1000)+CO57+0.06","v":854243.06},{"$f":"IF(CI57=\"\",\"\",RANK(CP57,CP6:CP65,0))","v":4},null,null,null,null,null,null,null,null,null,null,null,{"$f":"IF(DG57=\"\",\"\",DO57)","v":9},null,null,"Kročil Tomáš",183,162,146,168,143,{"$f":"SUM(DG57:DK57)","v":802},{"$f":"MAX(DG57:DK57)","v":183},{"$f":"SUM(DL57*1000)+DM57+0.06","v":802183.06},{"$f":"IF(DG57=\"\",\"\",RANK(DN57,DN6:DN65,0))","v":9},null,null,null,null,null,null,null,null,null,null,null,{"$f":"IF(EE57=\"\",\"\",EM57)","v":3},null,null,"Kalfiřt Petr",211,164,184,169,166,{"$f":"SUM(EE57:EI57)","v":894},{"$f":"MAX(EE57:EI57)","v":211},{"$f":"SUM(EJ57*1000)+EK57+0.06","v":894211.06},{"$f":"IF(EE57=\"\",\"\",RANK(EL57,EL6:EL65,0))","v":3},null,null,null,null,null,null,null,null,null,null,null,{"$f":"IF(FC57=\"\",\"\",FK57)","v":12},null,null,"Holkup Jan",173,144,153,161,171,{"$f":"SUM(FC57:FG57)","v":802},{"$f":"MAX(FC57:FG57)","v":173},{"$f":"SUM(FH57*1000)+FI57+0.06","v":802173.06},{"$f":"IF(FC57=\"\",\"\",RANK(FJ57,FJ6:FJ65,0))","v":12},null,null,null,null,null,null,null,null,null,null,null,{"$f":"IF(GA57=\"\",\"\",GI57)","v":""},null,null,null,null,null,null,null,null,{"$f":"SUM(GA57:GE57)","v":0},{"$f":"MAX(GA57:GE57)","v":0},{"$f":"SUM(GF57*1000)+GG57+0.06","v":0.06},{"$f":"IF(GA57=\"\",\"\",RANK(GH57,GH6:GH70,0))","v":""},null,null,null,null,null,null,52,{"$f":"IF(GO6<52,\"\",VLOOKUP(52,FW6:GI70,4,FALSE))","v":""},{"$f":"IF(GO6<52,\"\",VLOOKUP(52,FW6:GI70,10,FALSE))","v":""}]
[null,null,null,null,null,null,null,null,null,null,null,null,null,null,{"$f":"IF(S58=\"\",\"\",AA58)","v":24},null,null,"TROLLER PAVEL",136,142,143,156,114,{"$f":"SUM(S58:W58)","v":691},{"$f":"MAX(S58:W58)","v":156},{"$f":"SUM(X58*1000)+Y58+0.05","v":691156.05},{"$f":"IF(S58=\"\",\"\",RANK(Z58,Z6:Z65,0))","v":24},null,null,null,null,null,null,null,null,null,{"$f":"IF(AO58=\"\",\"\",AW58)","v":4},null,null,"PODHOLA MARTIN",168,194,193,180,161,{"$f":"SUM(AO58:AS58)","v":896},{"$f":"MAX(AO58:AS58)","v":194},{"$f":"SUM(AT58*1000)+AU58+0.05","v":896194.05},{"$f":"IF(AO58=\"\",\"\",RANK(AV58,AV6:AV65,0))","v":4},null,null,null,null,null,null,null,null,null,{"$f":"IF(BK58=\"\",\"\",BS58)","v":8},null,null,"LAZUR VLADIMÍR",174,167,161,151,178,{"$f":"SUM(BK58:BO58)","v":831},{"$f":"MAX(BK58:BO58)","v":178},{"$f":"SUM(BP58*1000)+BQ58+0.05","v":831178.05},{"$f":"IF(BK58=\"\",\"\",RANK(BR58,BR6:BR65,0))","v":8},null,null,null,null,null,null,null,null,null,null,null,{"$f":"IF(CI58=\"\",\"\",CQ58)","v":5},null,null,"CARVAN PAVEL",191,137,200,153,161,{"$f":"SUM(CI58:CM58)","v":842},{"$f":"MAX(CI58:CM58)","v":200},{"$f":"SUM(CN58*1000)+CO58+0.05","v":842200.05},{"$f":"IF(CI58=\"\",\"\",RANK(CP58,CP6:CP65,0))","v":5},null,null,null,null,null,null,null,null,null,null,null,{"$f":"IF(DG58=\"\",\"\",DO58)","v":15},null,null,"Pospíšil Václav",162,148,128,183,145,{"$f":"SUM(DG58:DK58)","v":766},{"$f":"MAX(DG58:DK58)","v":183},{"$f":"SUM(DL58*1000)+DM58+0.05","v":766183.05},{"$f":"IF(DG58=\"\",\"\",RANK(DN58,DN6:DN65,0))","v":15},null,null,null,null,null,null,null,null,null,null,null,{"$f":"IF(EE58=\"\",\"\",EM58)","v":11},null,null,"Novotný Lukáš",188,162,160,138,166,{"$f":"SUM(EE58:EI58)","v":814},{"$f":"MAX(EE58:EI58)","v":188},{"$f":"SUM(EJ58*1000)+EK58+0.05","v":814188.05},{"$f":"IF(EE58=\"\",\"\",RANK(EL58,EL6:EL65,0))","v":11},null,null,null,null,null,null,null,null,null,null,null,{"$f":"IF(FC58=\"\",\"\",FK58)","v":35},null,null,"Skružná Pavla",134,144,158,95,116,{"$f":"SUM(FC58:FG58)","v":647},{"$f":"MAX(FC58:FG58)","v":158},{"$f":"SUM(FH58*1000)+FI58+0.05","v":647158.05000000005},{"$f":"IF(FC58=\"\",\"\",RANK(FJ58,FJ6:FJ65,0))","v":35},null,null,null,null,null,null,null,null,null,null,null,{"$f":"IF(GA58=\"\",\"\",GI58)","v":""},null,null,null,null,null,null,null,null,{"$f":"SUM(GA58:GE58)","v":0},{"$f":"MAX(GA58:GE58)","v":0},{"$f":"SUM(GF58*1000)+GG58+0.05","v":0.05},{"$f":"IF(GA58=\"\",\"\",RANK(GH58,GH6:GH70,0))","v":""},null,null,null,null,null,null,53,{"$f":"IF(GO6<53,\"\",VLOOKUP(53,FW6:GI70,4,FALSE))","v":""},{"$f":"IF(GO6<53,\"\",VLOOKUP(53,FW6:GI70,10,FALSE))","v":""}]
[null,null,null,null,null,null,null,null,null,null,null,null,null,null,null,null,null,null,{"$f":"SUM(S54:S58)","v":762},{"$f":"SUM(T54:T58)","v":765},{"$f":"SUM(U54:U58)","v":794},{"$f":"SUM(V54:V58)","v":760},{"$f":"SUM(W54:W58)","v":671},null,null,null,null,{"$f":"SUM(S59:W59)","v":3752},null,null,null,null,null,null,null,null,null,null,null,null,{"$f":"SUM(AO54:AO58)","v":716},{"$f":"SUM(AP54:AP58)","v":865},{"$f":"SUM(AQ54:AQ58)","v":849},{"$f":"SUM(AR54:AR58)","v":805},{"$f":"SUM(AS54:AS58)","v":763},null,null,null,null,{"$f":"SUM(AO59:AS59)","v":3998},null,null,null,null,null,null,null,null,null,null,null,null,{"$f":"SUM(BK54:BK58)","v":729},{"$f":"SUM(BL54:BL58)","v":732},{"$f":"SUM(BM54:BM58)","v":711},{"$f":"SUM(BN54:BN58)","v":723},{"$f":"SUM(BO54:BO58)","v":763},null,null,null,null,{"$f":"SUM(BK59:BO59)","v":3658},{"$f":"MAX(BK59:BO59)","v":763},{"$f":"IF(BK54=\"\",\"\",SUM(BT59*10000)+BU59)","v":36580763},null,null,null,null,null,null,null,null,null,null,null,null,{"$f":"SUM(CI54:CI58)","v":719},{"$f":"SUM(CJ54:CJ58)","v":781},{"$f":"SUM(CK54:CK58)","v":807},{"$f":"SUM(CL54:CL58)","v":787},{"$f":"SUM(CM54:CM58)","v":714},null,null,null,null,{"$f":"SUM(CI59:CM59)","v":3808},{"$f":"MAX(CI59:CM59)","v":807},{"$f":"IF(CI54=\"\",\"\",SUM(CR59*1000)+CS59)","v":3808807},null,null,null,null,null,null,null,null,null,null,null,null,{"$f":"SUM(DG54:DG58)","v":798},{"$f":"SUM(DH54:DH58)","v":719},{"$f":"SUM(DI54:DI58)","v":637},{"$f":"SUM(DJ54:DJ58)","v":795},{"$f":"SUM(DK54:DK58)","v":665},null,null,null,null,{"$f":"SUM(DG59:DK59)","v":3614},{"$f":"MAX(DG59:DK59)","v":798},{"$f":"IF(DG54=\"\",\"\",SUM(DP59*1000)+DQ59)","v":3614798},null,null,null,null,null,null,null,null,null,null,null,null,{"$f":"SUM(EE54:EE58)","v":848},{"$f":"SUM(EF54:EF58)","v":797},{"$f":"SUM(EG54:EG58)","v":755},{"$f":"SUM(EH54:EH58)","v":803},{"$f":"SUM(EI54:EI58)","v":776},null,null,null,null,{"$f":"SUM(EE59:EI59)","v":3979},{"$f":"MAX(EE59:EI59)","v":848},{"$f":"IF(EE54=\"\",\"\",SUM(EN59*1000)+EO59)","v":3979848},null,null,null,null,null,null,null,null,null,null,null,null,{"$f":"SUM(FC54:FC58)","v":756},{"$f":"SUM(FD54:FD58)","v":785},{"$f":"SUM(FE54:FE58)","v":788},{"$f":"SUM(FF54:FF58)","v":721},{"$f":"SUM(FG54:FG58)","v":782},null,null,null,null,{"$f":"SUM(FC59:FG59)","v":3832},{"$f":"MAX(FC59:FG59)","v":788},{"$f":"IF(FC54=\"\",\"\",SUM(FL59*1000)+FM59)","v":3832788},null,null,null,null,null,null,null,null,null,null,null,null,{"$f":"SUM(GA54:GA58)","v":0},{"$f":"SUM(GB54:GB58)","v":0},{"$f":"SUM(GC54:GC58)","v":0},{"$f":"SUM(GD54:GD58)","v":0},{"$f":"SUM(GE54:GE58)","v":0},null,null,null,null,{"$f":"SUM(GA59:GE59)","v":0},{"$f":"MAX(GA59:GE59)","v":0},{"$f":"IF(GA54=\"\",\"\",SUM(GJ59*1000)+GK59)","v":""},null,null,null,54,{"$f":"IF(GO6<54,\"\",VLOOKUP(54,FW6:GI70,4,FALSE))","v":""},{"$f":"IF(GO6<54,\"\",VLOOKUP(54,FW6:GI70,10,FALSE))","v":""}]
[null,null,null,null,null,null,null,null,null,null,null,null,null,null,{"$f":"IF(S60=\"\",\"\",AA60)","v":48},10,"KLÍČOV II.","TÁBORSKÝ FRANTIŠEK",86,98,101,105,140,{"$f":"SUM(S60:W60)","v":530},{"$f":"MAX(S60:W60)","v":140},{"$f":"SUM(X60*1000)+Y60+0.04","v":530140.04},{"$f":"IF(S60=\"\",\"\",RANK(Z60,Z6:Z65,0))","v":48},null,{"$f":"RANK(AB65,AB11:AB65,0)","v":10},null,null,null,null,null,null,null,{"$f":"IF(AO60=\"\",\"\",AW60)","v":42},10,"VRŠOVICE II.","AUNICKÝ FRANTIŠEK",141,110,107,132,114,{"$f":"SUM(AO60:AS60)","v":604},{"$f":"MAX(AO60:AS60)","v":141},{"$f":"SUM(AT60*1000)+AU60+0.04","v":604141.04},{"$f":"IF(AO60=\"\",\"\",RANK(AV60,AV6:AV65,0))","v":42},null,{"$f":"RANK(AX65,AX11:AX65,0)","v":7},null,null,null,null,null,null,null,{"$f":"IF(BK60=\"\",\"\",BS60)","v":46},10,"HOSTIVAŘ II.","ČERMÁK TOMÁŠ",109,120,106,112,117,{"$f":"SUM(BK60:BO60)","v":564},{"$f":"MAX(BK60:BO60)","v":120},{"$f":"SUM(BP60*1000)+BQ60+0.04","v":564120.04},{"$f":"IF(BK60=\"\",\"\",RANK(BR60,BR6:BR65,0))","v":46},null,null,null,{"$f":"IF(BK60=\"\",\"\",RANK(BV65,BV11:BV65,0))","v":9},null,null,null,null,null,null,null,{"$f":"IF(CI60=\"\",\"\",CQ60)","v":25},10,"KAČEROV II.","KUTINA PAVEL",144,135,136,155,112,{"$f":"SUM(CI60:CM60)","v":682},{"$f":"MAX(CI60:CM60)","v":155},{"$f":"SUM(CN60*1000)+CO60+0.04","v":682155.04},{"$f":"IF(CI60=\"\",\"\",RANK(CP60,CP6:CP65,0))","v":25},null,null,null,{"$f":"IF(CI60=\"\",\"\",RANK(CT65,CT11:CT65,0))","v":4},null,null,null,null,null,null,null,{"$f":"IF(DG60=\"\",\"\",DO60)","v":39},10,"ŘEPY II.","Mottl Pavel",138,127,110,114,141,{"$f":"SUM(DG60:DK60)","v":630},{"$f":"MAX(DG60:DK60)","v":141},{"$f":"SUM(DL60*1000)+DM60+0.04","v":630141.04},{"$f":"IF(DG60=\"\",\"\",RANK(DN60,DN6:DN65,0))","v":39},null,null,null,{"$f":"IF(DG60=\"\",\"\",RANK(DR65,DR11:DR65,0))","v":7},null,null,null,null,null,null,null,{"$f":"IF(EE60=\"\",\"\",EM60)","v":22},10,"KLÍČOV II.","Táborský Lukáš",92,124,133,210,136,{"$f":"SUM(EE60:EI60)","v":695},{"$f":"MAX(EE60:EI60)","v":210},{"$f":"SUM(EJ60*1000)+EK60+0.04","v":695210.04},{"$f":"IF(EE60=\"\",\"\",RANK(EL60,EL6:EL65,0))","v":22},null,null,null,{"$f":"IF(EE60=\"\",\"\",RANK(EP65,EP11:EP65,0))","v":8},null,null,null,null,null,null,null,{"$f":"IF(FC60=\"\",\"\",FK60)","v":38},10,"VRŠOVICE II.","Aunický František",159,126,83,170,102,{"$f":"SUM(FC60:FG60)","v":640},{"$f":"MAX(FC60:FG60)","v":170},{"$f":"SUM(FH60*1000)+FI60+0.04","v":640170.04},{"$f":"IF(FC60=\"\",\"\",RANK(FJ60,FJ6:FJ65,0))","v":38},null,null,null,{"$f":"IF(FC60=\"\",\"\",RANK(FN65,FN11:FN65,0))","v":10},null,null,null,null,null,null,null,{"$f":"IF(GA60=\"\",\"\",GI60)","v":""},10,"KLÍČOV II.",null,null,null,null,null,null,{"$f":"SUM(GA60:GE60)","v":0},{"$f":"MAX(GA60:GE60)","v":0},{"$f":"SUM(GF60*1000)+GG60+0.04","v":0.04},{"$f":"IF(GA60=\"\",\"\",RANK(GH60,GH6:GH70,0))","v":""},null,null,null,{"$f":"IF(GA60=\"\",\"\",RANK(GL65,GL11:GL71,0))","v":""},null,null,55,{"$f":"IF(GO6<55,\"\",VLOOKUP(55,FW6:GI70,4,FALSE))","v":""},{"$f":"IF(GO6<55,\"\",VLOOKUP(55,FW6:GI70,10,FALSE))","v":""}]
[null,null,null,null,null,null,null,null,null,null,null,null,null,null,{"$f":"IF(S61=\"\",\"\",AA61)","v":28},null,null,"TÁBORSKÝ LUKÁŠ",119,125,157,145,115,{"$f":"SUM(S61:W61)","v":661},{"$f":"MAX(S61:W61)","v":157},{"$f":"SUM(X61*1000)+Y61+0.03","v":661157.03},{"$f":"IF(S61=\"\",\"\",RANK(Z61,Z6:Z65,0))","v":28},null,null,null,null,null,null,null,null,null,{"$f":"IF(AO61=\"\",\"\",AW61)","v":32},null,null,"KAZDA JAN",124,123,139,135,135,{"$f":"SUM(AO61:AS61)","v":656},{"$f":"MAX(AO61:AS61)","v":139},{"$f":"SUM(AT61*1000)+AU61+0.03","v":656139.03},{"$f":"IF(AO61=\"\",\"\",RANK(AV61,AV6:AV65,0))","v":32},null,null,null,null,null,null,null,null,null,{"$f":"IF(BK61=\"\",\"\",BS61)","v":16},null,null,"BERGER MICHAL",170,131,158,150,158,{"$f":"SUM(BK61:BO61)","v":767},{"$f":"MAX(BK61:BO61)","v":170},{"$f":"SUM(BP61*1000)+BQ61+0.03","v":767170.03},{"$f":"IF(BK61=\"\",\"\",RANK(BR61,BR6:BR65,0))","v":16},null,null,null,null,null,null,null,null,null,null,null,{"$f":"IF(CI61=\"\",\"\",CQ61)","v":10},null,null,"DOUŠA ADAM",160,170,124,170,161,{"$f":"SUM(CI61:CM61)","v":785},{"$f":"MAX(CI61:CM61)","v":170},{"$f":"SUM(CN61*1000)+CO61+0.03","v":785170.03},{"$f":"IF(CI61=\"\",\"\",RANK(CP61,CP6:CP65,0))","v":10},null,null,null,null,null,null,null,null,null,null,null,{"$f":"IF(DG61=\"\",\"\",DO61)","v":41},null,null,"Křikava Miroslav",136,127,106,131,119,{"$f":"SUM(DG61:DK61)","v":619},{"$f":"MAX(DG61:DK61)","v":136},{"$f":"SUM(DL61*1000)+DM61+0.03","v":619136.03},{"$f":"IF(DG61=\"\",\"\",RANK(DN61,DN6:DN65,0))","v":41},null,null,null,null,null,null,null,null,null,null,null,{"$f":"IF(EE61=\"\",\"\",EM61)","v":33},null,null,"Lokvenc Jiří",123,131,126,132,133,{"$f":"SUM(EE61:EI61)","v":645},{"$f":"MAX(EE61:EI61)","v":133},{"$f":"SUM(EJ61*1000)+EK61+0.03","v":645133.03},{"$f":"IF(EE61=\"\",\"\",RANK(EL61,EL6:EL65,0))","v":33},null,null,null,null,null,null,null,null,null,null,null,{"$f":"IF(FC61=\"\",\"\",FK61)","v":26},null,null,"Kazda Jan",127,171,149,149,86,{"$f":"SUM(FC61:FG61)","v":682},{"$f":"MAX(FC61:FG61)","v":171},{"$f":"SUM(FH61*1000)+FI61+0.03","v":682171.03},{"$f":"IF(FC61=\"\",\"\",RANK(FJ61,FJ6:FJ65,0))","v":26},null,null,null,null,null,null,null,null,null,null,null,{"$f":"IF(GA61=\"\",\"\",GI61)","v":""},null,null,null,null,null,null,null,null,{"$f":"SUM(GA61:GE61)","v":0},{"$f":"MAX(GA61:GE61)","v":0},{"$f":"SUM(GF61*1000)+GG61+0.03","v":0.03},{"$f":"IF(GA61=\"\",\"\",RANK(GH61,GH6:GH70,0))","v":""}]
[null,null,null,null,null,null,null,null,null,null,null,null,null,null,{"$f":"IF(S62=\"\",\"\",AA62)","v":40},null,null,"NOVOTNÁ PETRA",140,115,116,107,112,{"$f":"SUM(S62:W62)","v":590},{"$f":"MAX(S62:W62)","v":140},{"$f":"SUM(X62*1000)+Y62+0.02","v":590140.02},{"$f":"IF(S62=\"\",\"\",RANK(Z62,Z6:Z65,0))","v":40},null,null,null,null,null,null,null,null,null,{"$f":"IF(AO62=\"\",\"\",AW62)","v":43},null,null,"FAY VLASTIMIL",118,126,117,131,111,{"$f":"SUM(AO62:AS62)","v":603},{"$f":"MAX(AO62:AS62)","v":131},{"$f":"SUM(AT62*1000)+AU62+0.02","v":603131.02},{"$f":"IF(AO62=\"\",\"\",RANK(AV62,AV6:AV65,0))","v":43},null,null,null,null,null,null,null,null,null,{"$f":"IF(BK62=\"\",\"\",BS62)","v":50},null,null,"SVÍTIL PAVEL",85,107,107,113,68,{"$f":"SUM(BK62:BO62)","v":480},{"$f":"MAX(BK62:BO62)","v":113},{"$f":"SUM(BP62*1000)+BQ62+0.02","v":480113.02},{"$f":"IF(BK62=\"\",\"\",RANK(BR62,BR6:BR65,0))","v":50},null,null,null,null,null,null,null,null,null,null,null,{"$f":"IF(CI62=\"\",\"\",CQ62)","v":29},null,null,"BROŽ STANISLAV",165,122,137,111,131,{"$f":"SUM(CI62:CM62)","v":666},{"$f":"MAX(CI62:CM62)","v":165},{"$f":"SUM(CN62*1000)+CO62+0.02","v":666165.02},{"$f":"IF(CI62=\"\",\"\",RANK(CP62,CP6:CP65,0))","v":29},null,null,null,null,null,null,null,null,null,null,null,{"$f":"IF(DG62=\"\",\"\",DO62)","v":20},null,null,"Sehnal Ivan",113,157,134,167,151,{"$f":"SUM(DG62:DK62)","v":722},{"$f":"MAX(DG62:DK62)","v":167},{"$f":"SUM(DL62*1000)+DM62+0.02","v":722167.02},{"$f":"IF(DG62=\"\",\"\",RANK(DN62,DN6:DN65,0))","v":20},null,null,null,null,null,null,null,null,null,null,null,{"$f":"IF(EE62=\"\",\"\",EM62)","v":32},null,null,"Kolár Vladimír",132,137,129,140,112,{"$f":"SUM(EE62:EI62)","v":650},{"$f":"MAX(EE62:EI62)","v":140},{"$f":"SUM(EJ62*1000)+EK62+0.02","v":650140.02},{"$f":"IF(EE62=\"\",\"\",RANK(EL62,EL6:EL65,0))","v":32},null,null,null,null,null,null,null,null,null,null,null,{"$f":"IF(FC62=\"\",\"\",FK62)","v":43},null,null,"Pavlíček Rudolf",106,137,133,110,133,{"$f":"SUM(FC62:FG62)","v":619},{"$f":"MAX(FC62:FG62)","v":137},{"$f":"SUM(FH62*1000)+FI62+0.02","v":619137.02},{"$f":"IF(FC62=\"\",\"\",RANK(FJ62,FJ6:FJ65,0))","v":43},null,null,null,null,null,null,null,null,null,null,null,{"$f":"IF(GA62=\"\",\"\",GI62)","v":""},null,null,null,null,null,null,null,null,{"$f":"SUM(GA62:GE62)","v":0},{"$f":"MAX(GA62:GE62)","v":0},{"$f":"SUM(GF62*1000)+GG62+0.02","v":0.02},{"$f":"IF(GA62=\"\",\"\",RANK(GH62,GH6:GH70,0))","v":""}]
[null,null,null,null,null,null,null,null,null,null,null,null,null,null,{"$f":"IF(S63=\"\",\"\",AA63)","v":47},null,null,"ŘEHÁK JAROSLAV",112,128,120,89,104,{"$f":"SUM(S63:W63)","v":553},{"$f":"MAX(S63:W63)","v":128},{"$f":"SUM(X63*1000)+Y63+0.01","v":553128.01},{"$f":"IF(S63=\"\",\"\",RANK(Z63,Z6:Z65,0))","v":47},null,null,null,null,null,null,null,null,null,{"$f":"IF(AO63=\"\",\"\",AW63)","v":21},null,null,"BOŠEK JAN",129,140,148,170,123,{"$f":"SUM(AO63:AS63)","v":710},{"$f":"MAX(AO63:AS63)","v":170},{"$f":"SUM(AT63*1000)+AU63+0.01","v":710170.01},{"$f":"IF(AO63=\"\",\"\",RANK(AV63,AV6:AV65,0))","v":21},null,null,null,null,null,null,null,null,null,{"$f":"IF(BK63=\"\",\"\",BS63)","v":35},null,null,"LAZUROVÁ JIŘINA",171,123,122,137,116,{"$f":"SUM(BK63:BO63)","v":669},{"$f":"MAX(BK63:BO63)","v":171},{"$f":"SUM(BP63*1000)+BQ63+0.01","v":669171.01},{"$f":"IF(BK63=\"\",\"\",RANK(BR63,BR6:BR65,0))","v":35},null,null,null,null,null,null,null,null,null,null,null,{"$f":"IF(CI63=\"\",\"\",CQ63)","v":15},null,null,"BREJCHA JAROSLAV",159,168,123,151,152,{"$f":"SUM(CI63:CM63)","v":753},{"$f":"MAX(CI63:CM63)","v":168},{"$f":"SUM(CN63*1000)+CO63+0.01","v":753168.01},{"$f":"IF(CI63=\"\",\"\",RANK(CP63,CP6:CP65,0))","v":15},null,null,null,null,null,null,null,null,null,null,null,{"$f":"IF(DG63=\"\",\"\",DO63)","v":38},null,null,"Křikavová Miroslava",144,103,134,110,149,{"$f":"SUM(DG63:DK63)","v":640},{"$f":"MAX(DG63:DK63)","v":149},{"$f":"SUM(DL63*1000)+DM63+0.01","v":640149.01},{"$f":"IF(DG63=\"\",\"\",RANK(DN63,DN6:DN65,0))","v":38},null,null,null,null,null,null,null,null,null,null,null,{"$f":"IF(EE63=\"\",\"\",EM63)","v":41},null,null,"Táborský František",123,119,124,147,102,{"$f":"SUM(EE63:EI63)","v":615},{"$f":"MAX(EE63:EI63)","v":147},{"$f":"SUM(EJ63*1000)+EK63+0.01","v":615147.01},{"$f":"IF(EE63=\"\",\"\",RANK(EL63,EL6:EL65,0))","v":41},null,null,null,null,null,null,null,null,null,null,null,{"$f":"IF(FC63=\"\",\"\",FK63)","v":47},null,null,"Pospíšil Lukáš",116,109,116,115,119,{"$f":"SUM(FC63:FG63)","v":575},{"$f":"MAX(FC63:FG63)","v":119},{"$f":"SUM(FH63*1000)+FI63+0.01","v":575119.01},{"$f":"IF(FC63=\"\",\"\",RANK(FJ63,FJ6:FJ65,0))","v":47},null,null,null,null,null,null,null,null,null,null,null,{"$f":"IF(GA63=\"\",\"\",GI63)","v":""},null,null,null,null,null,null,null,null,{"$f":"SUM(GA63:GE63)","v":0},{"$f":"MAX(GA63:GE63)","v":0},{"$f":"SUM(GF63*1000)+GG63+0.01","v":0.01},{"$f":"IF(GA63=\"\",\"\",RANK(GH63,GH6:GH70,0))","v":""}]
[null,null,null,null,null,null,null,null,null,null,null,null,null,null,{"$f":"IF(S64=\"\",\"\",AA64)","v":35},null,null,"KRUPKA JAKUB",132,137,139,116,103,{"$f":"SUM(S64:W64)","v":627},{"$f":"MAX(S64:W64)","v":139},{"$f":"SUM(X64*1000)+Y64","v":627139},{"$f":"IF(S64=\"\",\"\",RANK(Z64,Z6:Z65,0))","v":35},null,null,null,null,null,null,null,null,null,{"$f":"IF(AO64=\"\",\"\",AW64)","v":31},null,null,"KRUPOVÁ MARTINA",122,142,125,153,120,{"$f":"SUM(AO64:AS64)","v":662},{"$f":"MAX(AO64:AS64)","v":153},{"$f":"SUM(AT64*1000)+AU64","v":662153},{"$f":"IF(AO64=\"\",\"\",RANK(AV64,AV6:AV65,0))","v":31},null,null,null,null,null,null,null,null,null,{"$f":"IF(BK64=\"\",\"\",BS64)","v":42},null,null,"ŠAFÁŘ LADISLAV",129,92,111,130,131,{"$f":"SUM(BK64:BO64)","v":593},{"$f":"MAX(BK64:BO64)","v":131},{"$f":"SUM(BP64*1000)+BQ64","v":593131},{"$f":"IF(BK64=\"\",\"\",RANK(BR64,BR6:BR65,0))","v":42},null,null,null,null,null,null,null,null,null,null,null,{"$f":"IF(CI64=\"\",\"\",CQ64)","v":24},null,null,"RADOVÁ PETRA",137,152,137,125,137,{"$f":"SUM(CI64:CM64)","v":688},{"$f":"MAX(CI64:CM64)","v":152},{"$f":"SUM(CN64*1000)+CO64","v":688152},{"$f":"IF(CI64=\"\",\"\",RANK(CP64,CP6:CP65,0))","v":24},null,null,null,null,null,null,null,null,null,null,null,{"$f":"IF(DG64=\"\",\"\",DO64)","v":14},null,null,"Alba Vladimír",161,176,186,107,146,{"$f":"SUM(DG64:DK64)","v":776},{"$f":"MAX(DG64:DK64)","v":186},{"$f":"SUM(DL64*1000)+DM64","v":776186},{"$f":"IF(DG64=\"\",\"\",RANK(DN64,DN6:DN65,0))","v":14},null,null,null,null,null,null,null,null,null,null,null,{"$f":"IF(EE64=\"\",\"\",EM64)","v":49},null,null,"Pipek Pavel",88,110,124,88,128,{"$f":"SUM(EE64:EI64)","v":538},{"$f":"MAX(EE64:EI64)","v":128},{"$f":"SUM(EJ64*1000)+EK64","v":538128},{"$f":"IF(EE64=\"\",\"\",RANK(EL64,EL6:EL65,0))","v":49},null,null,null,null,null,null,null,null,null,null,null,{"$f":"IF(FC64=\"\",\"\",FK64)","v":50},null,null,"Hyková Lucie",87,60,97,82,74,{"$f":"SUM(FC64:FG64)","v":400},{"$f":"MAX(FC64:FG64)","v":97},{"$f":"SUM(FH64*1000)+FI64","v":400097},{"$f":"IF(FC64=\"\",\"\",RANK(FJ64,FJ6:FJ65,0))","v":50},null,null,null,null,null,null,null,null,null,null,null,{"$f":"IF(GA64=\"\",\"\",GI64)","v":""},null,null,null,null,null,null,null,null,{"$f":"SUM(GA64:GE64)","v":0},{"$f":"MAX(GA64:GE64)","v":0},{"$f":"SUM(GF64*1000)+GG64","v":0},{"$f":"IF(GA64=\"\",\"\",RANK(GH64,GH6:GH70,0))","v":""}]
[null,null,null,null,null,null,null,null,null,null,null,null,null,null,null,null,null,null,{"$f":"SUM(S60:S64)","v":589},{"$f":"SUM(T60:T64)","v":603},{"$f":"SUM(U60:U64)","v":633},{"$f":"SUM(V60:V64)","v":562},{"$f":"SUM(W60:W64)","v":574},null,null,null,null,{"$f":"SUM(S65:W65)","v":2961},null,null,null,null,null,null,null,null,null,null,null,null,{"$f":"SUM(AO60:AO64)","v":634},{"$f":"SUM(AP60:AP64)","v":641},{"$f":"SUM(AQ60:AQ64)","v":636},{"$f":"SUM(AR60:AR64)","v":721},{"$f":"SUM(AS60:AS64)","v":603},null,null,null,null,{"$f":"SUM(AO65:AS65)","v":3235},null,null,null,null,null,null,null,null,null,null,null,null,{"$f":"SUM(BK60:BK64)","v":664},{"$f":"SUM(BL60:BL64)","v":573},{"$f":"SUM(BM60:BM64)","v":604},{"$f":"SUM(BN60:BN64)","v":642},{"$f":"SUM(BO60:BO64)","v":590},null,null,null,null,{"$f":"SUM(BK65:BO65)","v":3073},{"$f":"MAX(BK65:BO65)","v":664},{"$f":"IF(BK60=\"\",\"\",SUM(BT65*10000)+BU65)","v":30730664},null,null,null,null,null,null,null,null,null,null,null,null,{"$f":"SUM(CI60:CI64)","v":765},{"$f":"SUM(CJ60:CJ64)","v":747},{"$f":"SUM(CK60:CK64)","v":657},{"$f":"SUM(CL60:CL64)","v":712},{"$f":"SUM(CM60:CM64)","v":693},null,null,null,null,{"$f":"SUM(CI65:CM65)","v":3574},{"$f":"MAX(CI65:CM65)","v":765},{"$f":"IF(CI60=\"\",\"\",SUM(CR65*1000)+CS65)","v":3574765},null,null,null,null,null,null,null,null,null,null,null,null,{"$f":"SUM(DG60:DG64)","v":692},{"$f":"SUM(DH60:DH64)","v":690},{"$f":"SUM(DI60:DI64)","v":670},{"$f":"SUM(DJ60:DJ64)","v":629},{"$f":"SUM(DK60:DK64)","v":706},null,null,null,null,{"$f":"SUM(DG65:DK65)","v":3387},{"$f":"MAX(DG65:DK65)","v":706},{"$f":"IF(DG60=\"\",\"\",SUM(DP65*1000)+DQ65)","v":3387706},null,null,null,null,null,null,null,null,null,null,null,null,{"$f":"SUM(EE60:EE64)","v":558},{"$f":"SUM(EF60:EF64)","v":621},{"$f":"SUM(EG60:EG64)","v":636},{"$f":"SUM(EH60:EH64)","v":717},{"$f":"SUM(EI60:EI64)","v":611},null,null,null,null,{"$f":"SUM(EE65:EI65)","v":3143},{"$f":"MAX(EE65:EI65)","v":717},{"$f":"IF(EE60=\"\",\"\",SUM(EN65*1000)+EO65)","v":3143717},null,null,null,null,null,null,null,null,null,null,null,null,{"$f":"SUM(FC60:FC64)","v":595},{"$f":"SUM(FD60:FD64)","v":603},{"$f":"SUM(FE60:FE64)","v":578},{"$f":"SUM(FF60:FF64)","v":626},{"$f":"SUM(FG60:FG64)","v":514},null,null,null,null,{"$f":"SUM(FC65:FG65)","v":2916},{"$f":"MAX(FC65:FG65)","v":626},{"$f":"IF(FC60=\"\",\"\",SUM(FL65*1000)+FM65)","v":2916626},null,null,null,null,null,null,null,null,null,null,null,null,{"$f":"SUM(GA60:GA64)","v":0},{"$f":"SUM(GB60:GB64)","v":0},{"$f":"SUM(GC60:GC64)","v":0},{"$f":"SUM(GD60:GD64)","v":0},{"$f":"SUM(GE60:GE64)","v":0},null,null,null,null,{"$f":"SUM(GA65:GE65)","v":0},{"$f":"MAX(GA65:GE65)","v":0},{"$f":"IF(GA60=\"\",\"\",SUM(GJ65*1000)+GK65)","v":""}]
[null,null,null,null,null,null,null,null,null,null,null,null,null,null,null,null,null,null,null,null,null,null,null,null,null,null,null,null,null,null,null,null,null,null,null,null,null,null,null,null,null,null,null,null,null,null,null,null,null,null,null,null,null,null,null,null,null,null,null,null,null,null,null,null,null,null,null,null,null,null,null,null,null,null,null,null,null,null,null,null,null,null,null,null,null,null,null,null,null,null,null,null,null,null,null,null,null,null,null,null,null,null,null,null,null,null,null,null,null,null,null,null,null,null,null,null,null,null,null,null,null,null,null,null,null,null,null,null,null,null,null,null,null,null,null,null,null,null,null,null,null,null,null,null,null,null,null,null,null,null,null,null,null,null,null,null,null,null,null,null,null,null,null,null,null,null,null,null,null,null,null,null,null,null,null,null,null,null,{"$f":"IF(GA66=\"\",\"\",GI66)","v":""},11,"KLÍČOV III.",null,null,null,null,null,null,{"$f":"SUM(GA66:GE66)","v":0},{"$f":"MAX(GA66:GE66)","v":0},{"$f":"SUM(GF66*1000)+GG66-0.01","v":-0.01},{"$f":"IF(GA66=\"\",\"\",RANK(GH66,GH6:GH70,0))","v":""},null,null,null,{"$f":"IF(GA66=\"\",\"\",RANK(GL71,GL11:GL71,0))","v":""}]
[null,null,null,null,null,null,null,null,null,null,null,null,null,null,null,null,null,null,null,null,null,null,null,null,null,null,null,null,null,null,null,null,null,null,null,null,null,null,null,null,null,null,null,null,null,null,null,null,null,null,null,null,null,null,null,null,null,null,null,null,null,null,null,null,null,null,null,null,null,null,null,null,null,null,null,null,null,null,null,null,null,null,null,null,null,null,null,null,null,null,null,null,null,null,null,null,null,null,null,null,null,null,null,null,null,null,null,null,null,null,null,null,null,null,null,null,null,null,null,null,null,null,null,null,null,null,null,null,null,null,null,null,null,null,null,null,null,null,null,null,null,null,null,null,null,null,null,null,null,null,null,null,null,null,null,null,null,null,null,null,null,null,null,null,null,null,null,null,null,null,null,null,null,null,null,null,null,null,{"$f":"IF(GA67=\"\",\"\",GI67)","v":""},null,null,null,null,null,null,null,null,{"$f":"SUM(GA67:GE67)","v":0},{"$f":"MAX(GA67:GE67)","v":0},{"$f":"SUM(GF67*1000)+GG67-0.02","v":-0.02},{"$f":"IF(GA67=\"\",\"\",RANK(GH67,GH6:GH70,0))","v":""}]
[null,null,null,null,null,null,null,null,null,null,null,null,null,null,null,null,null,null,null,null,null,null,null,null,null,null,null,null,null,null,null,null,null,null,null,null,null,null,null,null,null,null,null,null,null,null,null,null,null,null,null,null,null,null,null,null,null,null,null,null,null,null,null,null,null,null,null,null,null,null,null,null,null,null,null,null,null,null,null,null,null,null,null,null,null,null,null,null,null,null,null,null,null,null,null,null,null,null,null,null,null,null,null,null,null,null,null,null,null,null,null,null,null,null,null,null,null,null,null,null,null,null,null,null,null,null,null,null,null,null,null,null,null,null,null,null,null,null,null,null,null,null,null,null,null,null,null,null,null,null,null,null,null,null,null,null,null,null,null,null,null,null,null,null,null,null,null,null,null,null,null,null,null,null,null,null,null,null,{"$f":"IF(GA68=\"\",\"\",GI68)","v":""},null,null,null,null,null,null,null,null,{"$f":"SUM(GA68:GE68)","v":0},{"$f":"MAX(GA68:GE68)","v":0},{"$f":"SUM(GF68*1000)+GG68-0.03","v":-0.03},{"$f":"IF(GA68=\"\",\"\",RANK(GH68,GH6:GH70,0))","v":""}]
[null,null,null,null,null,null,null,null,null,null,null,null,null,null,null,null,null,null,null,null,null,null,null,null,null,null,null,null,null,null,null,null,null,null,null,null,null,null,null,null,null,null,null,null,null,null,null,null,null,null,null,null,null,null,null,null,null,null,null,null,null,null,null,null,null,null,null,null,null,null,null,null,null,null,null,null,null,null,null,null,null,null,null,null,null,null,null,null,null,null,null,null,null,null,null,null,null,null,null,null,null,null,null,null,null,null,null,null,null,null,null,null,null,null,null,null,null,null,null,null,null,null,null,null,null,null,null,null,null,null,null,null,null,null,null,null,null,null,null,null,null,null,null,null,null,null,null,null,null,null,null,null,null,null,null,null,null,null,null,null,null,null,null,null,null,null,null,null,null,null,null,null,null,null,null,null,null,null,{"$f":"IF(GA69=\"\",\"\",GI69)","v":""},null,null,null,null,null,null,null,null,{"$f":"SUM(GA69:GE69)","v":0},{"$f":"MAX(GA69:GE69)","v":0},{"$f":"SUM(GF69*1000)+GG69-0.04","v":-0.04},{"$f":"IF(GA69=\"\",\"\",RANK(GH69,GH6:GH70,0))","v":""}]
[null,null,null,null,null,null,null,null,null,null,null,null,null,null,null,null,null,null,null,null,null,null,null,null,null,null,null,null,null,null,null,null,null,null,null,null,null,null,null,null,null,null,null,null,null,null,null,null,null,null,null,null,null,null,null,null,null,null,null,null,null,null,null,null,null,null,null,null,null,null,null,null,null,null,null,null,null,null,null,null,null,null,null,null,null,null,null,null,null,null,null,null,null,null,null,null,null,null,null,null,null,null,null,null,null,null,null,null,null,null,null,null,null,null,null,null,null,null,null,null,null,null,null,null,null,null,null,null,null,null,null,null,null,null,null,null,null,null,null,null,null,null,null,null,null,null,null,null,null,null,null,null,null,null,null,null,null,null,null,null,null,null,null,null,null,null,null,null,null,null,null,null,null,null,null,null,null,null,{"$f":"IF(GA70=\"\",\"\",GI70)","v":""},null,null,null,null,null,null,null,null,{"$f":"SUM(GA70:GE70)","v":0},{"$f":"MAX(GA70:GE70)","v":0},{"$f":"SUM(GF70*1000)+GG70-0.05","v":-0.05},{"$f":"IF(GA70=\"\",\"\",RANK(GH70,GH6:GH70,0))","v":""}]
[null,null,null,null,null,null,null,null,null,null,null,null,null,null,null,null,null,null,null,null,null,null,null,null,null,null,null,null,null,null,null,null,null,null,null,null,null,null,null,null,null,null,null,null,null,null,null,null,null,null,null,null,null,null,null,null,null,null,null,null,null,null,null,null,null,null,null,null,null,null,null,null,null,null,null,null,null,null,null,null,null,null,null,null,null,null,null,null,null,null,null,null,null,null,null,null,null,null,null,null,null,null,null,null,null,null,null,null,null,null,null,null,null,null,null,null,null,null,null,null,null,null,null,null,null,null,null,null,null,null,null,null,null,null,null,null,null,null,null,null,null,null,null,null,null,null,null,null,null,null,null,null,null,null,null,null,null,null,null,null,null,null,null,null,null,null,null,null,null,null,null,null,null,null,null,null,null,null,null,null,null,null,{"$f":"SUM(GA66:GA70)","v":0},{"$f":"SUM(GB66:GB70)","v":0},{"$f":"SUM(GC66:GC70)","v":0},{"$f":"SUM(GD66:GD70)","v":0},{"$f":"SUM(GE66:GE70)","v":0},null,null,null,null,{"$f":"SUM(GA71:GE71)","v":0},{"$f":"MAX(GA71:GE71)","v":0},{"$f":"IF(GA66=\"\",\"\",SUM(GJ71*1000)+GK71)","v":""}]

{"sheet":"zápis","index":4,"n_rows":126,"n_cols":48,"rows_kept":126,"cut":false,"hidden":true,"merged":[[0,38,0,42],[0,2,0,6],[0,8,0,12],[0,14,0,18],[0,20,0,24],[0,26,0,30],[0,32,0,36]]}
["garáž"," jméno",null,null,null,null,null,"16.2.",null,null,null,null,null,"14.3.",null,null,null,null,null,"28.3.",null,null,null,null,null,"18.4.",null,null,null,null,null,"12.9.",null,null,null,null,null,"17.10.",null,null,null,null,null,"7.11.","kuželky",null,"průměr"]
["Dejvice","Jošt Michal",null,null,null,null,null,{"$f":"SUM(C2+D2+E2+F2+G2)","v":0},null,null,null,null,null,{"$f":"SUM(I2+J2+K2+L2+M2)","v":0},null,null,null,null,null,{"$f":"SUM(O2+P2+Q2+R2+S2)","v":0},null,null,null,null,null,{"$f":"SUM(U2+V2+W2+X2+Y2)","v":0},null,null,null,null,null,{"$f":"SUM(AA2+AB2+AC2+AD2+AE2)","v":0},null,null,null,null,null,{"$f":"SUM(AG2+AH2+AI2+AJ2+AK2)","v":0},null,null,null,null,null,{"$f":"SUM(AM2+AN2+AO2+AP2+AQ2)","v":0},{"$f":"SUM(N2,H2,T2,Z2,AF2,AL2,AR2)","v":0},{"$f":"COUNT(C2:G2,I2:M2,O2:S2,U2:Y2,AA2:AE2,AG2:AK2,AM2:AQ2)","v":0},{"$f":"IF(AT2=0,\"\",AS2/AT2)","v":""}]
["Dejvice","Pěchočová Soňa",null,null,null,null,null,{"$f":"SUM(C3+D3+E3+F3+G3)","v":0},null,null,null,null,null,{"$f":"SUM(I3:M3)","v":0},null,null,null,null,null,{"$f":"SUM(O3:S3)","v":0},null,null,null,null,null,{"$f":"SUM(U3:Y3)","v":0},null,null,null,null,null,{"$f":"SUM(AA3:AE3)","v":0},null,null,null,null,null,{"$f":"SUM(AG3:AK3)","v":0},null,null,null,null,null,{"$f":"SUM(AM3:AQ3)","v":0},{"$f":"SUM(N3,H3,T3,Z3,AF3,AL3,AR3)","v":0},{"$f":"COUNT(C3:G3,I3:M3,O3:S3,U3:Y3,AA3:AE3,AG3:AK3,AM3:AQ3)","v":0},{"$f":"IF(AT3=0,\"\",AS3/AT3)","v":""}]
["Dejvice","Joštová Alena",null,null,null,null,null,{"$f":"SUM(C4+D4+E4+F4+G4)","v":0},null,null,null,null,null,{"$f":"SUM(I4:M4)","v":0},null,null,null,null,null,{"$f":"SUM(O4:S4)","v":0},null,null,null,null,null,{"$f":"SUM(U4:Y4)","v":0},null,null,null,null,null,{"$f":"SUM(AA4:AE4)","v":0},null,null,null,null,null,{"$f":"SUM(AG4:AK4)","v":0},null,null,null,null,null,{"$f":"SUM(AM4:AQ4)","v":0},{"$f":"SUM(N4,H4,T4,Z4,AF4,AL4,AR4)","v":0},{"$f":"COUNT(C4:G4,I4:M4,O4:S4,U4:Y4,AA4:AE4,AG4:AK4,AM4:AQ4)","v":0},{"$f":"IF(AT4=0,\"\",AS4/AT4)","v":""}," "]
["Dejvice","Štěrba Ladislav",null,null,null,null,null,{"$f":"SUM(C5+D5+E5+F5+G5)","v":0},null,null,null,null,null,{"$f":"SUM(I5:M5)","v":0},null,null,null,null,null,{"$f":"SUM(O5:S5)","v":0},null,null,null,null,null,{"$f":"SUM(U5:Y5)","v":0},null,null,null,null,null,{"$f":"SUM(AA5:AE5)","v":0},null,null,null,null,null,{"$f":"SUM(AG5:AK5)","v":0},null,null,null,null,null,{"$f":"SUM(AM5:AQ5)","v":0},{"$f":"SUM(N5,H5,T5,Z5,AF5,AL5,AR5)","v":0},{"$f":"COUNT(C5:G5,I5:M5,O5:S5,U5:Y5,AA5:AE5,AG5:AK5,AM5:AQ5)","v":0},{"$f":"IF(AT5=0,\"\",AS5/AT5)","v":""}]
["Dejvice","Novák Antonín",null,null,null,null,null,{"$f":"SUM(C6+D6+E6+F6+G6)","v":0},null,null,null,null,null,{"$f":"SUM(I6:M6)","v":0},null,null,null,null,null,{"$f":"SUM(O6:S6)","v":0},null,null,null,null,null,{"$f":"SUM(U6:Y6)","v":0},null,null,null,null,null,{"$f":"SUM(AA6:AE6)","v":0},null,null,null,null,null,{"$f":"SUM(AG6:AK6)","v":0},null,null,null,null,null,{"$f":"SUM(AM6:AQ6)","v":0},{"$f":"SUM(N6,H6,T6,Z6,AF6,AL6,AR6)","v":0},{"$f":"COUNT(C6:G6,I6:M6,O6:S6,U6:Y6,AA6:AE6,AG6:AK6,AM6:AQ6)","v":0},{"$f":"IF(AT6=0,\"\",AS6/AT6)","v":""}]
[]
[null,null,null,null,null,null,null,null,null,null,null,null,null,null,null,null,null,null,null,null,null,null,null,null,null,null,null,null,null,null,null,null,null,null,null,null,null,null,null,null,null,null,null,null,{"$f":"SUM(AS2:AS7)","v":0},{"$f":"SUM(AT2:AT7)","v":0},{"$f":"IF(AT8=0,\"\",AS8/AT8)","v":""}]
[]
["Hostivař","Šafařík Luděk",188,156,153,231,200,{"$f":"SUM(C10+D10+E10+F10+G10)","v":928},168,181,156,223,177,{"$f":"SUM(I10+J10+K10+L10+M10)","v":905},179,205,179,135,199,{"$f":"SUM(O10+P10+Q10+R10+S10)","v":897},145,170,179,212,177,{"$f":"SUM(U10+V10+W10+X10+Y10)","v":883},145,191,153,146,170,{"$f":"SUM(AA10+AB10+AC10+AD10+AE10)","v":805},213,186,202,186,175,{"$f":"SUM(AG10+AH10+AI10+AJ10+AK10)","v":962},155,193,179,157,149,{"$f":"SUM(AM10+AN10+AO10+AP10+AQ10)","v":833},{"$f":"SUM(N10,H10,T10,Z10,AF10,AL10,AR10)","v":6213},{"$f":"COUNT(C10:G10,I10:M10,O10:S10,U10:Y10,AA10:AE10,AG10:AK10,AM10:AQ10)","v":35},{"$f":"IF(AT10=0,\"\",AS10/AT10)","v":177.51428571428571}]
["Hostivař","Sláma Karel",null,null,null,null,null,0,null,null,null,null,null,0,null,null,null,null,null,0,null,null,null,null,null,0,null,null,null,null,null,0,null,null,null,null,null,0,null,null,null,null,null,0,0,0,""]
["Hostivař","Jelínek Jan",143,158,165,135,126,727,158,152,128,140,141,719,156,104,160,190,160,770,114,144,168,134,106,666,161,153,148,145,175,782,134,142,134,164,201,775,162,149,156,169,180,816,5255,35,150.14285714285714]
["Hostivař","Mysliveček  Jaroslav",124,176,143,147,112,702,172,139,146,167,144,768,121,141,112,150,107,631,153,151,105,179,166,754,176,136,115,169,105,701,120,128,130,162,102,642,153,150,115,173,126,717,4915,35,140.42857142857142]
["Hostivař","Jirkovská Iveta",null,null,null,null,null,0,null,null,null,null,null,0,null,null,null,null,null,0,null,null,null,null,null,0,null,null,null,null,null,0,null,null,null,null,null,0,null,null,null,null,null,0,0,0,""]
["Hostivař","Křápek Roman",115,155,107,145,115,637,135,145,127,111,114,632,null,null,null,null,null,0,null,null,null,null,null,0,123,223,152,158,178,834,111,105,133,139,145,633,104,125,160,130,149,668,3404,25,136.16]
["Hostivař","Svítil Pavel",null,null,null,null,null,0,null,null,null,null,null,0,85,107,107,113,68,480,82,117,66,129,96,490,null,null,null,null,null,0,null,null,null,null,null,0,null,null,null,null,null,0,970,10,97]
["Hostivař","Čermák Tomáš",126,104,135,123,89,577,null,null,null,null,null,0,109,120,106,112,117,564,117,125,132,143,114,631,139,112,78,113,119,561,89,128,121,133,114,585,null,null,null,null,null,0,2918,25,116.72]
["Hostivař","Buzi Jiří",null,null,null,null,null,0,null,null,null,null,null,0,null,null,null,null,null,0,null,null,null,null,null,0,null,null,null,null,null,0,null,null,null,null,null,0,null,null,null,null,null,0,0,0,""]
["Hostivař","Lazur Ladislav",159,160,165,176,187,847,223,197,227,147,151,945,174,167,161,151,178,831,null,null,null,null,null,0,121,154,159,181,179,794,191,145,197,156,212,901,185,148,223,128,179,863,5181,30,172.7]
["Hostivař","Lazurová Jiřina",null,null,null,null,null,0,115,96,134,117,136,598,171,123,122,137,116,669,null,null,null,null,null,0,145,119,166,141,133,704,null,null,null,null,null,0,102,116,115,132,86,551,{"$f":"SUM(N20,H20,T20,Z20,AF20,AL20,AR20)","v":2522},{"$f":"COUNT(C20:G20,I20:M20,O20:S20,U20:Y20,AA20:AE20,AG20:AK20,AM20:AQ20)","v":20},{"$f":"IF(AT20=0,\"\",AS20/AT20)","v":126.1}]
["Hostivař","Kačena Martin",null,null,null,null,null,0,null,null,null,null,null,0,null,null,null,null,null,0,null,null,null,null,null,0,null,null,null,null,null,0,null,null,null,null,null,0,null,null,null,null,null,0,0,0,""]
["Hostivař","Bulka Miroslav",null,null,null,null,null,0,null,null,null,null,null,0,null,null,null,null,null,0,null,null,null,null,null,0,null,null,null,null,null,0,null,null,null,null,null,0,null,null,null,null,null,0,0,0,""]
["Hostivař","Kalošová Dagmar",105,85,127,79,100,496,99,89,98,99,113,498,null,null,null,null,null,0,102,69,105,126,131,533,null,null,null,null,null,0,null,null,null,null,null,0,null,null,null,null,null,0,1527,15,101.8]
["Hostivař","Berger Michal",null,null,null,null,null,0,140,144,144,129,132,689,170,131,158,150,158,767,123,129,140,212,99,703,null,null,null,null,null,0,132,164,147,153,134,730,133,137,172,132,155,729,3618,25,144.72]
["Hostivař","Kollár Pavel",115,141,89,101,125,571,null,null,null,null,null,0,99,115,99,97,119,529,116,89,107,115,131,558,163,90,162,144,122,681,122,170,131,130,142,695,141,144,113,140,134,672,3706,30,123.53333333333333]
["Hostivař","Šafář Vladimír",144,108,98,146,120,616,159,185,109,115,140,708,129,92,111,130,131,593,124,127,139,140,102,632,105,147,143,149,139,683,129,138,133,115,116,631,135,124,135,121,137,652,{"$f":"SUM(N26,H26,T26,Z26,AF26,AL26,AR26)","v":4515},{"$f":"COUNT(C26:G26,I26:M26,O26:S26,U26:Y26,AA26:AE26,AG26:AK26,AM26:AQ26)","v":35},{"$f":"IF(AT26=0,\"\",AS26/AT26)","v":129}]
["Hostivař","Bergerová Marcela",null,null,null,null,null,0,85,85,109,107,118,504,null,null,null,null,null,0,98,106,118,82,107,511,null,null,null,null,null,0,null,null,null,null,null,0,null,null,null,null,null,0,{"$f":"SUM(N27,H27,T27,Z27,AF27,AL27,AR27)","v":1015},{"$f":"COUNT(C27:G27,I27:M27,O27:S27,U27:Y27,AA27:AE27,AG27:AK27,AM27:AQ27)","v":10},{"$f":"IF(AT27=0,\"\",AS27/AT27)","v":101.5}]
["Hostivař","Růžička Ladislav",133,162,155,128,166,744,null,null,null,null,null,0,null,null,null,null,null,0,null,null,null,null,null,0,122,136,151,130,178,717,123,137,137,142,125,664,170,163,155,163,141,792,{"$f":"SUM(N28,H28,T28,Z28,AF28,AL28,AR28)","v":2917},{"$f":"COUNT(C28:G28,I28:M28,O28:S28,U28:Y28,AA28:AE28,AG28:AK28,AM28:AQ28)","v":20},{"$f":"IF(AT28=0,\"\",AS28/AT28)","v":145.85}]
[]
[]
[null,null,null,null,null,null,null,null,null,null,null,null,null,null,null,null,null,null,null,null,null,null,null,null,null,null,null,null,null,null,null,null,null,null,null,null,null,null,null,null,null,null,null,null,{"$f":"SUM(AS10:AS27)","v":45759},{"$f":"SUM(AT10:AT27)","v":330},{"$f":"IF(AT31=0,\"\",AS31/AT31)","v":138.66363636363636}]
[]
["Kačerov","Carvan Pavel",136,133,171,159,153,{"$f":"SUM(C33+D33+E33+F33+G33)","v":752},156,180,178,184,162,{"$f":"SUM(I33+J33+K33+L33+M33)","v":860},170,127,138,133,137,{"$f":"SUM(O33+P33+Q33+R33+S33)","v":705},191,137,200,153,161,{"$f":"SUM(U33+V33+W33+X33+Y33)","v":842},114,110,156,172,131,{"$f":"SUM(AA33+AB33+AC33+AD33+AE33)","v":683},146,192,147,127,150,{"$f":"SUM(AG33+AH33+AI33+AJ33+AK33)","v":762},160,147,150,185,168,{"$f":"SUM(AM33+AN33+AO33+AP33+AQ33)","v":810},{"$f":"SUM(N33,H33,T33,Z33,AF33,AL33,AR33)","v":5414},{"$f":"COUNT(C33:G33,I33:M33,O33:S33,U33:Y33,AA33:AE33,AG33:AK33,AM33:AQ33)","v":35},{"$f":"IF(AT33=0,\"\",AS33/AT33)","v":154.68571428571428}]
["Kačerov","Brož Stanislav",122,122,144,127,142,657,121,134,132,134,172,693,156,167,144,107,168,742,165,122,137,111,131,666,null,null,null,null,null,0,140,181,127,155,120,723,124,135,111,105,150,625,4106,30,136.86666666666667]
["Kačerov","Tomášek Zdeněk",169,128,132,208,188,825,135,143,134,184,132,728,161,145,117,179,131,733,132,157,137,166,131,723,128,169,171,98,159,725,null,null,null,null,null,0,null,null,null,null,null,0,3734,25,149.36000000000001]
["Kačerov","Mašát Petr",184,165,192,170,184,895,167,172,158,151,178,826,150,205,186,145,173,859,153,243,158,157,143,854,null,null,null,null,null,0,106,134,143,149,125,657,120,141,116,136,156,669,4760,30,158.66666666666666]
["Kačerov","Hübner Jiří",113,170,137,158,159,737,null,null,null,null,null,0,null,null,null,null,null,0,125,105,179,164,152,725,136,154,125,117,171,703,135,128,111,125,178,677,157,208,177,123,138,803,3645,25,145.80000000000001]
["Kačerov","Douša Adam",103,134,169,115,115,636,165,128,197,141,135,766,148,153,119,123,129,672,160,170,124,170,161,785,149,112,113,135,160,669,null,null,null,null,null,0,118,115,135,137,126,631,4159,30,138.63333333333333]
["Kačerov","Turek Stanislav",null,null,null,null,null,0,null,null,null,null,null,0,null,null,null,null,null,0,null,null,null,null,null,0,143,185,122,118,153,721,125,170,108,129,142,674,100,103,168,141,137,649,2044,15,136.26666666666668]
["Kačerov","Brejcha Jaroslav",102,153,110,145,104,614,107,116,158,112,125,618,151,117,158,120,137,683,159,168,123,151,152,753,126,130,135,140,187,718,142,130,155,137,127,691,143,132,141,137,128,681,4758,35,135.94285714285715]
["Kačerov","Žalud Miroslav",null,null,null,null,null,0,134,130,110,112,139,625,null,null,null,null,null,0,null,null,null,null,null,0,null,null,null,null,null,0,null,null,null,null,null,0,null,null,null,null,null,0,{"$f":"SUM(N41,H41,T41,Z41,AF41,AL41,AR41)","v":625},{"$f":"COUNT(C41:G41,I41:M41,O41:S41,U41:Y41,AA41:AE41,AG41:AK41,AM41:AQ41)","v":5},{"$f":"IF(AT41=0,\"\",AS41/AT41)","v":125}]
["Kačerov","Stejskal Martin",null,null,null,null,null,0,null,null,null,null,null,0,152,228,196,158,112,846,null,null,null,null,null,0,null,null,null,null,null,0,null,null,null,null,null,0,null,null,null,null,null,0,846,5,169.2]
["Kačerov","Kutina Pavel",115,75,105,92,86,473,118,116,116,141,120,611,97,101,119,128,154,599,144,135,136,155,112,682,138,124,143,135,136,676,151,128,126,107,115,627,133,100,99,135,148,615,4283,35,122.37142857142857]
["Kačerov","Ondřich František",127,158,144,217,150,796,145,176,138,173,183,815,166,197,159,168,205,895,118,139,133,147,127,664,166,154,194,176,168,858,187,163,145,175,193,863,200,138,144,163,164,809,5700,35,162.85714285714286]
["Kačerov","Radová Petra",141,155,140,139,143,718,121,152,148,121,144,686,121,167,117,149,130,684,137,152,137,125,137,688,150,128,135,161,143,717,121,127,138,155,144,685,124,101,172,164,114,675,4853,35,138.65714285714284]
["Kačerov","Katolický Zdeněk",null,null,null,null,null,null,null,null,null,null,null,null,null,null,null,null,null,null,null,null,null,null,null,null,99,119,109,116,114,557,149,126,131,80,141,627,null,null,null,null,null,0,1184,10,118.4]
[]
[null,null,null,null,null,null,null,null,null,null,null,null,null,null,null,null,null,null,null,null,null,null,null,null,null,null,null,null,null,null,null,null,null,null,null,null,null,null,null,null,null,null,null,null,{"$f":"SUM(AS33:AS47)","v":50111},{"$f":"SUM(AT33:AT47)","v":350},{"$f":"IF(AT48=0,\"\",AS48/AT48)","v":143.1742857142857}]
[]
["Klíčov","Troller Pavel",136,142,143,156,114,{"$f":"SUM(C50+D50+E50+F50+G50)","v":691},122,105,175,111,125,{"$f":"SUM(I50+J50+K50+L50+M50)","v":638},null,null,null,null,null,{"$f":"SUM(O50+P50+Q50+R50+S50)","v":0},null,null,null,null,null,{"$f":"SUM(U50+V50+W50+X50+Y50)","v":0},152,132,192,153,128,{"$f":"SUM(AA50+AB50+AC50+AD50+AE50)","v":757},156,177,120,127,121,{"$f":"SUM(AG50+AH50+AI50+AJ50+AK50)","v":701},181,128,139,158,136,{"$f":"SUM(AM50+AN50+AO50+AP50+AQ50)","v":742},{"$f":"SUM(N50,H50,T50,Z50,AF50,AL50,AR50)","v":3529},{"$f":"COUNT(C50:G50,I50:M50,O50:S50,U50:Y50,AA50:AE50,AG50:AK50,AM50:AQ50)","v":25},{"$f":"IF(AT50=0,\"\",AS50/AT50)","v":141.16}]
["Klíčov","Pelikán Stanislav",null,null,null,null,null,0,null,null,null,null,null,0,null,null,null,null,null,0,null,null,null,null,null,0,null,null,null,null,null,0,null,null,null,null,null,0,113,109,163,98,95,578,578,5,115.6]
["Klíčov","Novotná Petra",140,115,116,107,112,590,123,123,135,141,114,636,136,140,123,135,147,681,91,121,130,129,123,594,91,129,139,126,121,606,null,null,null,null,null,0,null,null,null,null,null,0,3107,25,124.28]
["Klíčov","Novotný Lukáš",178,170,148,175,189,860,164,179,180,147,163,833,144,141,178,185,145,793,null,null,null,null,null,0,null,null,null,null,null,0,188,162,160,138,166,814,194,154,178,159,203,888,4188,25,167.52]
["Klíčov","Táborský Lukáš",119,125,157,145,115,661,null,null,null,null,null,0,null,null,null,null,null,0,null,null,null,null,null,0,null,null,null,null,null,0,92,124,133,210,136,695,137,108,176,147,129,697,2053,15,136.86666666666667]
["Klíčov","Táborský František",86,98,101,105,140,530,109,119,123,112,100,563,null,null,null,null,null,0,97,102,123,114,99,535,null,null,null,null,null,0,123,119,124,147,102,615,119,128,111,92,94,544,2787,25,111.48]
["Klíčov","Pecka Jiří",159,144,192,162,157,814,166,144,148,168,205,831,157,169,179,156,170,831,null,null,null,null,null,0,153,148,144,128,178,751,174,172,155,212,141,854,146,135,181,163,165,790,{"$f":"SUM(N56,H56,T56,Z56,AF56,AL56,AR56)","v":4871},{"$f":"COUNT(C56:G56,I56:M56,O56:S56,U56:Y56,AA56:AE56,AG56:AK56,AM56:AQ56)","v":30},162.36666666666667]
["Klíčov","Kalfiřt Petr",133,166,140,139,102,680,170,137,195,163,131,796,130,146,183,167,142,768,131,181,138,163,194,807,156,158,159,192,157,822,211,164,184,169,166,894,164,164,163,136,134,761,5528,35,157.94285714285715]
["Klíčov","Novotná Jana",null,null,null,null,null,0,null,null,null,null,null,0,108,111,147,115,100,581,null,null,null,null,null,0,99,105,134,97,150,585,null,null,null,null,null,0,null,null,null,null,null,0,1166,10,{"$f":"IF(AT58=0,\"\",AS58/AT58)","v":116.6}]
["Klíčov","Šafářová Veronika",null,null,null,null,null,0,null,null,null,null,null,0,null,null,null,null,null,0,null,null,null,null,null,0,null,null,null,null,null,0,null,null,null,null,null,0,null,null,null,null,null,0,0,0,""]
["Klíčov","Šafář Bohumil",null,null,null,null,null,0,154,154,135,149,159,751,100,124,164,155,117,660,null,null,null,null,null,0,null,null,null,null,null,0,null,null,null,null,null,0,null,null,null,null,null,0,1411,10,141.1]
["Klíčov","Šafrová Martina",null,null,null,null,null,0,null,null,null,null,null,0,null,null,null,null,null,0,null,null,null,null,null,0,108,81,106,115,108,518,null,null,null,null,null,0,null,null,null,null,null,0,518,5,103.6]
["Klíčov","Lokvenc Jiří",null,null,null,null,null,0,133,138,139,150,126,686,null,null,null,null,null,0,null,null,null,null,null,0,null,null,null,null,null,0,123,131,126,132,133,645,null,null,null,null,null,0,1331,10,133.1]
["Klíčov","Hájek Mojmír",null,null,null,null,null,0,null,null,null,null,null,0,125,136,104,145,189,699,116,151,75,91,116,549,null,null,null,null,null,0,null,null,null,null,null,0,null,null,null,null,null,0,1248,10,124.8]
["Klíčov","Křemenák Petr",156,143,171,128,109,707,null,null,null,null,null,0,129,144,124,138,168,703,124,144,114,113,143,638,174,127,186,145,169,801,null,null,null,null,null,0,121,165,137,116,148,687,3536,25,141.44]
["Klíčov","Vychnerová Michala",null,null,null,null,null,0,null,null,null,null,null,0,84,114,108,98,104,508,92,79,153,116,116,556,null,null,null,null,null,0,null,null,null,null,null,0,null,null,null,null,null,0,1064,10,106.4]
["Klíčov","Řehák Jaroslav",112,128,120,89,104,553,135,121,81,133,103,{"$f":"SUM(I66+J66+K66+L66+M66)","v":573},103,108,128,135,93,{"$f":"SUM(O66+P66+Q66+R66+S66)","v":567},117,110,98,109,126,{"$f":"SUM(U66+V66+W66+X66+Y66)","v":560},121,125,158,116,129,{"$f":"SUM(AA66+AB66+AC66+AD66+AE66)","v":649},null,null,null,null,null,{"$f":"SUM(AG66+AH66+AI66+AJ66+AK66)","v":0},null,null,null,null,null,{"$f":"SUM(AM66+AN66+AO66+AP66+AQ66)","v":0},2902,25,116.08]
["Klíčov","Krupka Jakub",132,137,139,116,103,627,null,null,null,null,null,{"$f":"SUM(I67+J67+K67+L67+M67)","v":0},null,null,null,null,null,{"$f":"SUM(O67+P67+Q67+R67+S67)","v":0},null,null,null,null,null,{"$f":"SUM(U67+V67+W67+X67+Y67)","v":0},null,null,null,null,null,0,null,null,null,null,null,0,null,null,null,null,null,0,{"$f":"SUM(N67,H67,T67,Z67,AF67,AL67,AR67)","v":627},{"$f":"COUNT(C67:G67,I67:M67,O67:S67,U67:Y67,AA67:AE67,AG67:AK67,AM67:AQ67)","v":5},{"$f":"IF(AT67=0,\"\",AS67/AT67)","v":125.4}]
["Klíčov","Neshyba Jaroslav",null,null,null,null,null,null,null,null,null,null,null,null,null,null,null,null,null,null,null,null,null,null,null,null,140,112,97,109,92,550,null,null,null,null,null,0,null,null,null,null,null,0,550,5,110]
["Klíčov","Kolář Ladislav",null,null,null,null,null,null,139,135,109,119,119,{"$f":"SUM(I69+J69+K69+L69+M69)","v":621},null,null,null,null,null,{"$f":"SUM(O69+P69+Q69+R69+S69)","v":0},null,null,null,null,null,{"$f":"SUM(U69+V69+W69+X69+Y69)","v":0},null,null,null,null,null,0,132,137,129,140,112,650,null,null,null,null,null,0,1271,10,127.1]
["Klíčov","Štěpán Radek",null,null,null,null,null,null,null,null,null,null,null,null,null,null,null,null,null,null,153,136,184,167,139,{"$f":"SUM(U70+V70+W70+X70+Y70)","v":779},125,98,183,131,130,667,119,122,136,157,182,716,123,132,103,134,150,642,2804,20,140.19999999999999]
["Klíčov","Štarková Tereza",null,null,null,null,null,null,null,null,null,null,null,null,null,null,null,null,null,null,109,93,93,100,92,{"$f":"SUM(U71+V71+W71+X71+Y71)","v":487},null,null,null,null,null,0,null,null,null,null,null,0,null,null,null,null,null,0,{"$f":"SUM(N71,H71,T71,Z71,AF71,AL71,AR71)","v":487},{"$f":"COUNT(C71:G71,I71:M71,O71:S71,U71:Y71,AA71:AE71,AG71:AK71,AM71:AQ71)","v":5},{"$f":"IF(AT71=0,\"\",AS71/AT71)","v":97.4}]
["Klíčov","Pipek Pavel",null,null,null,null,null,null,null,null,null,null,null,null,null,null,null,null,null,null,160,109,94,117,97,{"$f":"SUM(U72+V72+W72+X72+Y72)","v":577},null,null,null,null,null,0,88,110,124,88,128,538,104,117,155,178,78,632,{"$f":"SUM(N72,H72,T72,Z72,AF72,AL72,AR72)","v":1747},{"$f":"COUNT(C72:G72,I72:M72,O72:S72,U72:Y72,AA72:AE72,AG72:AK72,AM72:AQ72)","v":15},{"$f":"IF(AT72=0,\"\",AS72/AT72)","v":116.46666666666667}]
[]
[null,null,null,null,null,null,null,null,null,null,null,null,null,null,null,null,null,null,null,null,null,null,null,null,null,null,null,null,null,null,null,null,null,null,null,null,null,null,null,null,null,null,null,null,{"$f":"SUM(AS50:AS73)","v":47303},{"$f":"SUM(AT50:AT73)","v":350},{"$f":"IF(AT74=0,\"\",AS74/AT74)","v":135.15142857142857}]
[" "]
["Řepy","Pospíšil Václav",192,188,205,140,156,{"$f":"SUM(C76+D76+E76+F76+G76)","v":881},194,218,150,158,156,{"$f":"SUM(I76+J76+K76+L76+M76)","v":876},167,153,171,143,180,{"$f":"SUM(O76+P76+Q76+R76+S76)","v":814},187,192,175,168,179,{"$f":"SUM(U76+V76+W76+X76+Y76)","v":901},162,148,128,183,145,{"$f":"SUM(AA76+AB76+AC76+AD76+AE76)","v":766},180,146,177,181,150,{"$f":"SUM(AG76+AH76+AI76+AJ76+AK76)","v":834},174,148,167,171,184,{"$f":"SUM(AM76+AN76+AO76+AP76+AQ76)","v":844},{"$f":"SUM(N76,H76,T76,Z76,AF76,AL76,AR76)","v":5916},{"$f":"COUNT(C76:G76,I76:M76,O76:S76,U76:Y76,AA76:AE76,AG76:AK76,AM76:AQ76)","v":35},{"$f":"IF(AT76=0,\"\",AS76/AT76)","v":169.02857142857144}]
["Řepy","Kocúr Jaroslav",146,137,143,185,133,744,172,179,183,185,196,915,176,154,187,232,211,960,null,null,null,null,null,0,187,148,161,204,154,854,167,160,167,203,192,889,161,210,158,174,147,850,5212,30,173.73333333333332]
["Řepy","Sehnal Ivan",137,116,134,122,122,631,187,86,115,147,130,665,141,139,187,103,110,680,111,137,181,186,146,761,113,157,134,167,151,722,129,113,121,139,110,612,120,154,132,130,122,658,4729,35,135.11428571428573]
["Řepy","Plecháček Miroslav",103,134,160,121,135,653,107,124,136,110,131,608,null,null,null,null,null,0,null,null,null,null,null,0,null,null,null,null,null,0,null,null,null,null,null,0,null,null,null,null,null,0,1261,10,126.1]
["Řepy","Sladovník Miloš",134,135,139,172,140,720,147,177,112,127,130,693,126,152,146,159,144,727,166,170,161,186,159,842,126,149,102,161,130,668,null,null,null,null,null,0,162,146,143,148,156,755,4405,30,146.83333333333334]
["Řepy","Mottl Pavel",143,117,137,138,129,664,115,96,134,120,131,596,201,153,168,197,119,838,124,169,137,193,150,773,138,127,110,114,141,630,127,139,146,120,141,673,99,160,127,124,118,628,4802,35,137.19999999999999]
["Řepy","Číhal František",null,null,null,null,null,0,null,null,null,null,null,0,null,null,null,null,null,0,136,140,136,118,151,681,null,null,null,null,null,0,null,null,null,null,null,0,null,null,null,null,null,0,681,5,136.19999999999999]
["Řepy","Kročil Tomáš",144,169,188,124,161,786,207,115,170,136,178,806,142,141,139,151,169,742,146,218,142,138,147,791,183,162,146,168,143,802,132,147,147,163,139,728,183,168,178,142,125,796,5451,35,155.74285714285713]
["Řepy","Alba Vladimír",171,125,154,156,171,777,154,149,143,134,121,701,116,202,152,133,167,770,161,148,131,148,150,738,161,176,186,107,146,776,188,162,127,195,142,814,116,156,132,170,148,722,5298,35,151.37142857142857]
["Řepy","Tichý Hugo",134,157,147,133,134,705,121,129,114,123,149,636,118,123,124,180,166,711,119,110,122,144,123,618,null,null,null,null,null,0,131,103,138,93,132,597,null,null,null,null,null,0,3267,25,130.68]
["Řepy","Křikava Miroslav",116,130,127,88,111,572,128,88,84,145,103,548,115,126,98,99,98,536,100,125,122,182,122,651,136,127,106,131,119,619,116,111,131,120,148,626,161,107,114,132,130,644,{"$f":"SUM(N86,H86,T86,Z86,AF86,AL86,AR86)","v":4196},{"$f":"COUNT(C86:G86,I86:M86,O86:S86,U86:Y86,AA86:AE86,AG86:AK86,AM86:AQ86)","v":35},{"$f":"IF(AT86=0,\"\",AS86/AT86)","v":119.88571428571429}]
["Řepy","Dvořák Petr",null,null,null,null,null,0,null,null,null,null,null,0,null,null,null,null,null,{"$f":"SUM(O87+P87+Q87+R87+S87)","v":0},null,null,null,null,null,{"$f":"SUM(U87+V87+W87+X87+Y87)","v":0},140,112,100,79,93,{"$f":"SUM(AA87+AB87+AC87+AD87+AE87)","v":524},null,null,null,null,null,{"$f":"SUM(AG87+AH87+AI87+AJ87+AK87)","v":0},null,null,null,null,null,{"$f":"SUM(AM87+AN87+AO87+AP87+AQ87)","v":0},524,5,104.8]
["Řepy","Froněk Martin",null,null,null,null,null,0,null,null,null,null,null,0,138,145,162,140,135,720,null,null,null,null,null,0,null,null,null,null,null,0,161,160,150,151,156,778,163,181,199,173,177,893,2391,15,159.4]
["Řepy","Kozel Pavel",null,null,null,null,null,0,null,null,null,null,null,0,null,null,null,null,null,0,null,null,null,null,null,0,null,null,null,null,null,0,null,null,null,null,null,0,null,null,null,null,null,0,0,0,""]
["Řepy","Růžička Václav",null,null,null,null,null,0,null,null,null,null,null,0,null,null,null,null,null,0,143,173,117,75,111,619,null,null,null,null,null,0,144,112,139,100,103,598,121,130,134,87,114,586,1803,15,120.2]
["Řepy","Šindelář Karel",null,null,null,null,null,0,null,null,null,null,null,0,null,null,null,null,null,0,null,null,null,null,null,0,null,null,null,null,null,0,null,null,null,null,null,0,null,null,null,null,null,0,0,0,""]
["Řepy","Piešťanský Josef",null,null,null,null,null,0,null,null,null,null,null,0,null,null,null,null,null,0,null,null,null,null,null,0,null,null,null,null,null,0,null,null,null,null,null,0,null,null,null,null,null,0,{"$f":"SUM(N92,H92,T92,Z92,AF92,AL92,AR92)","v":0},{"$f":"COUNT(C92:G92,I92:M92,O92:S92,U92:Y92,AA92:AE92,AG92:AK92,AM92:AQ92)","v":0},{"$f":"IF(AT92=0,\"\",AS92/AT92)","v":""}]
["Řepy","Orlík Rostislav",null,null,null,null,null,{"$f":"SUM(C93+D93+E93+F93+G93)","v":0},null,null,null,null,null,{"$f":"SUM(I93+J93+K93+L93+M93)","v":0},null,null,null,null,null,{"$f":"SUM(O93+P93+Q93+R93+S93)","v":0},null,null,null,null,null,{"$f":"SUM(U93+V93+W93+X93+Y93)","v":0},null,null,null,null,null,{"$f":"SUM(AA93+AB93+AC93+AD93+AE93)","v":0},null,null,null,null,null,{"$f":"SUM(AG93+AH93+AI93+AJ93+AK93)","v":0},null,null,null,null,null,{"$f":"SUM(AM93+AN93+AO93+AP93+AQ93)","v":0},{"$f":"SUM(N93,H93,T93,Z93,AF93,AL93,AR93)","v":0},{"$f":"COUNT(C93:G93,I93:M93,O93:S93,U93:Y93,AA93:AE93,AG93:AK93,AM93:AQ93)","v":0},{"$f":"IF(AT93=0,\"\",AS93/AT93)","v":""}]
["Řepy","Křikavová Miroslava",null,null,null,null,null,null,null,null,null,null,null,null,null,null,null,null,null,null,null,null,null,null,null,null,144,103,134,110,149,{"$f":"SUM(AA94+AB94+AC94+AD94+AE94)","v":640},null,null,null,null,null,{"$f":"SUM(AG94+AH94+AI94+AJ94+AK94)","v":0},null,null,null,null,null,{"$f":"SUM(AM94+AN94+AO94+AP94+AQ94)","v":0},{"$f":"SUM(N94,H94,T94,Z94,AF94,AL94,AR94)","v":640},{"$f":"COUNT(C94:G94,I94:M94,O94:S94,U94:Y94,AA94:AE94,AG94:AK94,AM94:AQ94)","v":5},{"$f":"IF(AT94=0,\"\",AS94/AT94)","v":128}]
["Řepy","Brejcha Jaroslav st.",null,null,null,null,null,null,null,null,null,null,null,null,null,null,null,null,null,null,null,null,null,null,null,null,null,null,null,null,null,null,null,null,null,null,null,{"$f":"SUM(AG95+AH95+AI95+AJ95+AK95)","v":0},null,null,null,null,null,{"$f":"SUM(AM95+AN95+AO95+AP95+AQ95)","v":0},{"$f":"SUM(N95,H95,T95,Z95,AF95,AL95,AR95)","v":0},{"$f":"COUNT(C95:G95,I95:M95,O95:S95,U95:Y95,AA95:AE95,AG95:AK95,AM95:AQ95)","v":0},{"$f":"IF(AT95=0,\"\",AS95/AT95)","v":""}]
[]
[null,null,null,null,null,null,null,null,null,null,null,null,null,null,null,null,null,null,null,null,null,null,null,null,null,null,null,null,null,null,null,null,null,null,null,null,null,null,null,null,null,null,null,null,{"$f":"SUM(AS76:AS91)","v":49936},{"$f":"SUM(AT76:AT91)","v":345},{"$f":"IF(AT97=0,\"\",AS97/AT97)","v":144.74202898550723}]
[]
["Vršovice","Krupa Jozef",143,119,136,201,200,{"$f":"SUM(C99+D99+E99+F99+G99)","v":799},178,183,170,189,171,{"$f":"SUM(I99+J99+K99+L99+M99)","v":891},136,159,138,174,153,{"$f":"SUM(O99+P99+Q99+R99+S99)","v":760},190,180,169,178,166,{"$f":"SUM(U99+V99+W99+X99+Y99)","v":883},201,205,199,171,183,{"$f":"SUM(AA99+AB99+AC99+AD99+AE99)","v":959},160,169,176,182,160,{"$f":"SUM(AG99+AH99+AI99+AJ99+AK99)","v":847},180,179,167,144,190,{"$f":"SUM(AM99+AN99+AO99+AP99+AQ99)","v":860},{"$f":"SUM(N99,H99,T99,Z99,AF99,AL99,AR99)","v":5999},{"$f":"COUNT(C99:G99,I99:M99,O99:S99,U99:Y99,AA99:AE99,AG99:AK99,AM99:AQ99)","v":35},{"$f":"IF(AT99=0,\"\",AS99/AT99)","v":171.4}]
["Vršovice","Pospíšil Lukáš",170,122,100,128,91,611,121,161,148,129,124,683,103,122,113,122,113,573,104,124,87,133,135,583,139,130,123,182,123,697,null,null,null,null,null,0,116,109,116,115,119,575,3722,30,124.06666666666666]
["Vršovice","Krupová Martina",null,null,null,null,null,0,122,142,125,153,120,662,null,null,null,null,null,0,124,137,146,173,145,725,null,null,null,null,null,0,156,134,162,167,136,755,null,null,null,null,null,0,2142,15,142.80000000000001]
["Vršovice","Krupa Martin",null,null,null,null,null,0,null,null,null,null,null,0,null,null,null,null,null,0,null,null,null,null,null,0,null,null,null,null,null,0,null,null,null,null,null,0,null,null,null,null,null,0,0,0,""]
["Vršovice","Skružná Pavla",117,141,103,115,140,616,110,145,186,146,151,738,153,182,168,148,160,811,null,null,null,null,null,0,150,162,181,142,160,795,null,null,null,null,null,0,134,144,158,95,116,647,3607,25,144.28]
["Vršovice","Aunický František",126,114,104,119,97,560,141,110,107,132,114,604,125,126,123,126,105,605,161,137,110,161,136,705,120,118,127,108,146,619,112,76,127,177,101,593,159,126,83,170,102,640,4326,35,123.6]
["Vršovice","Kazda Jan",124,116,157,134,124,655,124,123,139,135,135,656,170,136,138,121,111,676,181,133,141,118,127,700,null,null,null,null,null,0,149,138,159,127,121,694,127,171,149,149,86,682,4063,30,135.43333333333334]
["Vršovice","Tůma Antonín",null,null,null,null,null,0,null,null,null,null,null,0,null,null,null,null,null,0,null,null,null,null,null,0,null,null,null,null,null,0,null,null,null,null,null,0,null,null,null,null,null,0,0,0,""]
["Vršovice","Hyková Lucie",null,null,null,null,null,0,null,null,null,null,null,0,null,null,null,null,null,0,null,null,null,null,null,0,null,null,null,null,null,0,82,56,65,49,81,333,87,60,97,82,74,400,733,10,73.3]
["Vršovice","Veselý Vlastimil",127,124,99,134,105,589,null,null,null,null,null,0,null,null,null,null,null,0,null,null,null,null,null,0,null,null,null,null,null,0,null,null,null,null,null,0,null,null,null,null,null,0,589,5,117.8]
["Vršovice","Věchtík Antonín",123,205,193,151,158,830,null,null,null,null,null,0,null,null,null,null,null,0,null,null,null,null,null,0,null,null,null,null,null,0,null,null,null,null,null,0,145,150,152,155,164,766,{"$f":"SUM(N109,H109,T109,Z109,AF109,AL109,AR109)","v":1596},{"$f":"COUNT(C109:G109,I109:M109,O109:S109,U109:Y109,AA109:AE109,AG109:AK109,AM109:AQ109)","v":10},{"$f":"IF(AT109=0,\"\",AS109/AT109)","v":159.6}]
["Vršovice","Podhola Martin",null,null,null,null,null,0,168,194,193,180,161,896,135,180,184,157,168,824,null,null,null,null,null,0,172,144,173,185,152,826,null,null,null,null,null,0,124,168,158,166,141,757,3303,20,165.15]
["Vršovice","Holkup Jan",128,149,155,168,155,755,139,182,152,161,156,790,null,null,null,null,null,0,null,null,null,null,null,0,235,146,166,187,178,912,160,228,135,165,135,823,173,144,153,161,171,802,4082,25,163.28]
["Vršovice","Pokorný Josef",null,null,null,null,null,0,null,null,null,null,null,0,null,null,null,null,null,{"$f":"SUM(O112+P112+Q112+R112+S112)","v":0},null,null,null,null,null,{"$f":"SUM(U112+V112+W112+X112+Y112)","v":0},null,null,null,null,null,{"$f":"SUM(AA112+AB112+AC112+AD112+AE112)","v":0},null,null,null,null,null,{"$f":"SUM(AG112+AH112+AI112+AJ112+AK112)","v":0},null,null,null,null,null,{"$f":"SUM(AM112+AN112+AO112+AP112+AQ112)","v":0},0,0,""]
["Vršovice","Kučera Miroslav",null,null,null,null,null,0,null,null,null,null,null,0,100,138,148,145,134,665,178,158,152,130,106,724,null,null,null,null,null,0,null,null,null,null,null,0,null,null,null,null,null,0,1389,10,138.9]
["Vršovice","Kovář Jaroslav",121,151,119,152,130,673,null,null,null,null,null,0,158,153,113,133,169,726,113,100,111,118,127,569,152,107,148,164,117,688,124,133,90,128,121,596,null,null,null,null,null,0,3252,25,130.08000000000001]
["Vršovice","Fay Vlastimil",138,83,110,134,106,571,118,126,117,131,111,{"$f":"SUM(I115+J115+K115+L115+M115)","v":603},121,130,134,121,105,611,130,103,108,129,131,601,109,102,99,105,124,539,94,134,122,119,129,598,null,null,null,null,null,0,{"$f":"SUM(N115,H115,T115,Z115,AF115,AL115,AR115)","v":3523},{"$f":"COUNT(C115:G115,I115:M115,O115:S115,U115:Y115,AA115:AE115,AG115:AK115,AM115:AQ115)","v":30},{"$f":"IF(AT115=0,\"\",AS115/AT115)","v":117.43333333333334}]
["Vršovice","Bošek Jan",null,null,null,null,null,0,129,140,148,170,123,{"$f":"SUM(I116+J116+K116+L116+M116)","v":710},118,130,124,177,124,673,144,125,143,146,117,675,154,146,127,144,152,723,169,142,160,161,141,773,null,null,null,null,null,0,{"$f":"SUM(N116,H116,T116,Z116,AF116,AL116,AR116)","v":3554},{"$f":"COUNT(C116:G116,I116:M116,O116:S116,U116:Y116,AA116:AE116,AG116:AK116,AM116:AQ116)","v":25},{"$f":"IF(AT116=0,\"\",AS116/AT116)","v":142.16}]
["Vršovice","Pavlíček Rudolf",null,null,null,null,null,0,null,null,null,null,null,{"$f":"SUM(I117+J117+K117+L117+M117)","v":0},null,null,null,null,null,0,null,null,null,null,null,0,119,97,123,112,113,564,94,120,94,170,145,623,106,137,133,110,133,619,{"$f":"SUM(N117,H117,T117,Z117,AF117,AL117,AR117)","v":1806},{"$f":"COUNT(C117:G117,I117:M117,O117:S117,U117:Y117,AA117:AE117,AG117:AK117,AM117:AQ117)","v":15},{"$f":"IF(AT117=0,\"\",AS117/AT117)","v":120.4}]
["Vršovice","Greman Milan",null,null,null,null,null,{"$f":"SUM(C118+D118+E118+F118+G118)","v":0},null,null,null,null,null,{"$f":"SUM(I118+J118+K118+L118+M118)","v":0},null,null,null,null,null,0,221,163,180,137,139,840,null,null,null,null,null,0,null,null,null,null,null,0,null,null,null,null,null,0,{"$f":"SUM(N118,H118,T118,Z118,AF118,AL118,AR118)","v":840},{"$f":"COUNT(C118:G118,I118:M118,O118:S118,U118:Y118,AA118:AE118,AG118:AK118,AM118:AQ118)","v":5},{"$f":"IF(AT118=0,\"\",AS118/AT118)","v":168}]
["Vršovice","Vrzal Pavel",null,null,null,null,null,{"$f":"SUM(C119+D119+E119+F119+G119)","v":0},null,null,null,null,null,{"$f":"SUM(I119+J119+K119+L119+M119)","v":0},null,null,null,null,null,0,null,null,null,null,null,0,null,null,null,null,null,0,null,null,null,null,null,0,null,null,null,null,null,0,{"$f":"SUM(N119,H119,T119,Z119,AF119,AL119,AR119)","v":0},{"$f":"COUNT(C119:G119,I119:M119,O119:S119,U119:Y119,AA119:AE119,AG119:AK119,AM119:AQ119)","v":0},{"$f":"IF(AT119=0,\"\",AS119/AT119)","v":""}]
[]
[null,null,null,null,null,null,null,null,null,null,null,null,null,null,null,null,null,null,null,null,null,null,null,null,null,null,null,null,null,null,null,null,null,null,null,null,null,null,null,null,null,null,null,null,{"$f":"SUM(AS99:AS120)","v":48526},{"$f":"SUM(AT99:AT120)","v":350},{"$f":"IF(AT121=0,\"\",AS121/AT121)","v":138.64571428571429}]
[]
[]
[]
[]
[null," "]