{"text_format":"1","workbook":"xlsx","n_sheets":13,"sheets":["jednotlivci","garáže","stat. celkem","turnaje","PV OSZO","KLÍČOV","ŘEPY","HOSTIVAŘ","KAČEROV","VRŠOVICE","POHÁR GŘ","11 DRUŽSTEV","zápis"],"not_rendered":{"charts":0,"images":4,"macros":1,"external_links":0,"defined_names":0,"comments":1,"pivot_tables":0},"unopened":[],"bounds":{"document_bytes":16777216,"sheet_cells":100000,"rows_first":2000,"rows_last":500,"rows_between":2000,"halvings":0,"cell_chars":16384,"cell_head_chars":4096},"cells_cut":0,"cells_raw":0,"read":"whole","date_system":"1900"}

{"sheet":"jednotlivci","index":0,"n_rows":95,"n_cols":32,"rows_kept":95,"cut":false,"hidden":false,"merged":[[2,17,2,19],[2,20,2,22],[2,23,2,25],[1,1,1,30],[2,5,2,7],[2,8,2,10],[2,11,2,13],[2,14,2,16]]}
[]
[null,"Celkové umístění jednotlivců na turnajích v BOWLINGU  2013",null,null,null,null,null,null,null,null,null,null,null,null,null,null,null,null,null,null,null,null,null,null,null,null,null,null,null,null,null," turnaje"]
[null,0,null,null,"   garáže",null,null,null,null,null,null,null,null,null,null,null,null,null,null,null,null,null,null,null,null,null," Počet turnajů"," Počet celkových bodů",null," Průměer na hru"," Průměr na turnaj"]
[null,{"$f":"SUM(B3+1)","v":1},"Podhola Martin",{"$f":"IF(AA4<2,0,1)","v":0},"Vršovice",1,{"$f":"IF(F4=\"\",\"\",IF(F4>50,\"\",51-F4))","v":50},857,null,{"$f":"IF(I4=\"\",\"\",IF(I4>50,\"\",51-I4))","v":""},null,null,{"$f":"IF(L4=\"\",\"\",IF(L4>50,\"\",51-L4))","v":""},null,null,{"$f":"IF(O4=\"\",\"\",IF(O4>50,\"\",51-O4))","v":""},null,null,{"$f":"IF(R4=\"\",\"\",IF(R4>50,\"\",51-R4))","v":""},null,null,{"$f":"IF(U4=\"\",\"\",IF(U4>50,\"\",51-U4))","v":""},null,null,{"$f":"IF(X4=\"\",\"\",IF(X4>50,\"\",51-X4))","v":""},null,{"$f":"COUNT(X4,U4,R4,O4,L4,I4,F4)","v":1},{"$f":"SUM(G4,J4,M4,P4,S4,V4,Y4)","v":50},{"$f":"IF(AB4=0,\"\",SUM(AB4*1000)+AD4)","v":50171.4},{"$f":"IF(AA4=0,\"\",AE4/5)","v":171.4},{"$f":"IF(AA4=0,\"\",(H4+K4+N4+Q4+T4+W4+Z4)/AA4)","v":857}]
[null,2,"Mašát Petr",0,"Kačerov",2,49,852,null,"",null,null,"",null,null,"",null,null,"",null,null,"",null,null,"",null,1,49,49170.400000000001,170.4,852]
[null,3,"Krupa Jozef",0,"Vršovice",3,48,844,null,"",null,null,"",null,null,"",null,null,"",null,null,"",null,null,"",null,1,48,48168.800000000003,168.8,844]
[null,4,"Lazur Ladislav",0,"Hostivař",4,47,829,null,"",null,null,"",null,null,"",null,null,"",null,null,"",null,null,"",null,1,47,47165.8,165.8,829]
[null,5,"Kocúr Jaroslav",0,"Řepy",5,46,827,null,"",null,null,"",null,null,"",null,null,"",null,null,"",null,null,"",null,1,46,46165.4,165.4,827]
[null,6,"Kolář Ladislav",0,"Klíčov",6,45,826,null,"",null,null,"",null,null,"",null,null,"",null,null,"",null,null,"",null,1,45,45165.2,165.2,826]
[null,7,"Šafařík Luděk",0,"Hostivař",7,44,812,null,"",null,null,"",null,null,"",null,null,"",null,null,"",null,null,"",null,1,44,44162.400000000001,162.4,812]
[null,8,"Dvořák Petr",0,"Řepy",8,43,799,null,"",null,null,"",null,null,"",null,null,"",null,null,"",null,null,"",null,1,43,43159.8,159.80000000000001,799]
[null,9,"Pospíšil Václav",0,"Řepy",9,42,791,null,"",null,null,"",null,null,"",null,null,"",null,null,"",null,null,"",null,1,42,42158.2,158.19999999999999,791]
[null,10,"Štěpán Radek",0,"Klíčov",10,41,776,null,"",null,null,"",null,null,"",null,null,"",null,null,"",null,null,"",null,{"$f":"COUNT(F13,I13,L13,O13,R13,U13,X13)","v":1},41,41155.199999999997,155.19999999999999,776]
[null,11,"Froněk Martin",0,"Řepy",11,40,772,null,"",null,null,"",null,null,"",null,null,"",null,null,"",null,null,"",null,{"$f":"COUNT(X14,U14,R14,O14,L14,I14,F14)","v":1},40,40154.400000000001,154.4,772]
[null,12,"Erekt Stanislav",0,"Řepy",12,39,761,null,"",null,null,"",null,null,"",null,null,"",null,null,"",null,null,"",null,1,39,39152.199999999997,152.19999999999999,761]
[null,13,"Brož Stanislav",0,"Kačerov",13,38,757,null,"",null,null,"",null,null,"",null,null,"",null,null,"",null,null,"",null,1,38,38151.4,151.4,757]
[null,14,"Leibich František",0,"Vršovice",14,37,756,null,"",null,null,"",null,null,"",null,null,"",null,null,"",null,null,"",null,1,37,37151.199999999997,151.19999999999999,756]
[null,15,"Novotný Lukáš",0,"Klíčov",15,36,755,null,"",null,null,"",null,null,"",null,null,"",null,null,"",null,null,"",null,1,36,36151,151,755]
[null,16,"Berger Michal",0,"Hostivař",16,35,751,null,"",null,null,"",null,null,"",null,null,"",null,null,"",null,null,"",null,1,35,35150.199999999997,150.19999999999999,751]
[null,17,"Turek Stanislav",0,"Kačerov",17,34,749,null,"",null,null,"",null,null,"",null,null,"",null,null,"",null,null,"",null,1,34,34149.800000000003,149.80000000000001,749]
[null,18,"Ondřich František",0,"Kačerov",18,33,749,null,"",null,null,"",null,null,"",null,null,"",null,null,"",null,null,"",null,1,33,33149.800000000003,149.80000000000001,749]
[null,19,"Holkup Jan",0,"Vršovice",19,32,748,null,"",null,null,"",null,null,"",null,null,"",null,null,"",null,null,"",null,1,32,32149.599999999999,149.6,748]
[null,20,"Carvan Pavel",0,"Kačerov",20,31,748,null,"",null,null,"",null,null,"",null,null,"",null,null,"",null,null,"",null,1,31,31149.599999999999,149.6,748]
[null,21,"Hübner Jiří",0,"Kačerov",21,30,737,null,"",null,null,"",null,null,"",null,null,"",null,null,"",null,null,"",null,1,30,30147.4,147.4,737]
[null,22,"Kalfiřt Petr",0,"Klíčov",22,29,722,null,"",null,null,"",null,null,"",null,null,"",null,null,"",null,null,"",null,1,29,29144.400000000001,144.4,722]
[null,23,"Tomášek Zdeněk",0,"Kačerov",23,28,721,null,"",null,null,"",null,null,"",null,null,"",null,null,"",null,null,"",null,1,28,28144.2,144.19999999999999,721]
[null,24,"Kročil Tomáš",0,"Řepy",24,27,721,null,"",null,null,"",null,null,"",null,null,"",null,null,"",null,null,"",null,1,27,27144.2,144.19999999999999,721]
[null,25,"Radová Petra",0,"Kačerov",25,26,716,null,"",null,null,"",null,null,"",null,null,"",null,null,"",null,null,"",null,1,26,26143.200000000001,143.19999999999999,716]
[null,26,"Růžička Ladislav",0,"Hostivař",26,25,712,null,"",null,null,"",null,null,"",null,null,"",null,null,"",null,null,"",null,1,25,25142.400000000001,142.4,712]
[null,27,"Douša Adam",0,"Kačerov",27,24,712,null,"",null,null,"",null,null,"",null,null,"",null,null,"",null,null,"",null,1,24,24142.400000000001,142.4,712]
[null,28,"Bošek Jan",0,"Vršovice",28,23,710,null,"",null,null,"",null,null,"",null,null,"",null,null,"",null,null,"",null,1,23,23142,142,710]
[null,29,"Křikavová Miroslava",0,"Řepy",29,22,709,null,"",null,null,"",null,null,"",null,null,"",null,null,"",null,null,"",null,1,22,22141.8,141.80000000000001,709]
[null,30,"Pecka Jiří",0,"Klíčov",30,21,709,null,"",null,null,"",null,null,"",null,null,"",null,null,"",null,null,"",null,1,21,21141.8,141.80000000000001,709]
[null,31,"Erekt Michal",0,"Řepy",31,20,701,null,"",null,null,"",null,null,"",null,null,"",null,null,"",null,null,"",null,1,20,20140.2,140.19999999999999,701]
[null,32,"Sladovník Miloš",0,"Řepy",32,19,694,null,"",null,null,"",null,null,"",null,null,"",null,null,"",null,null,"",null,1,19,19138.8,138.80000000000001,694]
[null,{"$f":"SUM(B35+1)","v":33},"Čermák Tomáš",{"$f":"IF(AA36<2,0,1)","v":0},"Hostivař",33,{"$f":"IF(F36=\"\",\"\",IF(F36>50,\"\",51-F36))","v":18},694,null,{"$f":"IF(I36=\"\",\"\",IF(I36>50,\"\",51-I36))","v":""},null,null,{"$f":"IF(L36=\"\",\"\",IF(L36>50,\"\",51-L36))","v":""},null,null,{"$f":"IF(O36=\"\",\"\",IF(O36>50,\"\",51-O36))","v":""},null,null,{"$f":"IF(R36=\"\",\"\",IF(R36>50,\"\",51-R36))","v":""},null,null,{"$f":"IF(U36=\"\",\"\",IF(U36>50,\"\",51-U36))","v":""},null,null,{"$f":"IF(X36=\"\",\"\",IF(X36>50,\"\",51-X36))","v":""},null,1,{"$f":"SUM(G36,J36,M36,P36,S36,V36,Y36)","v":18},{"$f":"IF(AB36=0,\"\",SUM(AB36*1000)+AD36)","v":18138.8},{"$f":"IF(AA36=0,\"\",AE36/5)","v":138.80000000000001},{"$f":"IF(AA36=0,\"\",(H36+K36+N36+Q36+T36+W36+Z36)/AA36)","v":694}]
[null,34,"Skružná Pavla",0,"Vršovice",34,17,686,null,"",null,null,"",null,null,"",null,null,"",null,null,"",null,null,"",null,1,17,17137.2,137.19999999999999,686]
[null,35,"Lokvenc Jiří",0,"Klíčov",35,16,684,null,"",null,null,"",null,null,"",null,null,"",null,null,"",null,null,"",null,1,16,16136.8,136.80000000000001,684]
[" ",36,"Křikava Miroslav",0,"Řepy",36,15,681,null,"",null,null,"",null,null,"",null,null,"",null,null,"",null,null,"",null,1,15,15136.2,136.19999999999999,681]
[null,37,"Troller Pavel",0,"Klíčov",37,14,681,null,"",null,null,"",null,null,"",null,null,"",null,null,"",null,null,"",null,1,14,14136.2,136.19999999999999,681]
[null,38,"Křápek Roman",0,"Hostivař",38,13,679,null,"",null,null,"",null,null,"",null,null,"",null,null,"",null,null,"",null,1,13,13135.8,135.80000000000001,679]
[null,39,"Veselý Vlastimil",0,"Vršovice",39,12,675,null,"",null,null,"",null,null,"",null,null,"",null,null,"",null,null,"",null,1,12,12135,135,675]
[null,40,"Červanka Ivan",0,"Řepy",40,11,668,null,"",null,null,"",null,null,"",null,null,"",null,null,"",null,null,"",null,1,11,11133.6,133.6,668]
[null,41,"Mysliveček  Jaroslav",0,"Hostivař",41,10,667,null,"",null,null,"",null,null,"",null,null,"",null,null,"",null,null,"",null,1,10,10133.4,133.4,667]
[null,42,"Alba Vladimír",0,"Řepy",42,9,654,null,"",null,null,"",null,null,"",null,null,"",null,null,"",null,null,"",null,1,9,9130.7999999999993,130.80000000000001,654]
[null,43,"Růžička Václav",0,"Řepy",43,8,653,null,"",null,null,"",null,null,"",null,null,"",null,null,"",null,null,"",null,{"$f":"COUNT(X46,U46,R46,O46,L46,I46,F46)","v":1},8,8130.6,130.6,653]
[null,44,"Kutina Pavel",0,"Kačerov",44,7,651,null,"",null,null,"",null,null,"",null,null,"",null,null,"",null,null,"",null,1,7,7130.2,130.19999999999999,651]
[null,45,"Šafář Vladimír",0,"Hostivař",45,6,622,null,"",null,null,"",null,null,"",null,null,"",null,null,"",null,null,"",null,1,6,6124.4,124.4,622]
[null,46,"Mottl Pavel",0,"Řepy",46,5,621,null,"",null,null,"",null,null,"",null,null,"",null,null,"",null,null,"",null,1,5,5124.2,124.2,621]
[null,47,"Lazurová Jiřina",0,"Hostivař",47,4,606,null,"",null,null,"",null,null,"",null,null,"",null,null,"",null,null,"",null,1,4,4121.2,121.2,606]
[null,48,"Jelínek Jan",0,"Hostivař",48,3,606,null,"",null,null,"",null,null,"",null,null,"",null,null,"",null,null,"",null,1,3,3121.2,121.2,606]
[null,49,"Sehnal Ivan",0,"Řepy",49,2,603,null,"",null,null,"",null,null,"",null,null,"",null,null,"",null,null,"",null,1,2,2120.6,120.6,603]
[null,50,"Neshyba Jaroslav",0,"Klíčov",50,1,587,null,"",null,null,"",null,null,null,null,null,"",null,null,"",null,null,"",null,1,1,1117.4000000000001,117.4,587]
[null,51,"Fay Vlastimil",0,"Vršovice",51,"",585,null,"",null,null,"",null,null,{"$f":"IF(O54=\"\",\"\",IF(O54>50,\"\",51-O54))","v":""},null,null,"",null,null,"",null,null,"",null,1,0,"",117,585]
[null,52,"Novotná Petra",0,"Klíčov",52,"",575,null,"",null,null,"",null,null,"",null,null,"",null,null,"",null,null,"",null,1,0,"",115,575]
[null,53,"Aunický František",0,"Vršovice",53,"",530,null,"",null,null,"",null,null,"",null,null,"",null,null,"",null,null,"",null,1,0,"",106,530]
[null,54,"Doman Marcel",0,"Klíčov",54,"",492,null,"",null,null,"",null,null,"",null,null,"",null,null,"",null,null,"",null,1,0,"",98.4,492]
[null,55,"Leibichová Inke",0,"Vršovice",55,"",433,null,"",null,null,"",null,null,"",null,null,"",null,null,"",null,null,"",null,1,0,"",86.6,433]
[null,56,"Bergerová Marcela",0,"Hostivař",null,"",null,null,"",null,null,"",null,null,"",null,null,"",null,null,"",null,null,"",null,0,0,""]
[null,57,"Kollár Pavel",0,"Hostivař",null,"",null,null,"",null,null,"",null,null,"",null,null,"",null,null,"",null,null,"",null,0,0,""]
[null,58,"Tóth Lubomír",0,"Hostivař",null,"",null,null,"",null,null,null,null,null,null,null,null,"",null,null,"",null,null,"",null,0,0,""]
[null,59,"Zelenková Jitka",0,"Hostivař",null,"",null,null,"",null,null,{"$f":"IF(L62=\"\",\"\",IF(L62>50,\"\",51-L62))","v":""},null,null,{"$f":"IF(O62=\"\",\"\",IF(O62>50,\"\",51-O62))","v":""},null,null,"",null,null,"",null,null,"",null,0,0,""]
[null,60,"Bánovský Jaroslav",0,"Kačerov",null,"",null,null,"",null,null,{"$f":"IF(L63=\"\",\"\",IF(L63>50,\"\",51-L63))","v":""},null,null,{"$f":"IF(O63=\"\",\"\",IF(O63>50,\"\",51-O63))","v":""},null,null,"",null,null,"",null,null,"",null,0,0,""]
[null,61,"Brejcha Jaroslav",0,"Kačerov",null,"",null,null,"",null,null,{"$f":"IF(L64=\"\",\"\",IF(L64>50,\"\",51-L64))","v":""},null,null,{"$f":"IF(O64=\"\",\"\",IF(O64>50,\"\",51-O64))","v":""},null,null,"",null,null,"",null,null,"",null,0,0,""]
[null,62,"Katolický Zdeněk",0,"Kačerov",null,"",null,null,"",null,null,null,null,null,null,null,null,"",null,null,"",null,null,"",null,0,0,""]
[null,63,"Hájek Lukáš",0,"Klíčov",null,"",null,null,"",null,null,{"$f":"IF(L66=\"\",\"\",IF(L66>50,\"\",51-L66))","v":""},null,null,{"$f":"IF(O66=\"\",\"\",IF(O66>50,\"\",51-O66))","v":""},null,null,"",null,null,"",null,null,"",null,0,0,""]
[null,64,"Křemenák Petr",0,"Klíčov",null,"",null,null,"",null,null,{"$f":"IF(L67=\"\",\"\",IF(L67>50,\"\",51-L67))","v":""},null,null,{"$f":"IF(O67=\"\",\"\",IF(O67>50,\"\",51-O67))","v":""},null,null,"",null,null,"",null,null,"",null,0,0,""]
[null,65,"Novotná Jana",{"$f":"IF(AA68<2,0,1)","v":0},"Klíčov",null,{"$f":"IF(F68=\"\",\"\",IF(F68>50,\"\",51-F68))","v":""},null,null,{"$f":"IF(I68=\"\",\"\",IF(I68>50,\"\",51-I68))","v":""},null,null,{"$f":"IF(L68=\"\",\"\",IF(L68>50,\"\",51-L68))","v":""},null,null,{"$f":"IF(O68=\"\",\"\",IF(O68>50,\"\",51-O68))","v":""},null,null,{"$f":"IF(R68=\"\",\"\",IF(R68>50,\"\",51-R68))","v":""},null,null,{"$f":"IF(U68=\"\",\"\",IF(U68>50,\"\",51-U68))","v":""},null,null,{"$f":"IF(X68=\"\",\"\",IF(X68>50,\"\",51-X68))","v":""},null,0,{"$f":"SUM(G68,J68,M68,P68,S68,V68,Y68)","v":0},{"$f":"IF(AB68=0,\"\",SUM(AB68*1000)+AD68)","v":""}]
[null,66,"Novotný Josef",0,"Klíčov",null,null,null,null,null,null,null,null,null,null,null,null,null,null,null,null,"",null,null,"",null,0,0,""]
[null,67,"Pelikán Stanislav",0,"Klíčov",null,{"$f":"IF(F70=\"\",\"\",IF(F70>50,\"\",51-F70))","v":""},null,null,{"$f":"IF(I70=\"\",\"\",IF(I70>50,\"\",51-I70))","v":""},null,null,{"$f":"IF(L70=\"\",\"\",IF(L70>50,\"\",51-L70))","v":""},null,null,{"$f":"IF(O70=\"\",\"\",IF(O70>50,\"\",51-O70))","v":""},null,null,{"$f":"IF(R70=\"\",\"\",IF(R70>50,\"\",51-R70))","v":""},null,null,"",null,null,"",null,0,0,""]
[null,{"$f":"SUM(B70+1)","v":68},"Pipek Pavel",0,"Klíčov",null,"",null,null,"",null,null,"",null,null,"",null,null,"",null,null,"",null,null,"",null,0,0,""]
[null,69,"Pražák Martin",0,"Klíčov",null,"",null,null,"",null,null,"",null,null,"",null,null,"",null,null,"",null,null,"",null,0,0,""]
[null,70,"Svoboda Jan",0,"Klíčov",null,"",null,null,"",null,null,"",null,null,"",null,null,"",null,null,"",null,null,"",null,0,0,""]
[null,71,"Táborský František",0,"Klíčov",null,"",null,null,"",null,null,"",null,null,"",null,null,"",null,null,"",null,null,"",null,0,0,"",null,null," "]
[null,72,"Vychnerová Michala",0,"Klíčov",null,"",null,null,"",null,null,"",null,null,"",null,null,"",null,null,"",null,null,"",null,0,0,""]
[null,73,"Plecháček Miroslav",0,"Řepy",null,"",null,null,"",null,null,"",null,null,"",null,null,"",null,null,"",null,null,"",null,0,0,""]
[null,74,"Tichý Hugo",0,"Řepy",null,"",null,null,"",null,null,"",null,null,"",null,null,"",null,null,"",null,null,"",null,0,0,""]
[null,75,"Hrabě Jan",0,"Vršovice",null,"",null,null,"",null,null,"",null,null,"",null,null,"",null,null,"",null,null,"",null,{"$f":"COUNT(X78,U78,R78,O78,L78,I78,F78)","v":0},0,""]
[null,76,"Kazda Jan",0,"Vršovice",null,"",null,null,"",null,null,"",null,null,"",null,null,"",null,null,"",null,null,"",null,0,0,""]
[null,77,"Kovář Jaroslav",0,"Vršovice",null,"",null,null,"",null,null,"",null,null,"",null,null,"",null,null,"",null,null,"",null,0,0,""]
[null,78,"Krupa Martin",0,"Vršovice",null,"",null,null,"",null,null,"",null,null,"",null,null,"",null,null,"",null,null,"",null,0,0,""]
[null,79,"Krupová Martina",0,"Vršovice",null,"",null,null,"",null,null,"",null,null,"",null,null,"",null,null,"",null,null,"",null,0,0,""]
[null,80,"Kučera Miroslav",0,"Vršovice",null,"",null,null,"",null,null,"",null,null,"",null,null,"",null,null,"",null,null,"",null,0,0,""]
[null,81,"Pavlíček Rudolf",0,"Vršovice",null,"",null,null,"",null,null,"",null,null,"",null,null,"",null,null,"",null,null,"",null,0,0,""]
[null,82,"Pospíšil Lukáš",0,"Vršovice",null,"",null,null,"",null,null,"",null,null,"",null,null,"",null,null,"",null,null,"",null,0,0,""]
[null,83,"Věchtík Antonín",0,"Vršovice",null,"",null,null,"",null,null,"",null,null,"",null,null,"",null,null,"",null,null,"",null,0,0,""]
[null,84,"Svítil Pavel",0,"Hostivař",null,null,null,null,null,null,null,"",null,null,"",null,null,"",null,null,"",null,null,"",null,0,0]
[null,85,"Žalud Miroslav",0,"Kačerov",null,{"$f":"IF(F88=\"\",\"\",IF(F88>50,\"\",51-F88))","v":""},null,null,{"$f":"IF(I88=\"\",\"\",IF(I88>50,\"\",51-I88))","v":""},null,null,"",null,null,"",null,null,"",null,null,"",null,null,"",null,0,0]
[null,86,"Šafář Bohumil",0,"Klíčov",null,"",null,null,"",null,null,"",null,null,"",null,null,"",null,null,"",null,null,"",null,0,0]
[null,87,"Šafrová Martina",0,"Klíčov",null,"",null,null,"",null,null,"",null,null,null,null,null,"",null,null,"",null,null,"",null,0,0]
[null,88,"Táborský Lukáš",0,"Klíčov",null,"",null,null,"",null,null,"",null,null,{"$f":"IF(O91=\"\",\"\",IF(O91>50,\"\",51-O91))","v":""},null,null,"",null,null,"",null,null,"",null,0,0]
[null,89,"Číhal František",0,"Řepy",null,"",null,null,"",null,null,"",null,null,{"$f":"IF(O92=\"\",\"\",IF(O92>50,\"\",51-O92))","v":""},null,null,"",null,null,"",null,null,"",null,0,0]
[null,null,null,0,null,null,"",null,null,"",null,null,"",null,null,{"$f":"IF(O93=\"\",\"\",IF(O93>50,\"\",51-O93))","v":""},null,null,"",null,null,"",null,null,""]
[null,null,null,0,null,null,"",null,null,"",null,null,"",null,null,{"$f":"IF(O94=\"\",\"\",IF(O94>50,\"\",51-O94))","v":""},null,null,"",null,null,"",null,null,""]
[null,null,null,0,null,null,"",null,null,"",null,null,"",null,null,{"$f":"IF(O95=\"\",\"\",IF(O95>50,\"\",51-O95))","v":""},null,null,"",null,null,"",null,null,""]

{"sheet":"garáže","index":1,"n_rows":104,"n_cols":17,"rows_kept":104,"cut":false,"hidden":false,"merged":[]}
[null," jméno","31.1.","28.2.","28.3.","25.4.",null,null,null,"kuželky",null,"průměr",null,"garáž","průměr na 1 hru","průměr na turnaj","zpět"]
["Dejvice","Štěrba Ladislav",{"$f":"zápis!H5","v":0},{"$f":"zápis!N5","v":0},{"$f":"zápis!T5","v":0},{"$f":"zápis!Z5","v":0},{"$f":"zápis!AF5","v":0},{"$f":"zápis!AL5","v":0},{"$f":"zápis!AR5","v":0},{"$f":"SUM(C2:I2)","v":0},{"$f":"zápis!AT5","v":0},{"$f":"IF(K2=0,\"\",J2/K2)","v":""},null,"Kačerov",{"$f":"zápis!$AU$48","v":147.84},{"$f":"IF(O2=\"\",\"\",SUM(O2*5))","v":739.2}]
["Dejvice","Jošt Michal",{"$f":"zápis!H2","v":0},{"$f":"zápis!N2","v":0},{"$f":"zápis!T2","v":0},{"$f":"zápis!Z2","v":0},{"$f":"zápis!AF2","v":0},{"$f":"zápis!AL2","v":0},{"$f":"zápis!AR2","v":0},0,{"$f":"zápis!AT2","v":0},"",null,"Řepy",{"$f":"zápis!$AU$97","v":141.94999999999999},{"$f":"IF(O3=\"\",\"\",SUM(O3*5))","v":709.75}]
["Dejvice","Joštová Alena",{"$f":"zápis!H4","v":0},{"$f":"zápis!N4","v":0},{"$f":"zápis!T4","v":0},{"$f":"zápis!Z4","v":0},{"$f":"zápis!AF4","v":0},{"$f":"zápis!AL4","v":0},{"$f":"zápis!AR4","v":0},0,{"$f":"zápis!AT4","v":0},"",null,"Hostivař",{"$f":"zápis!$AU$31","v":139.24444444444444},{"$f":"IF(O4=\"\",\"\",SUM(O4*5))","v":696.22222222222217}]
["Dejvice","Pěchočová Soňa",{"$f":"zápis!H3","v":0},{"$f":"zápis!N3","v":0},{"$f":"zápis!T3","v":0},{"$f":"zápis!Z3","v":0},{"$f":"zápis!AF3","v":0},{"$f":"zápis!AL3","v":0},{"$f":"zápis!AR3","v":0},0,{"$f":"zápis!AT3","v":0},"",null,"Vršovice",{"$f":"zápis!$AU$120","v":136.47999999999999},{"$f":"IF(O5=\"\",\"\",SUM(O5*5))","v":682.4}]
["Dejvice","Novák Antonín",{"$f":"zápis!H6","v":0},{"$f":"zápis!N6","v":0},{"$f":"zápis!T6","v":0},{"$f":"zápis!Z6","v":0},{"$f":"zápis!AF6","v":0},{"$f":"zápis!AL6","v":0},{"$f":"zápis!AR6","v":0},0,{"$f":"zápis!AT6","v":0},"",null,"Klíčov",{"$f":"zápis!$AU$74","v":136.13999999999999},{"$f":"IF(O6=\"\",\"\",SUM(O6*5))","v":680.69999999999993}]
["Hostivař","Lazur Ladislav",{"$f":"zápis!H19","v":829},{"$f":"zápis!N19","v":0},{"$f":"zápis!T19","v":0},{"$f":"zápis!Z19","v":0},{"$f":"zápis!AF19","v":0},{"$f":"zápis!AL19","v":0},{"$f":"zápis!AR19","v":0},829,{"$f":"zápis!AT19","v":5},165.8,null,"Dejvice"]
["Hostivař","Šafařík Luděk",{"$f":"zápis!H10","v":812},{"$f":"zápis!N10","v":0},{"$f":"zápis!T10","v":0},{"$f":"zápis!Z10","v":0},{"$f":"zápis!AF10","v":0},{"$f":"zápis!AL10","v":0},{"$f":"zápis!AR10","v":0},812,{"$f":"zápis!AT10","v":5},162.4]
["Hostivař","Berger Michal",{"$f":"zápis!H24","v":751},{"$f":"zápis!N24","v":0},{"$f":"zápis!T24","v":0},{"$f":"zápis!Z24","v":0},{"$f":"zápis!AF24","v":0},{"$f":"zápis!AL24","v":0},{"$f":"zápis!AR24","v":0},751,{"$f":"zápis!AT24","v":5},150.19999999999999," "]
["Hostivař","Růžička Ladislav",{"$f":"zápis!H28","v":712},{"$f":"zápis!N28","v":0},{"$f":"zápis!T28","v":0},{"$f":"zápis!Z28","v":0},{"$f":"zápis!AF28","v":0},{"$f":"zápis!AL28","v":0},{"$f":"zápis!AR28","v":0},712,{"$f":"zápis!AT28","v":5},142.4]
["Hostivař","Čermák Tomáš",{"$f":"zápis!H17","v":694},{"$f":"zápis!N17","v":0},{"$f":"zápis!T17","v":0},{"$f":"zápis!Z17","v":0},{"$f":"zápis!AF17","v":0},{"$f":"zápis!AL17","v":0},{"$f":"zápis!AR17","v":0},694,{"$f":"zápis!AT17","v":5},138.80000000000001]
["Hostivař","Křápek Roman",{"$f":"zápis!H15","v":679},{"$f":"zápis!N15","v":0},{"$f":"zápis!T15","v":0},{"$f":"zápis!Z15","v":0},{"$f":"zápis!AF15","v":0},{"$f":"zápis!AL15","v":0},{"$f":"zápis!AR15","v":0},679,{"$f":"zápis!AT15","v":5},135.80000000000001]
["Hostivař","Mysliveček  Jaroslav",{"$f":"zápis!H13","v":667},{"$f":"zápis!N13","v":0},{"$f":"zápis!T13","v":0},{"$f":"zápis!Z13","v":0},{"$f":"zápis!AF13","v":0},{"$f":"zápis!AL13","v":0},{"$f":"zápis!AR13","v":0},667,{"$f":"zápis!AT13","v":5},133.4]
["Hostivař","Šafář Vladimír",{"$f":"zápis!H26","v":622},{"$f":"zápis!N26","v":0},{"$f":"zápis!T26","v":0},{"$f":"zápis!Z26","v":0},{"$f":"zápis!AF26","v":0},{"$f":"zápis!AL26","v":0},{"$f":"zápis!AR26","v":0},622,{"$f":"zápis!AT26","v":5},124.4]
["Hostivař","Jelínek Jan",{"$f":"zápis!H12","v":606},{"$f":"zápis!N12","v":0},{"$f":"zápis!T12","v":0},{"$f":"zápis!Z12","v":0},{"$f":"zápis!AF12","v":0},{"$f":"zápis!AL12","v":0},{"$f":"zápis!AR12","v":0},606,{"$f":"zápis!AT12","v":5},121.2]
["Hostivař","Lazurová Jiřina",{"$f":"zápis!H20","v":606},{"$f":"zápis!N20","v":0},{"$f":"zápis!T20","v":0},{"$f":"zápis!Z20","v":0},{"$f":"zápis!AF20","v":0},{"$f":"zápis!AL20","v":0},{"$f":"zápis!AR20","v":0},606,{"$f":"zápis!AT20","v":5},121.2]
["Hostivař","Kollár Pavel",{"$f":"zápis!H25","v":0},{"$f":"zápis!N25","v":0},{"$f":"zápis!T25","v":0},{"$f":"zápis!Z25","v":0},{"$f":"zápis!AF25","v":0},{"$f":"zápis!AL25","v":0},{"$f":"zápis!AR25","v":0}]
["Hostivař","Zelenková Jitka",{"$f":"zápis!H23","v":0},{"$f":"zápis!N23","v":0},{"$f":"zápis!T23","v":0},{"$f":"zápis!Z23","v":0},{"$f":"zápis!AF23","v":0},{"$f":"zápis!AL23","v":0},{"$f":"zápis!AR23","v":0}]
["Hostivař","Tóth Lubomír",{"$f":"zápis!H29","v":0},{"$f":"zápis!N29","v":0},{"$f":"zápis!T29","v":0},{"$f":"zápis!Z29","v":0},{"$f":"zápis!AF29","v":0},{"$f":"zápis!AL29","v":0},{"$f":"zápis!AR29","v":0}]
["Hostivař","Bergerová Marcela",{"$f":"zápis!H27","v":0},{"$f":"zápis!N27","v":0},{"$f":"zápis!T27","v":0},{"$f":"zápis!Z27","v":0},{"$f":"zápis!AF27","v":0},{"$f":"zápis!AL27","v":0},{"$f":"zápis!AR27","v":0}]
["Hostivař","Svítil Pavel",{"$f":"zápis!H16","v":0},{"$f":"zápis!N16","v":0},{"$f":"zápis!T16","v":0},{"$f":"zápis!Z16","v":0},{"$f":"zápis!AF16","v":0},{"$f":"zápis!AL16","v":0},{"$f":"zápis!AR16","v":0}]
["Hostivař","Jirkovská Iveta",{"$f":"zápis!H14","v":0},{"$f":"zápis!N14","v":0},{"$f":"zápis!T14","v":0},{"$f":"zápis!Z14","v":0},{"$f":"zápis!AF14","v":0},{"$f":"zápis!AL14","v":0},{"$f":"zápis!AR14","v":0}]
["Hostivař","Kačena Martin",{"$f":"zápis!H21","v":0},{"$f":"zápis!N21","v":0},{"$f":"zápis!T21","v":0},{"$f":"zápis!Z21","v":0},{"$f":"zápis!AF21","v":0},{"$f":"zápis!AL21","v":0},{"$f":"zápis!AR21","v":0}]
["Hostivař","Sláma Karel",{"$f":"zápis!H11","v":0},{"$f":"zápis!N11","v":0},{"$f":"zápis!T11","v":0},{"$f":"zápis!Z11","v":0},{"$f":"zápis!AF11","v":0},{"$f":"zápis!AL11","v":0},{"$f":"zápis!AR11","v":0}]
["Kačerov","Mašát Petr",{"$f":"zápis!H36","v":852},{"$f":"zápis!N36","v":0},{"$f":"zápis!T36","v":0},{"$f":"zápis!Z36","v":0},{"$f":"zápis!AF36","v":0},{"$f":"zápis!AL36","v":0},{"$f":"zápis!AR36","v":0},{"$f":"SUM(C25:I25)","v":852},{"$f":"zápis!AT36","v":5},{"$f":"IF(K25=0,\"\",J25/K25)","v":170.4}]
["Kačerov","Brož Stanislav",{"$f":"zápis!H34","v":757},{"$f":"zápis!N34","v":0},{"$f":"zápis!T34","v":0},{"$f":"zápis!Z34","v":0},{"$f":"zápis!AF34","v":0},{"$f":"zápis!AL34","v":0},{"$f":"zápis!AR34","v":0},757,{"$f":"zápis!AT34","v":5},151.4]
["Kačerov","Ondřich František",{"$f":"zápis!H44","v":749},{"$f":"zápis!N44","v":0},{"$f":"zápis!T44","v":0},{"$f":"zápis!Z44","v":0},{"$f":"zápis!AF44","v":0},{"$f":"zápis!AL44","v":0},{"$f":"zápis!AR44","v":0},749,{"$f":"zápis!AT44","v":5},149.80000000000001,null,null,null," "]
["Kačerov","Turek Stanislav",{"$f":"zápis!H39","v":749},{"$f":"zápis!N39","v":0},{"$f":"zápis!T39","v":0},{"$f":"zápis!Z39","v":0},{"$f":"zápis!AF39","v":0},{"$f":"zápis!AL39","v":0},{"$f":"zápis!AR39","v":0},749,{"$f":"zápis!AT39","v":5},149.80000000000001]
["Kačerov","Carvan Pavel",{"$f":"zápis!H33","v":748},{"$f":"zápis!N33","v":0},{"$f":"zápis!T33","v":0},{"$f":"zápis!Z33","v":0},{"$f":"zápis!AF33","v":0},{"$f":"zápis!AL33","v":0},{"$f":"zápis!AR33","v":0},748,{"$f":"zápis!AT33","v":5},149.6]
["Kačerov","Hübner Jiří",{"$f":"zápis!H37","v":737},{"$f":"zápis!N37","v":0},{"$f":"zápis!T37","v":0},{"$f":"zápis!Z37","v":0},{"$f":"zápis!AF37","v":0},{"$f":"zápis!AL37","v":0},{"$f":"zápis!AR37","v":0},737,{"$f":"zápis!AT37","v":5},147.4]
["Kačerov","Tomášek Zdeněk",{"$f":"zápis!H35","v":721},{"$f":"zápis!N35","v":0},{"$f":"zápis!T35","v":0},{"$f":"zápis!Z35","v":0},{"$f":"zápis!AF35","v":0},{"$f":"zápis!AL35","v":0},{"$f":"zápis!AR35","v":0},721,{"$f":"zápis!AT35","v":5},144.19999999999999]
["Kačerov","Radová Petra",{"$f":"zápis!H45","v":716},{"$f":"zápis!N45","v":0},{"$f":"zápis!T45","v":0},{"$f":"zápis!Z45","v":0},{"$f":"zápis!AF45","v":0},{"$f":"zápis!AL45","v":0},{"$f":"zápis!AR45","v":0},716,{"$f":"zápis!AT45","v":5},143.19999999999999]
["Kačerov","Douša Adam",{"$f":"zápis!H38","v":712},{"$f":"zápis!N38","v":0},{"$f":"zápis!T38","v":0},{"$f":"zápis!Z38","v":0},{"$f":"zápis!AF38","v":0},{"$f":"zápis!AL38","v":0},{"$f":"zápis!AR38","v":0},712,{"$f":"zápis!AT38","v":5},142.4]
["Kačerov","Kutina Pavel",{"$f":"zápis!H43","v":651},{"$f":"zápis!N43","v":0},{"$f":"zápis!T43","v":0},{"$f":"zápis!Z43","v":0},{"$f":"zápis!AF43","v":0},{"$f":"zápis!AL43","v":0},{"$f":"zápis!AR43","v":0},651,{"$f":"zápis!AT43","v":5},130.19999999999999]
["Kačerov","Brejcha Jaroslav",{"$f":"zápis!H40","v":0},{"$f":"zápis!N40","v":0},{"$f":"zápis!T40","v":0},{"$f":"zápis!Z40","v":0},{"$f":"zápis!AF40","v":0},{"$f":"zápis!AL40","v":0},{"$f":"zápis!AR40","v":0}]
["Kačerov","Katolický Zdeněk",{"$f":"zápis!H46","v":0},{"$f":"zápis!N46","v":0},{"$f":"zápis!T46","v":0},{"$f":"zápis!Z46","v":0},{"$f":"zápis!AF46","v":0},{"$f":"zápis!AL46","v":0},{"$f":"zápis!AM46","v":0}]
["Kačerov","Bánovský Jaroslav",{"$f":"zápis!H42","v":0},{"$f":"zápis!N42","v":0},{"$f":"zápis!T42","v":0},{"$f":"zápis!Z42","v":0},{"$f":"zápis!AF42","v":0},{"$f":"zápis!AL42","v":0},{"$f":"zápis!AR42","v":0}]
["Kačerov","Žalud Miroslav",{"$f":"zápis!H41","v":0},{"$f":"zápis!N41","v":0},{"$f":"zápis!T41","v":0},{"$f":"zápis!Z41","v":0},{"$f":"zápis!AF41","v":0},{"$f":"zápis!AL41","v":0},{"$f":"zápis!AR41","v":0}]
["Klíčov","Kolář Ladislav",{"$f":"zápis!H69","v":826},{"$f":"zápis!N69","v":0},{"$f":"zápis!T69","v":0},{"$f":"zápis!Z69","v":0},{"$f":"zápis!AF69","v":0},{"$f":"zápis!AL69","v":0},{"$f":"zápis!AR69","v":0},{"$f":"SUM(C39:I39)","v":826},{"$f":"zápis!AT69","v":5},{"$f":"IF(K39=0,\"\",J39/K39)","v":165.2}]
["Klíčov","Štěpán Radek",{"$f":"zápis!H70","v":776},{"$f":"zápis!N70","v":0},{"$f":"zápis!T70","v":0},{"$f":"zápis!Z70","v":0},{"$f":"zápis!AF70","v":0},{"$f":"zápis!AL70","v":0},{"$f":"zápis!AR70","v":0},776,{"$f":"zápis!AT70","v":5},155.19999999999999]
["Klíčov","Novotný Lukáš",{"$f":"zápis!H53","v":755},{"$f":"zápis!N53","v":0},{"$f":"zápis!T53","v":0},{"$f":"zápis!Z53","v":0},{"$f":"zápis!AF53","v":0},{"$f":"zápis!AL53","v":0},{"$f":"zápis!AR53","v":0},755,{"$f":"zápis!AT53","v":5},151]
["Klíčov","Kalfiřt Petr",{"$f":"zápis!H57","v":722},{"$f":"zápis!N57","v":0},{"$f":"zápis!T57","v":0},{"$f":"zápis!Z57","v":0},{"$f":"zápis!AF57","v":0},{"$f":"zápis!AL57","v":0},{"$f":"zápis!AR57","v":0},722,{"$f":"zápis!AT57","v":5},144.4]
["Klíčov","Pecka Jiří",{"$f":"zápis!H56","v":709},{"$f":"zápis!N56","v":0},{"$f":"zápis!T56","v":0},{"$f":"zápis!Z56","v":0},{"$f":"zápis!AF56","v":0},{"$f":"zápis!AL56","v":0},{"$f":"zápis!AR56","v":0},709,{"$f":"zápis!AT56","v":5},141.80000000000001]
["Klíčov","Lokvenc Jiří",{"$f":"zápis!H62","v":684},{"$f":"zápis!N62","v":0},{"$f":"zápis!T62","v":0},{"$f":"zápis!Z62","v":0},{"$f":"zápis!AF62","v":0},{"$f":"zápis!AL62","v":0},{"$f":"zápis!AR62","v":0},684,{"$f":"zápis!AT62","v":5},136.80000000000001]
["Klíčov","Troller Pavel",{"$f":"zápis!H50","v":681},{"$f":"zápis!N50","v":0},{"$f":"zápis!T50","v":0},{"$f":"zápis!Z50","v":0},{"$f":"zápis!AF50","v":0},{"$f":"zápis!AL50","v":0},{"$f":"zápis!AR50","v":0},681,{"$f":"zápis!AT50","v":5},136.19999999999999]
["Klíčov","Neshyba Jaroslav",{"$f":"zápis!H71","v":587},{"$f":"zápis!N71","v":0},{"$f":"zápis!T71","v":0},{"$f":"zápis!Z71","v":0},{"$f":"zápis!AF71","v":0},{"$f":"zápis!AL71","v":0},{"$f":"zápis!AR71","v":0},587,{"$f":"zápis!AT71","v":5},117.4]
["Klíčov","Novotná Petra",{"$f":"zápis!H52","v":575},{"$f":"zápis!N52","v":0},{"$f":"zápis!T52","v":0},{"$f":"zápis!Z52","v":0},{"$f":"zápis!AF52","v":0},{"$f":"zápis!AL52","v":0},{"$f":"zápis!AR52","v":0},575,{"$f":"zápis!AT52","v":5},115]
["Klíčov","Doman Marcel",{"$f":"zápis!H66","v":492},{"$f":"zápis!N66","v":0},{"$f":"zápis!T66","v":0},{"$f":"zápis!Z66","v":0},{"$f":"zápis!AF66","v":0},{"$f":"zápis!AL66","v":0},{"$f":"zápis!AR66","v":0},492,{"$f":"zápis!AT66","v":5},98.4]
["Klíčov","Křemenák Petr",{"$f":"zápis!H64","v":0},{"$f":"zápis!N64","v":0},{"$f":"zápis!T64","v":0},{"$f":"zápis!Z64","v":0},{"$f":"zápis!AF64","v":0},{"$f":"zápis!AL64","v":0},{"$f":"zápis!AR64","v":0}]
["Klíčov","Pelikán Stanislav",{"$f":"zápis!H51","v":0},{"$f":"zápis!N51","v":0},{"$f":"zápis!T51","v":0},{"$f":"zápis!Z51","v":0},{"$f":"zápis!AF51","v":0},{"$f":"zápis!AL51","v":0},{"$f":"zápis!AR51","v":0}]
["Klíčov","Novotný Josef",{"$f":"zápis!H60","v":0},{"$f":"zápis!N60","v":0},{"$f":"zápis!T60","v":0},{"$f":"zápis!Z60","v":0},{"$f":"zápis!AF60","v":0},{"$f":"zápis!AL60","v":0},{"$f":"zápis!AR60","v":0}]
["Klíčov","Křemenák Jakub",{"$f":"zápis!H68","v":0},{"$f":"zápis!N68","v":0},{"$f":"zápis!T68","v":0},{"$f":"zápis!Z68","v":0},{"$f":"zápis!AF68","v":0},{"$f":"zápis!AL68","v":0},{"$f":"zápis!AR68","v":0}]
["Klíčov","Novotná Jana",{"$f":"zápis!H58","v":0},{"$f":"zápis!N58","v":0},{"$f":"zápis!T58","v":0},{"$f":"zápis!Z58","v":0},{"$f":"zápis!AF58","v":0},{"$f":"zápis!AL58","v":0},{"$f":"zápis!AR58","v":0}]
["Klíčov","Hájek Lukáš",{"$f":"zápis!H63","v":0},{"$f":"zápis!N63","v":0},{"$f":"zápis!T63","v":0},{"$f":"zápis!Z63","v":0},{"$f":"zápis!AF63","v":0},{"$f":"zápis!AL63","v":0},{"$f":"zápis!AR63","v":0}]
["Klíčov","Pipek Pavel",{"$f":"zápis!H72","v":0},{"$f":"zápis!N72","v":0},{"$f":"zápis!T72","v":0},{"$f":"zápis!Z72","v":0},{"$f":"zápis!AF72","v":0},{"$f":"zápis!AL72","v":0},{"$f":"zápis!AR72","v":0}]
["Klíčov","Vychnerová Michala",{"$f":"zápis!H65","v":0},{"$f":"zápis!N65","v":0},{"$f":"zápis!T65","v":0},{"$f":"zápis!Z65","v":0},{"$f":"zápis!AF65","v":0},{"$f":"zápis!AL65","v":0},{"$f":"zápis!AR65","v":0}]
["Klíčov","Svoboda Jan",{"$f":"zápis!H67","v":0},{"$f":"zápis!N67","v":0},{"$f":"zápis!T67","v":0},{"$f":"zápis!Z67","v":0},{"$f":"zápis!AF67","v":0},{"$f":"zápis!AL67","v":0},{"$f":"zápis!AR67","v":0}]
["Klíčov","Táborský František",{"$f":"zápis!H55","v":0},{"$f":"zápis!N55","v":0},{"$f":"zápis!T55","v":0},{"$f":"zápis!Z55","v":0},{"$f":"zápis!AF55","v":0},{"$f":"zápis!AL55","v":0},{"$f":"zápis!AR55","v":0}]
["Klíčov","Táborský Lukáš",{"$f":"zápis!H54","v":0},{"$f":"zápis!N54","v":0},{"$f":"zápis!T54","v":0},{"$f":"zápis!Z54","v":0},{"$f":"zápis!AF54","v":0},{"$f":"zápis!AL54","v":0},{"$f":"zápis!AR54","v":0}]
["Klíčov","Šafrová Martina",{"$f":"zápis!H61","v":0},{"$f":"zápis!N61","v":0},{"$f":"zápis!T61","v":0},{"$f":"zápis!Z61","v":0},{"$f":"zápis!AF61","v":0},{"$f":"zápis!AL61","v":0},{"$f":"zápis!AR61","v":0}]
["Klíčov","Šafářová Veronika",{"$f":"zápis!H59","v":0},{"$f":"zápis!N59","v":0},{"$f":"zápis!T59","v":0},{"$f":"zápis!Z59","v":0},{"$f":"zápis!AF59","v":0},{"$f":"zápis!AL59","v":0},{"$f":"zápis!AR59","v":0}]
["Řepy","Kocúr Jaroslav",{"$f":"zápis!H77","v":827},{"$f":"zápis!N77","v":0},{"$f":"zápis!T77","v":0},{"$f":"zápis!Z77","v":0},{"$f":"zápis!AF77","v":0},{"$f":"zápis!AL77","v":0},{"$f":"zápis!AR77","v":0},{"$f":"SUM(C62:I62)","v":827},{"$f":"zápis!AT77","v":5},{"$f":"IF(K62=0,\"\",J62/K62)","v":165.4}]
["Řepy","Dvořák Petr",{"$f":"zápis!H87","v":799},{"$f":"zápis!N87","v":0},{"$f":"zápis!T87","v":0},{"$f":"zápis!Z87","v":0},{"$f":"zápis!AF87","v":0},{"$f":"zápis!AL87","v":0},{"$f":"zápis!AR87","v":0},799,{"$f":"zápis!AT87","v":5},159.80000000000001]
["Řepy","Pospíšil Václav",{"$f":"zápis!H76","v":791},{"$f":"zápis!N76","v":0},{"$f":"zápis!T76","v":0},{"$f":"zápis!Z76","v":0},{"$f":"zápis!AF76","v":0},{"$f":"zápis!AL76","v":0},{"$f":"zápis!AR76","v":0},791,{"$f":"zápis!AT76","v":5},158.19999999999999]
["Řepy","Froněk Martin",{"$f":"zápis!H88","v":772},{"$f":"zápis!N88","v":0},{"$f":"zápis!T88","v":0},{"$f":"zápis!Z88","v":0},{"$f":"zápis!AF88","v":0},{"$f":"zápis!AL88","v":0},{"$f":"zápis!AR88","v":0},772,{"$f":"zápis!AT88","v":5},154.4]
["Řepy","Erekt Stanislav",{"$f":"zápis!H93","v":761},{"$f":"zápis!N93","v":0},{"$f":"zápis!T93","v":0},{"$f":"zápis!Z93","v":0},{"$f":"zápis!AF93","v":0},{"$f":"zápis!AL93","v":0},{"$f":"zápis!AR93","v":0},761,{"$f":"zápis!AT93","v":5},152.19999999999999]
["Řepy","Kročil Tomáš",{"$f":"zápis!H83","v":721},{"$f":"zápis!N83","v":0},{"$f":"zápis!T83","v":0},{"$f":"zápis!Z83","v":0},{"$f":"zápis!AF83","v":0},{"$f":"zápis!AL83","v":0},{"$f":"zápis!AR83","v":0},721,{"$f":"zápis!AT83","v":5},144.19999999999999]
["Řepy","Křikavová Miroslava",{"$f":"zápis!H94","v":709},{"$f":"zápis!N94","v":0},{"$f":"zápis!T94","v":0},{"$f":"zápis!Z94","v":0},{"$f":"zápis!AF94","v":0},{"$f":"zápis!AL94","v":0},{"$f":"zápis!AR94","v":0},709,{"$f":"zápis!AT94","v":5},141.80000000000001]
["Řepy","Erekt Michal",{"$f":"zápis!H91","v":701},{"$f":"zápis!N91","v":0},{"$f":"zápis!T91","v":0},{"$f":"zápis!Z91","v":0},{"$f":"zápis!AF91","v":0},{"$f":"zápis!AL91","v":0},{"$f":"zápis!AR91","v":0},701,{"$f":"zápis!AT91","v":5},140.19999999999999]
["Řepy","Sladovník Miloš",{"$f":"zápis!H80","v":694},{"$f":"zápis!N80","v":0},{"$f":"zápis!T80","v":0},{"$f":"zápis!Z80","v":0},{"$f":"zápis!AF80","v":0},{"$f":"zápis!AL80","v":0},{"$f":"zápis!AR80","v":0},694,{"$f":"zápis!AT80","v":5},138.80000000000001]
["Řepy","Křikava Miroslav",{"$f":"zápis!H86","v":681},{"$f":"zápis!N86","v":0},{"$f":"zápis!T86","v":0},{"$f":"zápis!Z86","v":0},{"$f":"zápis!AF86","v":0},{"$f":"zápis!AL86","v":0},{"$f":"zápis!AR86","v":0},681,{"$f":"zápis!AT86","v":5},136.19999999999999]
["Řepy","Červenka Ivan",{"$f":"zápis!H95","v":668},{"$f":"zápis!N95","v":0},{"$f":"zápis!T95","v":0},{"$f":"zápis!Z95","v":0},{"$f":"zápis!AF95","v":0},{"$f":"zápis!AL95","v":0},{"$f":"zápis!AR95","v":0},668,{"$f":"zápis!AT95","v":5},133.6]
["Řepy","Alba Vladimír",{"$f":"zápis!H84","v":654},{"$f":"zápis!N84","v":0},{"$f":"zápis!T84","v":0},{"$f":"zápis!Z84","v":0},{"$f":"zápis!AF84","v":0},{"$f":"zápis!AL84","v":0},{"$f":"zápis!AR84","v":0},654,{"$f":"zápis!AT84","v":5},130.80000000000001]
["Řepy","Růžička Václav",{"$f":"zápis!H90","v":653},{"$f":"zápis!N90","v":0},{"$f":"zápis!T90","v":0},{"$f":"zápis!Z90","v":0},{"$f":"zápis!AF90","v":0},{"$f":"zápis!AL90","v":0},{"$f":"zápis!AR90","v":0},653,{"$f":"zápis!AT90","v":5},130.6]
["Řepy","Mottl Pavel",{"$f":"zápis!H81","v":621},{"$f":"zápis!N81","v":0},{"$f":"zápis!T81","v":0},{"$f":"zápis!Z81","v":0},{"$f":"zápis!AF81","v":0},{"$f":"zápis!AL81","v":0},{"$f":"zápis!AR81","v":0},621,{"$f":"zápis!AT81","v":5},124.2]
["Řepy","Sehnal Ivan",{"$f":"zápis!H78","v":603},{"$f":"zápis!N78","v":0},{"$f":"zápis!T78","v":0},{"$f":"zápis!Z78","v":0},{"$f":"zápis!AF78","v":0},{"$f":"zápis!AL78","v":0},{"$f":"zápis!AR78","v":0},603,{"$f":"zápis!AT78","v":5},120.6]
["Řepy","Tichý Hugo",{"$f":"zápis!H85","v":0},{"$f":"zápis!N85","v":0},{"$f":"zápis!T85","v":0},{"$f":"zápis!Z85","v":0},{"$f":"zápis!AF85","v":0},{"$f":"zápis!AL85","v":0},{"$f":"zápis!AR85","v":0}]
["Řepy","Plecháček Miroslav",{"$f":"zápis!H79","v":0},{"$f":"zápis!N79","v":0},{"$f":"zápis!T79","v":0},{"$f":"zápis!Z79","v":0},{"$f":"zápis!AF79","v":0},{"$f":"zápis!AL79","v":0},{"$f":"zápis!AR79","v":0}]
["Řepy","Číhal František",{"$f":"zápis!H82","v":0},{"$f":"zápis!N82","v":0},{"$f":"zápis!T82","v":0},{"$f":"zápis!Z82","v":0},{"$f":"zápis!AF82","v":0},{"$f":"zápis!AL82","v":0},{"$f":"zápis!AR82","v":0}]
["Řepy","Fidler Slávek",{"$f":"zápis!H89","v":0},{"$f":"zápis!N89","v":0},{"$f":"zápis!T89","v":0},{"$f":"zápis!Z89","v":0},{"$f":"zápis!AF89","v":0},{"$f":"zápis!AL89","v":0},{"$f":"zápis!AR89","v":0}]
["Řepy","Piešťanský Josef",{"$f":"zápis!H92","v":0},{"$f":"zápis!N92","v":0},{"$f":"zápis!T92","v":0},{"$f":"zápis!Z92","v":0},{"$f":"zápis!AF92","v":0},{"$f":"zápis!AL92","v":0},{"$f":"zápis!AR92","v":0}]
["Vršovice","Podhola Martin",{"$f":"zápis!H110","v":857},{"$f":"zápis!N110","v":0},{"$f":"zápis!T110","v":0},{"$f":"zápis!Z110","v":0},{"$f":"zápis!AF110","v":0},{"$f":"zápis!AL110","v":0},{"$f":"zápis!AR110","v":0},{"$f":"SUM(C82:I82)","v":857},{"$f":"zápis!AT110","v":5},{"$f":"IF(K82=0,\"\",J82/K82)","v":171.4}]
["Vršovice","Krupa Jozef",{"$f":"zápis!H99","v":844},{"$f":"zápis!N99","v":0},{"$f":"zápis!T99","v":0},{"$f":"zápis!Z99","v":0},{"$f":"zápis!AF99","v":0},{"$f":"zápis!AL99","v":0},{"$f":"zápis!AR99","v":0},844,{"$f":"zápis!AT99","v":5},168.8]
["Vršovice","Leibich František",{"$f":"zápis!H107","v":756},{"$f":"zápis!N107","v":0},{"$f":"zápis!T107","v":0},{"$f":"zápis!Z107","v":0},{"$f":"zápis!AF107","v":0},{"$f":"zápis!AL107","v":0},{"$f":"zápis!AR107","v":0},756,{"$f":"zápis!AT107","v":5},151.19999999999999]
["Vršovice","Holkup Jan",{"$f":"zápis!H111","v":748},{"$f":"zápis!N111","v":0},{"$f":"zápis!T111","v":0},{"$f":"zápis!Z111","v":0},{"$f":"zápis!AF111","v":0},{"$f":"zápis!AL111","v":0},{"$f":"zápis!AR111","v":0},748,{"$f":"zápis!AT111","v":5},149.6]
["Vršovice","Bošek Jan",{"$f":"zápis!H116","v":710},{"$f":"zápis!N116","v":0},{"$f":"zápis!T116","v":0},{"$f":"zápis!Z116","v":0},{"$f":"zápis!AF116","v":0},{"$f":"zápis!AL116","v":0},{"$f":"zápis!AR116","v":0},710,{"$f":"zápis!AT116","v":5},142]
["Vršovice","Skružná Pavla",{"$f":"zápis!H103","v":686},{"$f":"zápis!N103","v":0},{"$f":"zápis!T103","v":0},{"$f":"zápis!Z103","v":0},{"$f":"zápis!AF103","v":0},{"$f":"zápis!AL103","v":0},{"$f":"zápis!AR103","v":0},686,{"$f":"zápis!AT103","v":5},137.19999999999999]
["Vršovice","Veselý Vlastimil",{"$f":"zápis!H108","v":675},{"$f":"zápis!N108","v":0},{"$f":"zápis!T108","v":0},{"$f":"zápis!Z108","v":0},{"$f":"zápis!AF108","v":0},{"$f":"zápis!AL108","v":0},{"$f":"zápis!AR108","v":0},675,{"$f":"zápis!AT108","v":5},135]
["Vršovice","Fay Vlastimil",{"$f":"zápis!H115","v":585},{"$f":"zápis!N115","v":0},{"$f":"zápis!T115","v":0},{"$f":"zápis!Z115","v":0},{"$f":"zápis!AF115","v":0},{"$f":"zápis!AL115","v":0},{"$f":"zápis!AR115","v":0},585,{"$f":"zápis!AT115","v":5},117]
["Vršovice","Aunický František",{"$f":"zápis!H104","v":530},{"$f":"zápis!N104","v":0},{"$f":"zápis!T104","v":0},{"$f":"zápis!Z104","v":0},{"$f":"zápis!AF104","v":0},{"$f":"zápis!AL104","v":0},{"$f":"zápis!AR104","v":0},530,{"$f":"zápis!AT104","v":5},106]
["Vršovice","Leibichová Inke",{"$f":"zápis!H106","v":433},{"$f":"zápis!N106","v":0},{"$f":"zápis!T106","v":0},{"$f":"zápis!Z106","v":0},{"$f":"zápis!AF106","v":0},{"$f":"zápis!AL106","v":0},{"$f":"zápis!AR106","v":0},433,{"$f":"zápis!AT106","v":5},86.6]
["Vršovice","Věchtík Antonín",{"$f":"zápis!H109","v":0},{"$f":"zápis!N109","v":0},{"$f":"zápis!T109","v":0},{"$f":"zápis!Z109","v":0},{"$f":"zápis!AF109","v":0},{"$f":"zápis!AL109","v":0},{"$f":"zápis!AR109","v":0}]
["Vršovice","Kučera Miroslav",{"$f":"zápis!H113","v":0},{"$f":"zápis!N113","v":0},{"$f":"zápis!T113","v":0},{"$f":"zápis!Z113","v":0},{"$f":"zápis!AF113","v":0},{"$f":"zápis!AL113","v":0},{"$f":"zápis!AR113","v":0}]
["Vršovice","Kovář Jaroslav",{"$f":"zápis!H114","v":0},{"$f":"zápis!N114","v":0},{"$f":"zápis!T114","v":0},{"$f":"zápis!Z114","v":0},{"$f":"zápis!AF114","v":0},{"$f":"zápis!AL114","v":0},{"$f":"zápis!AR114","v":0}]
["Vršovice","Krupová Martina",{"$f":"zápis!H101","v":0},{"$f":"zápis!N101","v":0},{"$f":"zápis!T101","v":0},{"$f":"zápis!Z101","v":0},{"$f":"zápis!AF101","v":0},{"$f":"zápis!AL101","v":0},{"$f":"zápis!AR101","v":0}]
["Vršovice","Hrabě Jan",{"$f":"zápis!H118","v":0},{"$f":"zápis!N118","v":0},{"$f":"zápis!T118","v":0},{"$f":"zápis!Z118","v":0},{"$f":"zápis!AF118","v":0},{"$f":"zápis!AL118","v":0},{"$f":"zápis!AR118","v":0}]
["Vršovice","Pavlíček Rudolf",{"$f":"zápis!H117","v":0},{"$f":"zápis!N117","v":0},{"$f":"zápis!T117","v":0},{"$f":"zápis!Z117","v":0},{"$f":"zápis!AF117","v":0},{"$f":"zápis!AL117","v":0},{"$f":"zápis!AR117","v":0}]
["Vršovice","Krupa Martin",{"$f":"zápis!H102","v":0},{"$f":"zápis!N102","v":0},{"$f":"zápis!T102","v":0},{"$f":"zápis!Z102","v":0},{"$f":"zápis!AF102","v":0},{"$f":"zápis!AL102","v":0},{"$f":"zápis!AR102","v":0}]
["Vršovice","Pospíšil Lukáš",{"$f":"zápis!H100","v":0},{"$f":"zápis!N100","v":0},{"$f":"zápis!T100","v":0},{"$f":"zápis!Z100","v":0},{"$f":"zápis!AF100","v":0},{"$f":"zápis!AL100","v":0},{"$f":"zápis!AR100","v":0}]
["Vršovice","Kazda Jan",{"$f":"zápis!H105","v":0},{"$f":"zápis!N105","v":0},{"$f":"zápis!T105","v":0},{"$f":"zápis!Z105","v":0},{"$f":"zápis!AF105","v":0},{"$f":"zápis!AL105","v":0},{"$f":"zápis!AR105","v":0}]
["Vršovice","Pokorný Josef",{"$f":"zápis!H112","v":0},{"$f":"zápis!N112","v":0},{"$f":"zápis!T112","v":0},{"$f":"zápis!Z112","v":0},{"$f":"zápis!AF112","v":0},{"$f":"zápis!AL112","v":0},{"$f":"zápis!AR112","v":0}]
[]
[]
[null,null,null,null,null,null,null,null,null,null,null,null,null,null," "]

{"sheet":"stat. celkem","index":2,"n_rows":58,"n_cols":193,"rows_kept":58,"cut":false,"hidden":false,"merged":[[0,179,2,179],[0,180,0,193],[1,180,2,181],[1,183,2,184],[1,186,2,187],[1,189,2,190],[1,192,2,193],[1,154,2,155],[1,157,2,158],[0,153,2,153],[1,163,2,164],[0,154,0,167],[1,160,2,161],[1,166,2,167],[1,128,2,129],[1,108,2,109],[0,50,0,63],[0,76,0,89],[1,56,2,57],[1,59,2,60],[1,79,2,80],[1,82,2,83],[1,85,2,86],[1,88,2,89],[1,24,2,25],[1,76,2,77],[1,140,2,141],[1,102,2,103],[1,105,2,106],[1,131,2,132],[1,134,2,135],[1,137,2,138],[1,114,2,115],[0,127,2,127],[1,111,2,112],[0,102,0,115],[0,128,0,141],[1,36,2,37],[0,49,2,49],[0,75,2,75],[0,101,2,101],[1,62,2,63],[1,50,2,51],[1,53,2,54],[1,33,2,34],[0,1,0,16],[0,23,2,23],[11,10,11,15],[7,10,7,15],[3,10,3,15],[1,27,2,28],[4,18,6,18],[1,30,2,31],[0,24,0,37],[27,10,27,15],[1,1,2,2],[1,4,2,5],[1,7,2,8],[1,10,1,16],[23,10,23,15],[19,10,19,15],[2,10,2,12],[2,14,2,16],[15,10,15,15]]}
[null,"        ZE VŠECH TURNAJŮ   2015                                                            jednotlivé turnaje          ",null,null,null,null,null,null,null,null,null,null,null,null,null,null,null,null,null,null,null,null,null,"ZPĚT","31.1.  2015  PV-OSZO DP-A ",null,null,null,null,null,null,null,null,null,null,null,null,null,null,null,null,null,null,null,null,null,null,null,null,"ZPĚT","28.2.2015   KLÍČOV",null,null,null,null,null,null,null,null,null,null,null,null,null,null,null,null,null,null,null,null,null,null,null,null,"ZPĚT","28.3.2015   ŘEPY",null,null,null,null,null,null,null,null,null,null,null,null,null,null,null,null,null,null,null,null,null,null,null,null,"ZPĚT","25.4.2015   HOSTIVAŘ",null,null,null,null,null,null,null,null,null,null,null,null,null,null,null,null,null,null,null,null,null,null,null,null,"ZPĚT","_._.2015   KAČEROV",null,null,null,null,null,null,null,null,null,null,null,null,null,null,null,null,null,null,null,null,null,null,null,null,"ZPĚT","_._.2015   VRŠOVICE",null,null,null,null,null,null,null,null,null,null,null,null,null,null,null,null,null,null,null,null,null,null,null,null,"ZPĚT","_._.2015   POHÁR GENERÁLNÍHO ŘEDITELE - DP"]
[null,"25                                      nejvyšších náhozů",null,null,"25                                      nejnižších náhozů",null,null,"25                                      nejvyšších průměrů",null,"turnaje","umístnění v jednotlivých turnajích",null,null,null,null,null,null,null,null,null,null,null,null,null,"nejvyšší nához jednotlivce",null,null,"nejnižší nához jednotlivce",null,null,"25                                      nejvyšších náhozů",null,null,"25                                      nejnižších náhozů",null,null,"25                                      nejvyšších náhozů            na turnaj",null,null,null,null,null,null,null,null,null,null,null,null,null,"nejvyšší nához jednotlivce",null,null,"nejnižší nához jednotlivce",null,null,"25                                      nejvyšších náhozů",null,null,"25                                      nejnižších náhozů",null,null,"25                                      nejvyšších náhozů            na turnaj",null,null,null,null,null,null,null,null,null,null,null,null,null,"nejvyšší nához jednotlivce",null,null,"nejnižší nához jednotlivce",null,null,"25                                      nejvyšších náhozů",null,null,"25                                      nejnižších náhozů",null,null,"25                                      nejvyšších náhozů            na turnaj",null,null,null,null,null,null,null,null,null,null,null,null,null,"nejvyšší nához jednotlivce",null,null,"nejnižší nához jednotlivce",null,null,"25                                      nejvyšších náhozů",null,null,"25                                      nejnižších náhozů",null,null,"25                                      nejvyšších náhozů            na turnaj",null,null,null,null,null,null,null,null,null,null,null,null,null,"nejvyšší nához jednotlivce",null,null,"nejnižší nához jednotlivce",null,null,"25                                      nejvyšších náhozů",null,null,"25                                      nejnižších náhozů",null,null,"25                                      nejvyšších náhozů            na turnaj",null,null,null,null,null,null,null,null,null,null,null,null,null,"nejvyšší nához jednotlivce",null,null,"nejnižší nához jednotlivce",null,null,"25                                      nejvyšších náhozů",null,null,"25                                      nejnižších náhozů",null,null,"25                                      nejvyšších náhozů            na turnaj",null,null,null,null,null,null,null,null,null,null,null,null,null,"nejvyšší nához jednotlivce",null,null,"nejnižší nához jednotlivce",null,null,"25                                      nejvyšších náhozů",null,null,"25                                      nejnižších náhozů",null,null,"25                                      nejvyšších náhozů            na turnaj"]
[null,null,null," ",null,null,null,null,null,"jednotlivci","družstva",null,null,null,"jednotlivci",null,null,null,null,null,null,null,null,null,null,null,null,null,null,null,null,null," ",null,null,null,null,null,null,null,null,null,null,null,null,null,null,null,null,null,null,null,null,null,null,null,null,null," ",null,null,null,null,null,null,null,null,null,null,null,null,null,null,null,null,null,null,null,null,null,null,null,null,null," ",null,null,null,null,null,null,null,null,null,null,null,null,null,null,null,null,null,null,null,null,null,null,null,null,null," ",null,null,null,null,null,null,null,null,null,null,null,null,null,null,null,null,null,null,null,null,null,null,null,null,null," ",null,null,null,null,null,null,null,null,null,null,null,null,null,null,null,null,null,null,null,null,null,null,null,null,null," ",null,null,null,null,null,null,null,null,null,null,null,null,null,null,null,null,null,null,null,null,null,null,null,null,null," "]
[null,null,null,null,null,null,null,null,null,null,"PV-OSZO DP-A    31.1.2015",null,null,null,null,null,"klikni",null,null,null,null,null,null,null,"Lazur Michal",223,null,"Mašát Petr",160,null,"Lazur Michal",223,null,"Liebichová Inke",69,null,"Podhola Martin",857]
[null,null,null,null,null,null,null,null,null,null,"1. místo","Vršovice",3891,null,"1. místo","Podhola Martin",857,null,null,null,null,null,null,null,"Kolář Ladislav",217,null,"Kocůr Jaroslav",154,null,"Kolář Ladislav",217,null,"Aunický Ftantišek",77,null,"Mašát Petr",852]
[null,null,null,null,null,null,null,null,null,null,"2. místo","Řepy",3853,null,"2. místo","Mašát Petr",852,null,null,null,null,null,null,null,"Podhola Martin",207,null,"Pospíšil Václav",144,null,"Podhola Martin",207,null,"Liebichová Inke",77,null,"Krupa Jozef",844]
[null,null,null,null,null,null,null,null,null,null,"3. místo","Kačerov",3835,null,"3. místo","Krupa Jozef",844,null,null,null,null,null,null,null,"Krupa Jozef",202,null,"Lazur Michal",139,null,"Froněk Martin",202,null,"Doman Marcel",87,null,"Lazur Michal",829]
[null,null,null,null,null,null,null,null,null,null,"KLÍČOV    28.2.2015",null,null,null,null,null,"klikni",null,null,null,null,null,null,null,"Froněk Martin",202,null,"Novotný Lukáš",139,null,"Krupa Jozef",202,null,"Liebichová Inke",89,null,"Kocůr Jaroslav",827]
[null,null,null,null,null,null,null,null,null,null,"1. místo",null,null,null,"1. místo",null,null,null,null,null,null,null,null,null,"Pospíšil Václav",199,null,"Šafařík Luděk",138,null,"Pospíšil Václav",199,null,"Liebichová Inke",90,null,"Kolář Ladislav",826]
[null,null,null,null,null,null,null,null,null,null,"2. místo",null,null,null,"2. místo",null,null,null,null,null,null,null,null,null,"Ekert Stanislav",194,null,"Liebich František",137,null,"Ekert Stanislav",194,null,"Doman Marcel",90,null,"Šafařík Luděk",812]
[null,null,null,null,null,null,null,null,null,null,"3. místo",null,null,null,"3. místo",null,null,null,null,null,null,null,null,null,"Mašát Petr",192,null,"Krupa Jozef",135,null,"Mašát Petr",192,null,"Holkup Jan",91,null,"Dvořák Petr",799]
[null,null,null,null,null,null,null,null,null,null,"ŘEPY    28.3.2015",null,null,null,null,null,"klikni",null,null,null,null,null,null,null,"Růžička Ladislav",190,null,"Podhola Martin",133,null,"Růžička Ladislav",190,null,"Novotná Petra",91,null,"Pospíšil Václav",791]
[null,null,null,null,null,null,null,null,null,null,"1. místo",null,null,null,"1. místo",null,null,null,null,null,null,null,null,null,"Holkup Jan",190,null,"Brož Stanislav",132,null,"Holkup Jan",190,null,"Doman Marcel",93,null,"Štěpánek Radek",776]
[null,null,null,null,null,null,null,null,null,null,"2. místo",null,null,null,"2. místo",null,null,null,null,null,null,null,null,null,"Dvořák Petr",187,null,"Štěpánek Radek",129,null,"Krupa Jozef",188,null,"Neshyba Jaroslav",94,null,"Froněk Martin",772]
[null,null,null,null,null,null,null,null,null,null,"3. místo",null,null,null,"3. místo",null,null,null,null,null,null,null,null,null,"Šafařík Luděk",186,null,"Ekert Stanislav",129,null,"Dvořák Petr",187,null,"Aunický Ftantišek",94,null,"Ekert Stanislav",761]
[null,null,null,null,null,null,null,null,null,null,"HOSTIVAŘ     25.4.2015",null,null,null,null,null,"klikni",null,null,null,null,null,null,null,"Berger Michal",185,null,"Křápek Roman",128,null,"Šafařík Luděk",186,null,"Fay Vlastimil",97,null,"Brož Stanislav",757]
[null,null,null,null,null,null,null,null,null,null,"1. místo",null,null,null,"1. místo",null,null,null,null,null,null,null,null,null,"Carvan Pavel",183,null,"Kolář Ladislav",128,null,"Berger Michal",185,null,"Neshyba Jaroslav",97,null,"Liebich František",756]
[null,null,null,null,null,null,null,null,null,null,"2. místo",null,null,null,"2. místo",null,null,null,null,null,null,null,null,null,"Radová Petra",183,null,"Troller Pavel",128,null,"Radová Petra",183,null,"Kutina Pavel",99,null,"Novotný Lukáš",755]
[null,null,null,null,null,null,null,null,null,null,"3. místo",null,null,null,"3. místo",null,null,null,null,null,null,null,null,null,"Kocůr Jaroslav",180,null,"Hübner Jiří",127,null,"Carvan Pavel",183,null,"Doman Marcel",99,null,"Berger Michal",751]
[null,null,null,null,null,null,null,null,null,null,"KAČEROV     _._.20145",null,null,null,null,null,"klikni",null,null,null,null,null,null,null,"Hübner Jiří",177,null,"Kalfiřt Petr",126,null,"Kocůr Jaroslav",180,null,"Novotná Petra",99,null,"Ondřich František",749]
[null,null,null,null,null,null,null,null,null,null,"1. místo",null,null,null,"1. místo",null,null,null,null,null,null,null,null,null,"Turek Stanislav",177,null,"Pecka Jiří",125,null,"Podhola Martin",179,null,"Turek Stanislav",100,null,"Turek Stanislav",749]
[null,null,null,null,null,null,null,null,null,null,"2. místo",null,null,null,"2. místo",null,null,null,null,null,null,null,null,null,"Veselý Vlastimil",176,null,"Dvořák Petr",125,null,"Šafařík Luděk",178,null,"Tomášek Zdeněk",101,null,"Carvan Pavel",748]
[null,null,null,null,null,null,null,null,null,null,"3. místo",null,null,null,"3. místo",null,null,null,null,null,null,null,null,null,"Sladovník Miloslav",176,null,"Lokvenc Jiří",122,null,"Hübner Jiří",177,null,"Alba Vladimír",103,null,"Holkup Jan",748]
[null,null,null,null,null,null,null,null,null,null,"VRŠOVICE     _._.2015",null,null,null,null,null,"klikni",null,null,null,null,null,null,null,"Ondřich František",175,null,"Šafář Ladislav",121,null,"Turek Stanislav",177,null,"Lazurová Jiřina",103,null,"Hübner Jiří",737]
[null,null,null,null,null,null,null,null,null,null,"1. místo",null,null,null,"1. místo",null,null,null,null,null,null,null,null,null,"Křikavová Miroslava",175,null,"Ekert Michal",121,null,"Veselý Vlastimil",176,null,"Sehnal Ivan",104,null,"Kalfiřt Petr",722]
[null,null,null,null,null,null,null,null,null,null,"2. místo",null,null,null,"2. místo",null,null,null,null,null,null,null,null,null,"Brož Stanislav",174,null,"Douša Adam",119,null,"Sladovník Miloslav",176,null,"Růžička Václav",104,null,"Tomášek Zdeněk",721]
[null,null,null,null,null,null,null,null,null,null,"3. místo",null,null,null,"3. místo",null,null,null,null,null,null,null,null,null,"Douša Adam",173,null,"Ondřich František",119,null,"Podhola Martin",176,null,"Aunický Ftantišek",104,null,"Kročil Tomáš",721]
[null,null,null,null,null,null,null,null,null,null,"POHÁR GENERÁLNÍHO ŘEDITELE",null,null,null,null,null,"klikni",null,null,null,null,null,null,null,"Liebich František",171,null,"Bošek Jan",119,null,"Kolář Ladislav",176,null,"Lazurová Jiřina",105,null,"Radová Petra",716]
[null,null,null,null,null,null,null,null,null,null,"1. místo",null,null,null,"1. místo",null,null,null,null,null,null,null,null,null,"Štěpánek Radek",170,null,"Křikava Miroslav",119]
[null,null,null,null,null,null,null,null,null,null,"2. místo",null,null,null,"2. místo",null,null,null,null,null,null,null,null,null,"Tomášek Zdeněk",169,null,"Radová Petra",118]
[null,null,null,null,null,null,null,null,null,null,"3. místo",null,null,null,"3. místo",null,null,null,null,null,null,null,null,null,"Kročil Tomáš",169,null,"Froněk Martin",116]
[null,null,null,null,null,null,null,null,null,null,null,null,null,null,null,null,null,null,null,null,null,null,null,null,"Kutina Pavel",168,null,"Berger Michal",115]
[null,null,null,null,null,null,null,null,null,null,null,null,null,null,null,null,null,null,null,null,null,null,null,null,"Čermák Tomáš",168,null,"Růžička Ladislav",115]
[null,null,null,null,null,null,null,null,null,null,null,null,null,null,null,null,null,null,null,null,null,null,null,null,"Růžička Václav",167,null,"Veselý Vlastimil",115]
[null,null,null,null,null,null,null,null,null,null,null,null,null,null,null,null,null,null,null,null,null,null,null,null,"Bošek Jan",166,null,"Carvan Pavel",113]
[null,null,null,null,null,null,null,null,null,null,null,null,null,null,null,null,null,null,null,null,null,null,null,null,"Ekert Michal",165,null,"Mysliveček Jaroslav",113]
[null,null,null,null,null,null,null,null,null,null,null,null,null,null,null,null,null,null,null,null,null,null,null,null,"Novotný Lukáš",163,null,"Kročil Tomáš",112]
[null,null,null,null,null,null,null,null,null,null,null,null,null,null,null,null,null,null,null,null,null,null,null,null,"Skružná Pavla",161,null,"Křikavová Miroslava",112]
[null,null,null,null,null,null,null,null,null,null,null,null,null,null,null,null,null,null,null,null,null,null,null,null,"Červenka Ivan",161,null,"Jelínek Jan",111]
[null,null,null,null,null,null,null,null,null,null,null,null,null,null,null,null,null,null,null,null,null,null,null,null,"Křápek Roman",160,null,"Mottl Pavel",111]
[null,null,null,null,null,null,null,null,null,null,null,null,null,null,null,null,null,null,null,null,null,null,null,null,"Mysliveček Jaroslav",159,null,"Sladovník Miloslav",111]
[null,null,null,null,null,null,null,null,null,null,null,null,null,null,null,null,null,null,null,null,null,null,null,null,"Kalfiřt Petr",159,null,"Čermák Tomáš",110]
[null,null,null,null,null,null,null,null,null,null,null,null,null,null,null,null,null,null,null,null,null,null,null,null,"Křikava Miroslav",156,null,"Skružná Pavla",109]
[null,null,null,null,null,null,null,null,null,null,null,null,null,null,null,null,null,null,null,null,null,null,null,null,"Pecka Jiří",154,null,"Červenka Ivan",108]
[null,null,null,null,null,null,null,null,null,null,null,null,null,null,null,null,null,null,null,null,null,null,null,null,"Lokvenc Jiří",148,null,"Růžička Václav",104]
[null,null,null,null,null,null,null,null,null,null,null,null,null,null,null,null,null,null,null,null,null,null,null,null,"Troller Pavel",148,null,"Sehnal Ivan",104]
[null,null,null,null,null,null,null,null,null,null,null,null,null,null,null,null,null,null,null,null,null,null,null,null,"Alba Vladimír",148,null,"Lazurová Jiřina",103]
[null,null,null,null,null,null,null,null,null,null,null,null,null,null,null,null,null,null,null,null,null,null,null,null,"Mottl Pavel",146,null,"Alba Vladimír",103]
[null,null,null,null,null,null,null,null,null,null,null,null,null,null,null,null,null,null,null,null,null,null,null,null,"Novotná Petra",145,null,"Tomášek Zdeněk",101]
[null,null,null,null,null,null,null,null,null,null,null,null,null,null,null,null,null,null,null,null,null,null,null,null,"Neshyba Jaroslav",144,null,"Turek Stanislav",100]
[null,null,null,null,null,null,null,null,null,null,null,null,null,null,null,null,null,null,null,null,null,null,null,null,"Lazurová Jiřina",141,null,"Kutina Pavel",99]
[null,null,null,null,null,null,null,null,null,null,null,null,null,null,null,null,null,null,null,null,null,null,null,null,"Jelínek Jan",138,null,"Fay Vlastimil",97]
[null,null,null,null,null,null,null,null,null,null,null,null,null,null,null,null,null,null,null,null,null,null,null,null,"Fay Vlastimil",138,null,"Neshyba Jaroslav",94]
[null,null,null,null,null,null,null,null,null,null,null,null,null,null,null,null,null,null,null,null,null,null,null,null,"Aunický Ftantišek",133,null,"Holkup Jan",91]
[null,null,null,null,null,null,null,null,null,null,null,null,null,null,null,null,null,null,null,null,null,null,null,null,"Sehnal Ivan",133,null,"Novotná Petra",91]
[null,null,null,null,null,null,null,null,null,null,null,null,null,null,null,null,null,null,null,null,null,null,null,null,"Šafář Ladislav",128,null,"Doman Marcel",87]
[null,null,null,null,null,null,null,null,null,null,null,null,null,null,null,null,null,null,null,null,null,null,null,null,"Doman Marcel",123,null,"Aunický Ftantišek",77]
[null,null,null,null,null,null,null,null,null,null,null,null,null,null,null,null,null,null,null,null,null,null,null,null,"Liebichová Inke",108,null,"Liebichová Inke",69]

{"sheet":"turnaje","index":3,"n_rows":23,"n_cols":10,"rows_kept":23,"cut":false,"hidden":false,"merged":[[18,1,19,2],[18,3,19,3],[18,9,19,9],[21,9,22,9],[22,1,23,2],[12,5,13,6],[15,9,16,9],[12,1,13,2],[12,3,13,3],[14,1,15,2],[2,1,3,8],[14,3,15,3],[16,1,17,2],[16,3,17,3],[6,1,7,2],[6,3,7,3],[8,1,9,2],[8,3,9,3],[10,1,11,2],[10,3,11,3]]}
[]
[]
[null,"JEDNOTLIVÉ TURNAJE V ROCE 2015"]
[]
[]
[]
[null,"PV OSZO",null,"31.1."]
[]
[null,"KLÍČOV",null,"28.2."]
[]
[null,"ŘEPY",null,"28.3."]
[]
[null,"HOSTIVAŘ",null,"25.4."]
[]
[null,"KAČEROV",null,"_._."]
[null,null,null,null,null,null,null,null,null,"jednotlivci"]
[null,"VRŠOVICE",null,"_._."]
[]
[null,"POHÁR GŘ",null,"_._.",null,null,null,null,null,"statistika celkem"]
[]
[]
[null,null,null,null,null,null,null,null,null,"garáže"]
[null,"PRO PŘÍPAD            11 DRUŽSTEV"]

{"sheet":"PV OSZO","index":4,"n_rows":71,"n_cols":53,"rows_kept":71,"cut":false,"hidden":false,"merged":[[65,2,69,2],[65,3,69,3],[65,17,69,17],[65,29,69,29],[52,28,52,29],[53,2,57,2],[53,3,57,3],[53,17,57,17],[53,29,63,29],[40,28,40,29],[41,2,45,2],[41,3,45,3],[41,17,45,17],[41,29,51,29],[64,28,64,29],[29,3,33,3],[59,2,63,2],[59,3,63,3],[59,17,63,17],[35,3,39,3],[35,17,39,17],[17,17,21,17],[47,2,51,2],[47,3,51,3],[47,17,51,17],[18,37,18,39],[23,2,27,2],[23,3,27,3],[23,17,27,17],[28,28,28,29],[29,2,33,2],[5,29,15,29],[29,17,33,17],[29,29,39,29],[35,2,39,2],[11,2,15,2],[11,3,15,3],[11,17,15,17],[16,28,16,29],[17,2,21,2],[17,3,21,3],[5,37,5,39],[17,29,27,29],[0,0,3,0],[2,3,2,39],[4,2,4,3],[4,13,4,14],[4,32,4,34],[5,2,9,2],[5,3,9,3],[5,17,9,17]]}
["ZPĚT"]
[]
[null,null,null,"Sportovní turnaj v Bowlingu o pohár  PV-OSZO DP-Autobusy Praha - dne  31. 1. 2015"]
[]
[null,null,"Garáž",null,"Jméno","I.","II.","III.","IV.","V.","Body",null,null,"Jednotlivci.",null,null,null,"Družstva.",null,null,null,null,null,null,null,null,null,null,null,null,null,null,"pořadí jednotlivců"]
[null,{"$f":"IF(F6=\"\",\"\",N6)","v":21},1,"KAČEROV I.","Hübner Jiří",134,127,138,161,177,{"$f":"SUM(F6:J6)","v":737},{"$f":"MAX(F6:J6)","v":177},{"$f":"SUM(K6*1000)+L6+0.055","v":737177.05500000005},{"$f":"IF(F6=\"\",\"\",RANK(M6,M6:M70,0))","v":21},null,null,null,{"$f":"IF(F6=\"\",\"\",RANK(Q11,Q11:Q71,0))","v":3},null,{"$f":"IF(F6=\"\",\"\",RANK(AA6,AA6:AA64,0))","v":2},{"$f":"IF(R6=\"\",\"\",R6)","v":3},{"$f":"IF(D6=\"\",\"\",D6)","v":"KAČEROV I."},{"$f":"IF(O11=\"\",\"\",O11)","v":3835},{"$f":"IF(V6=\"HOSTIVAŘ I.\",\"GARÁŽ HOSTIVAŘ\",IF(V6=\"VRŠOVICE I.\",\"GARÁŽ VRŠOVICE\",IF(V6=\"KLÍČOV I.\",\"GARÁŽ KLÍČOV\",IF(V6=\"ŘEPY I.\",\"GARÁŽ ŘEPY\",IF(V6=\"KAČEROV I.\",\"GARÁŽ KAČEROV\",\"\")))))","v":"GARÁŽ KAČEROV"},{"$f":"MAX(F11:J11,F17:J17)+0.05","v":872.05},{"$f":"SUM(O11,O17)*1000","v":7392000},{"$f":"SUM(Y6:Z6)","v":7392872.0499999998},{"$f":"IF(AC17=\"\",\"\",AC17)","v":7392},null,{"$f":"IF(T6=\"\",\"\",T6)","v":2},null,{"$f":"COUNT(F6:F10,F12:F16,F18:F22,F24:F28,F30:F34,F36:F40,F42:F46,F48:F52,F54:F58,F60:F64,F66:F70)","v":55},1,{"$f":"IF(AF6<1,\"\",VLOOKUP(1,B6:N70,4,FALSE))","v":"Podhola Martin"},{"$f":"IF(AF6<1,\"\",VLOOKUP(1,B6:N70,10,FALSE))","v":857},null,{"$f":"COUNT(U6:U16,U18:U28,U30:U40,U42:U52,U54:U64,U66)","v":11},"POŘADÍ DRUŽSTEV",null,null,null,null,null,null,null,null,null,null,null,null,null,null,"HOSTIVAŘ I."]
[null,{"$f":"IF(F7=\"\",\"\",N7)","v":17},null,null,"Turek Stanislav",140,163,169,100,177,{"$f":"SUM(F7:J7)","v":749},177,{"$f":"SUM(K7*1000)+L7+0.054","v":749177.054},{"$f":"IF(F7=\"\",\"\",RANK(M7,M6:M70,0))","v":17},null,null,null,null,null,null,null,null,null,null,null,null,null,null,null,null,null,null,{"$f":"SUM(AG6+1)","v":2},{"$f":"IF(AF6<2,\"\",VLOOKUP(2,B6:N70,4,FALSE))","v":"Mašát Petr"},{"$f":"IF(AF6<2,\"\",VLOOKUP(2,B6:N70,10,FALSE))","v":852},null,null,1,{"$f":"IF(AK6<1,\"\",VLOOKUP(1,U6:W70,2,FALSE))","v":"VRŠOVICE I."},{"$f":"IF(AK6<1,\"\",VLOOKUP(1,U6:W70,3,FALSE))","v":3891},null,null,null,null,null,null,null,null,null,null,null,null,"VRŠOVICE I."]
[null,{"$f":"IF(F8=\"\",\"\",N8)","v":18},null,null,"Ondřich František",175,163,149,119,143,{"$f":"SUM(F8:J8)","v":749},175,{"$f":"SUM(K8*1000)+L8+0.053","v":749175.05299999996},{"$f":"IF(F8=\"\",\"\",RANK(M8,M6:M71,0))","v":18},null,null,null,null,null,null,null,null,null,null,null,null,null,null,null,null,null,null,{"$f":"SUM(AG7+1)","v":3},{"$f":"IF(AF6<3,\"\",VLOOKUP(3,B6:N70,4,FALSE))","v":"Krupa Jozef"},{"$f":"IF(AF6<3,\"\",VLOOKUP(3,B6:N70,10,FALSE))","v":844},null,null,2,{"$f":"IF(AK6<2,\"\",VLOOKUP(2,U6:W70,2,FALSE))","v":"ŘEPY I."},{"$f":"IF(AK6<2,\"\",VLOOKUP(2,U6:W70,3,FALSE))","v":3853},null,null,null,null,null,null,null,null,null,null,null,null,"KLÍČOV I."]
[null,{"$f":"IF(F9=\"\",\"\",N9)","v":2},null,null,"Mašát Petr",170,166,164,160,192,{"$f":"SUM(F9:J9)","v":852},192,{"$f":"SUM(K9*1000)+L9+0.052","v":852192.05200000003},{"$f":"IF(F9=\"\",\"\",RANK(M9,M6:M70,0))","v":2},null,null,null,null,null,null,null,null,null,null,null,null,null,null,null,null,null,null,4,{"$f":"IF(AF6<4,\"\",VLOOKUP(4,B6:N70,4,FALSE))","v":"Lazur Michal"},{"$f":"IF(AF6<4,\"\",VLOOKUP(4,B6:N70,10,FALSE))","v":829},null,null,3,{"$f":"IF(AK6<3,\"\",VLOOKUP(3,U6:W70,2,FALSE))","v":"KAČEROV I."},{"$f":"IF(AK6<3,\"\",VLOOKUP(3,U6:W70,3,FALSE))","v":3835},null,null,null,null,null,null,null,null,null,null,null,null,"ŘEPY I."]
[null,{"$f":"IF(F10=\"\",\"\",N10)","v":20},null,null,"Carvan Pavel",113,138,155,159,183,{"$f":"SUM(F10:J10)","v":748},183,{"$f":"SUM(K10*1000)+L10+0.051","v":748183.05099999998},{"$f":"IF(F10=\"\",\"\",RANK(M10,M6:M70,0))","v":20},null,null,null,null,null,null,null,null,null,null,null,null,null,null,null,null,null,null,5,{"$f":"IF(AF6<5,\"\",VLOOKUP(5,B6:N70,4,FALSE))","v":"Kocůr Jaroslav"},{"$f":"IF(AF6<5,\"\",VLOOKUP(5,B6:N70,10,FALSE))","v":827},null,null,4,{"$f":"IF(AK6<4,\"\",VLOOKUP(4,U6:W70,2,FALSE))","v":"HOSTIVAŘ I."},{"$f":"IF(AK6<4,\"\",VLOOKUP(4,U6:W70,3,FALSE))","v":3783},null,null,null,null,null,null,null,null,null,null,null,null,"KAČEROV I."]
[null,null,null,null,null,{"$f":"SUM(F6:F10)","v":732},{"$f":"SUM(G6:G10)","v":757},{"$f":"SUM(H6:H10)","v":775},{"$f":"SUM(I6:I10)","v":699},{"$f":"SUM(J6:J10)","v":872},null,872,null,null,{"$f":"SUM(F11:J11)","v":3835},{"$f":"MAX(F11:J11)+0.01","v":872.01},{"$f":"IF(F6=\"\",\"\",SUM(O11*1000)+P11)","v":3835872.01},null,null,null,null,null,null,null,null,null,null,null,null,null,null,null,6,{"$f":"IF(AF6<6,\"\",VLOOKUP(6,B6:N70,4,FALSE))","v":"Kolář Ladislav"},{"$f":"IF(AF6<6,\"\",VLOOKUP(6,B6:N70,10,FALSE))","v":826},null,null,5,{"$f":"IF(AK6<5,\"\",VLOOKUP(5,U6:W70,2,FALSE))","v":"KLÍČOV I."},{"$f":"IF(AK6<5,\"\",VLOOKUP(5,U6:W70,3,FALSE))","v":3643}]
[null,{"$f":"IF(F12=\"\",\"\",N12)","v":27},2,"KAČEROV II.","Douša Adam",132,173,137,151,119,{"$f":"SUM(F12:J12)","v":712},173,{"$f":"SUM(K12*1000)+L12+0.05","v":712173.05},{"$f":"IF(F12=\"\",\"\",RANK(M12,M6:M70,0))","v":27},null,null,null,{"$f":"IF(F12=\"\",\"\",RANK(Q17,Q11:Q71,0))","v":7},null,null,{"$f":"IF(R12=\"\",\"\",R12)","v":7},{"$f":"IF(D12=\"\",\"\",D12)","v":"KAČEROV II."},{"$f":"IF(O17=\"\",\"\",O17)","v":3557},null,null,null,null,null,null,null,null,null,7,{"$f":"IF(AF6<7,\"\",VLOOKUP(7,B6:N70,4,FALSE))","v":"Šafařík Luděk"},{"$f":"IF(AF6<7,\"\",VLOOKUP(7,B6:N70,10,FALSE))","v":812},null,null,6,{"$f":"IF(AK6<6,\"\",VLOOKUP(6,U6:W70,2,FALSE))","v":"ŘEPY II."},{"$f":"IF(AK6<6,\"\",VLOOKUP(6,U6:W70,3,FALSE))","v":3576}]
[null,{"$f":"IF(F13=\"\",\"\",N13)","v":23},null,null,"Tomášek Zdeněk",101,150,169,168,133,{"$f":"SUM(F13:J13)","v":721},169,{"$f":"SUM(K13*1000)+L13+0.049","v":721169.049},{"$f":"IF(F13=\"\",\"\",RANK(M13,M6:M70,0))","v":23},null,null,null,null,null,null,null,null,null,null,null,null,null,null,null,null,null,null,8,{"$f":"IF(AF6<8,\"\",VLOOKUP(8,B6:N70,4,FALSE))","v":"Dvořák Petr"},{"$f":"IF(AF6<8,\"\",VLOOKUP(8,B6:N70,10,FALSE))","v":799},null,null,7,{"$f":"IF(AK6<7,\"\",VLOOKUP(7,U6:W70,2,FALSE))","v":"KAČEROV II."},{"$f":"IF(AK6<7,\"\",VLOOKUP(7,U6:W70,3,FALSE))","v":3557}]
[null,{"$f":"IF(F14=\"\",\"\",N14)","v":44},null,null,"Kutina Pavel",144,99,122,168,118,{"$f":"SUM(F14:J14)","v":651},168,{"$f":"SUM(K14*1000)+L14+0.048","v":651168.04799999995},{"$f":"IF(F14=\"\",\"\",RANK(M14,M6:M70,0))","v":44},null,null,null,null,null,null,null,null,null,null,null,null,null,null,null,null,null,null,9,{"$f":"IF(AF6<9,\"\",VLOOKUP(9,B6:N70,4,FALSE))","v":"Pospíšil Václav"},{"$f":"IF(AF6<9,\"\",VLOOKUP(9,B6:N70,10,FALSE))","v":791},null,null,8,{"$f":"IF(AK6<8,\"\",VLOOKUP(8,U6:W70,2,FALSE))","v":"ŘEPY III."},{"$f":"IF(AK6<8,\"\",VLOOKUP(8,U6:W70,3,FALSE))","v":3226}]
[null,{"$f":"IF(F15=\"\",\"\",N15)","v":13},null,null,"Brož Stanislav",132,174,149,140,162,{"$f":"SUM(F15:J15)","v":757},174,{"$f":"SUM(K15*1000)+L15+0.047","v":757174.04700000002},{"$f":"IF(F15=\"\",\"\",RANK(M15,M6:M700,0))","v":13},null,null,null,null,null,null,null,null,null,null,null,null,null,null,null,null,null,null,10,{"$f":"IF(AF6<10,\"\",VLOOKUP(10,B6:N70,4,FALSE))","v":"Štěpánek Radek"},{"$f":"IF(AF6<10,\"\",VLOOKUP(10,B6:N70,10,FALSE))","v":776},null,null,9,{"$f":"IF(AK6<9,\"\",VLOOKUP(9,U6:W70,2,FALSE))","v":"HOSTIVAŘ II."},{"$f":"IF(AK6<9,\"\",VLOOKUP(9,U6:W70,3,FALSE))","v":3195}]
[null,{"$f":"IF(F16=\"\",\"\",N16)","v":25},null,null,"Radová Petra",125,158,118,183,132,{"$f":"SUM(F16:J16)","v":716},183,{"$f":"SUM(K16*1000)+L16+0.046","v":716183.04599999997},{"$f":"IF(F16=\"\",\"\",RANK(M16,M6:M70,0))","v":25},null,null,null,null,null,null,null,null,null,null,null,null,null,null,null,null,null,null,11,{"$f":"IF(AF6<11,\"\",VLOOKUP(11,B6:N70,4,FALSE))","v":"Froněk Martin"},{"$f":"IF(AF6<11,\"\",VLOOKUP(11,B6:N70,10,FALSE))","v":772},null,null,10,{"$f":"IF(AK6<10,\"\",VLOOKUP(10,U6:W70,2,FALSE))","v":"KLÍČOV II."},{"$f":"IF(AK6<10,\"\",VLOOKUP(10,U6:W70,3,FALSE))","v":3164}]
[null,null,null,null,null,{"$f":"SUM(F12:F16)","v":634},{"$f":"SUM(G12:G16)","v":754},{"$f":"SUM(H12:H16)","v":695},{"$f":"SUM(I12:I16)","v":810},{"$f":"SUM(J12:J16)","v":664},null,null,null,null,{"$f":"SUM(F17:J17)","v":3557},{"$f":"MAX(F17:J17)+0.009","v":810.00900000000001},{"$f":"IF(F12=\"\",\"\",SUM(O17*1000)+P17)","v":3557810.0090000001},null,null,null,null,null,null,null,null,null,null,null,{"$f":"SUM(O11,O17)","v":7392},null,null,null,12,{"$f":"IF(AF6<12,\"\",VLOOKUP(12,B6:N70,4,FALSE))","v":"Ekert Stanislav"},{"$f":"IF(AF6<12,\"\",VLOOKUP(12,B6:N70,10,FALSE))","v":761},null,null,11,{"$f":"IF(AK6<11,\"\",VLOOKUP(11,U6:W70,2,FALSE))","v":"VRŠOVICE II."},{"$f":"IF(AK6<11,\"\",VLOOKUP(11,U6:W70,3,FALSE))","v":2933}]
[null,{"$f":"IF(F18=\"\",\"\",N18)","v":16},3,"HOSTIVAŘ I.","Berger Michal",166,185,140,145,115,{"$f":"SUM(F18:J18)","v":751},{"$f":"MAX(F18:J18)","v":185},{"$f":"SUM(K18*1000)+L18+0.045","v":751185.04500000004},{"$f":"IF(F18=\"\",\"\",RANK(M18,M6:M70,0))","v":16},null,null,null,{"$f":"IF(F18=\"\",\"\",RANK(Q23,Q11:Q71,0))","v":4},null,{"$f":"IF(F18=\"\",\"\",RANK(AA18,AA6:AA64,0))","v":3},{"$f":"IF(R18=\"\",\"\",R18)","v":4},{"$f":"IF(D18=\"\",\"\",D18)","v":"HOSTIVAŘ I."},{"$f":"IF(O23=\"\",\"\",O23)","v":3783},{"$f":"IF(V18=\"HOSTIVAŘ I.\",\"GARÁŽ HOSTIVAŘ\",IF(V18=\"VRŠOVICE I.\",\"GARÁŽ VRŠOVICE\",IF(V18=\"KLÍČOV I.\",\"GARÁŽ KLÍČOV\",IF(V18=\"ŘEPY I.\",\"GARÁŽ ŘEPY\",IF(V18=\"KAČEROV I.\",\"GARÁŽ KAČEROV\",\"\")))))","v":"GARÁŽ HOSTIVAŘ"},{"$f":"MAX(F23:J23,F29:J29)+0.04","v":852.04},{"$f":"SUM(O23,O29)*1000","v":6978000},{"$f":"SUM(Y18:Z18)","v":6978852.04},{"$f":"IF(AC29=\"\",\"\",AC29)","v":6978},null,{"$f":"IF(T18=\"\",\"\",T18)","v":3},null,null,13,{"$f":"IF(AF6<13,\"\",VLOOKUP(13,B6:N70,4,FALSE))","v":"Brož Stanislav"},{"$f":"IF(AF6<13,\"\",VLOOKUP(13,B6:N70,10,FALSE))","v":757}]
[null,{"$f":"IF(F19=\"\",\"\",N19)","v":38},null,null,"Křápek Roman",130,132,160,128,129,{"$f":"SUM(F19:J19)","v":679},{"$f":"MAX(F19:J19)","v":160},{"$f":"SUM(K19*1000)+L19+0.044","v":679160.04399999999},{"$f":"IF(F19=\"\",\"\",RANK(M19,M6:M70,0))","v":38},null,null,null,null,null,null,null,null,null,null,null,null,null,null,null,null,null,null,14,{"$f":"IF(AF6<14,\"\",VLOOKUP(14,B6:N70,4,FALSE))","v":"Liebich František"},{"$f":"IF(AF6<14,\"\",VLOOKUP(14,B6:N70,10,FALSE))","v":756},null,{"$f":"COUNT(T6:T64)","v":5},"POŘEDÍ GARÁŽÍ"]
[null,{"$f":"IF(F20=\"\",\"\",N20)","v":26},null,null,"Růžička Ladislav",115,190,116,151,140,{"$f":"SUM(F20:J20)","v":712},{"$f":"MAX(F20:J20)","v":190},{"$f":"SUM(K20*1000)+L20+0.043","v":712190.04299999995},{"$f":"IF(F20=\"\",\"\",RANK(M20,M6:M70,0))","v":26},null,null,null,null,null,null,null,null,null,null,null,null,null,null,null,null,null,null,15,{"$f":"IF(AF6<15,\"\",VLOOKUP(15,B6:N70,4,FALSE))","v":"Novotný Lukáš"},{"$f":"IF(AF6<15,\"\",VLOOKUP(15,B6:N70,10,FALSE))","v":755},null,null,1,{"$f":"IF(AK19<1,\"\",VLOOKUP(1,T6:AB64,5,FALSE))","v":"GARÁŽ ŘEPY"},{"$f":"IF(AK19<1,\"\",VLOOKUP(1,T6:AB64,9,FALSE))","v":7429}]
[null,{"$f":"IF(F21=\"\",\"\",N21)","v":7},null,null,"Šafařík Luděk",160,186,178,138,150,{"$f":"SUM(F21:J21)","v":812},{"$f":"MAX(F21:J21)","v":186},{"$f":"SUM(K21*1000)+L21+0.042","v":812186.04200000002},{"$f":"IF(F21=\"\",\"\",RANK(M21,M6:M70,0))","v":7},null,null,null,null,null,null,null,null,null,null,null,null,null,null,null,null,null,null,16,{"$f":"IF(AF6<16,\"\",VLOOKUP(16,B6:N70,4,FALSE))","v":"Berger Michal"},{"$f":"IF(AF6<16,\"\",VLOOKUP(16,B6:N70,10,FALSE))","v":751},null,null,2,{"$f":"IF(AK19<2,\"\",VLOOKUP(2,T6:AB64,5,FALSE))","v":"GARÁŽ KAČEROV"},{"$f":"IF(AK19<2,\"\",VLOOKUP(2,T6:AB64,9,FALSE))","v":7392}]
[null,{"$f":"IF(F22=\"\",\"\",N22)","v":4},null,null,"Lazur Michal",151,159,139,157,223,{"$f":"SUM(F22:J22)","v":829},{"$f":"MAX(F22:J22)","v":223},{"$f":"SUM(K22*1000)+L22+0.041","v":829223.04099999997},{"$f":"IF(F22=\"\",\"\",RANK(M22,M6:M70,0))","v":4},null,null,null,null,null,null,null,null,null,null,null,null,null,null,null,null,null,null,17,{"$f":"IF(AF6<17,\"\",VLOOKUP(17,B6:N70,4,FALSE))","v":"Turek Stanislav"},{"$f":"IF(AF6<17,\"\",VLOOKUP(17,B6:N70,10,FALSE))","v":749},null,null,3,{"$f":"IF(AK19<3,\"\",VLOOKUP(3,T6:AB64,5,FALSE))","v":"GARÁŽ HOSTIVAŘ"},{"$f":"IF(AK19<3,\"\",VLOOKUP(3,T6:AB64,9,FALSE))","v":6978}]
[null,null,null,null,null,{"$f":"SUM(F18:F22)","v":722},{"$f":"SUM(G18:G22)","v":852},{"$f":"SUM(H18:H22)","v":733},{"$f":"SUM(I18:I22)","v":719},{"$f":"SUM(J18:J22)","v":757},null,null,null,null,{"$f":"SUM(F23:J23)","v":3783},{"$f":"MAX(F23:J23)+0.008","v":852.00800000000004},{"$f":"IF(F18=\"\",\"\",SUM(O23*1000)+P23)","v":3783852.0079999999},null,null,null,null,null,null,null,null,null,null,null,null,null,null,null,18,{"$f":"IF(AF6<18,\"\",VLOOKUP(18,B6:N70,4,FALSE))","v":"Ondřich František"},{"$f":"IF(AF6<18,\"\",VLOOKUP(18,B6:N70,10,FALSE))","v":749},null,null,4,{"$f":"IF(AK19<4,\"\",VLOOKUP(4,T6:AB64,5,FALSE))","v":"GARÁŽ VRŠOVICE"},{"$f":"IF(AK19<4,\"\",VLOOKUP(4,T6:AB64,9,FALSE))","v":6824}]
[null,{"$f":"IF(F24=\"\",\"\",N24)","v":33},4,"HOSTIVAŘ II.","Čermák Tomáš",141,110,168,132,143,{"$f":"SUM(F24:J24)","v":694},{"$f":"MAX(F24:J24)","v":168},{"$f":"SUM(K24*1000)+L24+0.04","v":694168.04},{"$f":"IF(F24=\"\",\"\",RANK(M24,M6:M70,0))","v":33},null,null,null,{"$f":"IF(F24=\"\",\"\",RANK(Q29,Q11:Q71,0))","v":9},null,null,{"$f":"IF(R24=\"\",\"\",R24)","v":9},{"$f":"IF(D24=\"\",\"\",D24)","v":"HOSTIVAŘ II."},{"$f":"IF(O29=\"\",\"\",O29)","v":3195},null,null,null,null,null,null,null,null,null,19,{"$f":"IF(AF6<19,\"\",VLOOKUP(19,B6:N70,4,FALSE))","v":"Holkup Jan"},{"$f":"IF(AF6<19,\"\",VLOOKUP(19,B6:N70,10,FALSE))","v":748},null,null,5,{"$f":"IF(AK19<5,\"\",VLOOKUP(5,T6:AB64,5,FALSE))","v":"GARÁŽ KLÍČOV"},{"$f":"IF(AK19<5,\"\",VLOOKUP(5,T6:AB64,9,FALSE))","v":6807}]
[null,{"$f":"IF(F25=\"\",\"\",N25)","v":41},null,null,"Mysliveček Jaroslav",159,113,132,147,116,{"$f":"SUM(F25:J25)","v":667},{"$f":"MAX(F25:J25)","v":159},{"$f":"SUM(K25*1000)+L25+0.039","v":667159.03899999999},{"$f":"IF(F25=\"\",\"\",RANK(M25,M6:M70,0))","v":41},null,null,null,null,null,null,null,null,null,null,null,null,null,null,null,null,null,null,20,{"$f":"IF(AF6<20,\"\",VLOOKUP(20,B6:N70,4,FALSE))","v":"Carvan Pavel"},{"$f":"IF(AF6<20,\"\",VLOOKUP(20,B6:N70,10,FALSE))","v":748}]
[null,{"$f":"IF(F26=\"\",\"\",N26)","v":48},null,null,"Jelínek Jan",114,111,130,138,113,{"$f":"SUM(F26:J26)","v":606},{"$f":"MAX(F26:J26)","v":138},{"$f":"SUM(K26*1000)+L26+0.038","v":606138.03799999994},{"$f":"IF(F26=\"\",\"\",RANK(M26,M6:M70,0))","v":48},null,null,null,null,null,null,null,null,null,null,null,null,null,null,null,null,null,null,21,{"$f":"IF(AF6<21,\"\",VLOOKUP(21,B6:N70,4,FALSE))","v":"Hübner Jiří"},{"$f":"IF(AF6<21,\"\",VLOOKUP(21,B6:N70,10,FALSE))","v":737}]
[null,{"$f":"IF(F27=\"\",\"\",N27)","v":47},null,null,"Lazurová Jiřina",141,135,122,103,105,{"$f":"SUM(F27:J27)","v":606},{"$f":"MAX(F27:J27)","v":141},{"$f":"SUM(K27*1000)+L27+0.037","v":606141.03700000001},{"$f":"IF(F27=\"\",\"\",RANK(M27,M6:M70,0))","v":47},null,null,null,null,null,null,null,null,null,null,null,null,null,null,null,null,null,null,22,{"$f":"IF(AF6<22,\"\",VLOOKUP(22,B6:N70,4,FALSE))","v":"Kalfiřt Petr"},{"$f":"IF(AF6<22,\"\",VLOOKUP(22,B6:N70,10,FALSE))","v":722}]
[null,{"$f":"IF(F28=\"\",\"\",N28)","v":45},null,null,"Šafář Ladislav",125,123,125,128,121,{"$f":"SUM(F28:J28)","v":622},{"$f":"MAX(F28:J28)","v":128},{"$f":"SUM(K28*1000)+L28+0.036","v":622128.03599999996},{"$f":"IF(F28=\"\",\"\",RANK(M28,M6:M70,0))","v":45},null,null,null,null,null,null,null,null,null,null,null,null,null,null,null,null,null,null,23,{"$f":"IF(AF6<23,\"\",VLOOKUP(23,B6:N70,4,FALSE))","v":"Tomášek Zdeněk"},{"$f":"IF(AF6<23,\"\",VLOOKUP(23,B6:N70,10,FALSE))","v":721}]
[null,null,null,null,null,{"$f":"SUM(F24:F28)","v":680},{"$f":"SUM(G24:G28)","v":592},{"$f":"SUM(H24:H28)","v":677},{"$f":"SUM(I24:I28)","v":648},{"$f":"SUM(J24:J28)","v":598},null,null,null,null,{"$f":"SUM(F29:J29)","v":3195},{"$f":"MAX(F29:J29)+0.007","v":680.00699999999995},{"$f":"IF(F24=\"\",\"\",SUM(O29*1000)+P29)","v":3195680.0070000002},null,null,null,null,null,null,null,null,null,null,null,{"$f":"SUM(O23,O29)","v":6978},null,null,null,24,{"$f":"IF(AF6<24,\"\",VLOOKUP(24,B6:N70,4,FALSE))","v":"Kročil Tomáš"},{"$f":"IF(AF6<24,\"\",VLOOKUP(24,B6:N70,10,FALSE))","v":721}]
[null,{"$f":"IF(F30=\"\",\"\",N30)","v":3},5,"VRŠOVICE I.","Krupa Jozef",135,202,188,170,149,{"$f":"SUM(F30:J30)","v":844},{"$f":"MAX(F30:J30)","v":202},{"$f":"SUM(K30*1000)+L30+0.035","v":844202.03500000003},{"$f":"IF(F30=\"\",\"\",RANK(M30,M6:M70,0))","v":3},null,null,null,{"$f":"IF(F30=\"\",\"\",RANK(Q35,Q11:Q71,0))","v":1},null,{"$f":"IF(F30=\"\",\"\",RANK(AA30,AA6:AA64,0))","v":4},{"$f":"IF(R30=\"\",\"\",R30)","v":1},{"$f":"IF(D30=\"\",\"\",D30)","v":"VRŠOVICE I."},{"$f":"IF(O35=\"\",\"\",O35)","v":3891},{"$f":"IF(V30=\"HOSTIVAŘ I.\",\"GARÁŽ HOSTIVAŘ\",IF(V30=\"VRŠOVICE I.\",\"GARÁŽ VRŠOVICE\",IF(V30=\"KLÍČOV I.\",\"GARÁŽ KLÍČOV\",IF(V30=\"ŘEPY I.\",\"GARÁŽ ŘEPY\",IF(V30=\"KAČEROV I.\",\"GARÁŽ KAČEROV\",\"\")))))","v":"GARÁŽ VRŠOVICE"},{"$f":"MAX(F35:J35,F41:J41)+0.03","v":838.03},{"$f":"SUM(O35,O41)*1000","v":6824000},{"$f":"SUM(Y30:Z30)","v":6824838.0300000003},{"$f":"IF(AC41=\"\",\"\",AC41)","v":6824},null,{"$f":"IF(T30=\"\",\"\",T30)","v":4},null,null,25,{"$f":"IF(AF6<25,\"\",VLOOKUP(25,B6:N70,4,FALSE))","v":"Radová Petra"},{"$f":"IF(AF6<25,\"\",VLOOKUP(25,B6:N70,10,FALSE))","v":716}]
[null,{"$f":"IF(F31=\"\",\"\",N31)","v":1},null,null,"Podhola Martin",133,162,207,176,179,{"$f":"SUM(F31:J31)","v":857},{"$f":"MAX(F31:J31)","v":207},{"$f":"SUM(K31*1000)+L31+0.034","v":857207.03399999999},{"$f":"IF(F31=\"\",\"\",RANK(M31,M6:M70,0))","v":1},null,null,null,null,null,null,null,null,null,null,null,null,null,null,null,null,null,null,26,{"$f":"IF(AF6<26,\"\",VLOOKUP(26,B6:N70,4,FALSE))","v":"Růžička Ladislav"},{"$f":"IF(AF6<26,\"\",VLOOKUP(26,B6:N70,10,FALSE))","v":712}]
[null,{"$f":"IF(F32=\"\",\"\",N32)","v":19},null,null,"Holkup Jan",91,132,172,190,163,{"$f":"SUM(F32:J32)","v":748},{"$f":"MAX(F32:J32)","v":190},{"$f":"SUM(K32*1000)+L32+0.033","v":748190.03300000005},{"$f":"IF(F32=\"\",\"\",RANK(M32,M6:M70,0))","v":19},null,null,null,null,null,null,null,null,null,null,null,null,null,null,null,null,null,null,27,{"$f":"IF(AF6<27,\"\",VLOOKUP(27,B6:N70,4,FALSE))","v":"Douša Adam"},{"$f":"IF(AF6<27,\"\",VLOOKUP(27,B6:N70,10,FALSE))","v":712}]
[null,{"$f":"IF(F33=\"\",\"\",N33)","v":34},null,null,"Skružná Pavla",161,147,134,135,109,{"$f":"SUM(F33:J33)","v":686},{"$f":"MAX(F33:J33)","v":161},{"$f":"SUM(K33*1000)+L33+0.032","v":686161.03200000001},{"$f":"IF(F33=\"\",\"\",RANK(M33,M6:M70,0))","v":34},null,null,null,null,null,null,null,null,null,null,null,null,null,null,null,null,null,null,28,{"$f":"IF(AF6<28,\"\",VLOOKUP(28,B6:N70,4,FALSE))","v":"Bošek Jan"},{"$f":"IF(AF6<28,\"\",VLOOKUP(28,B6:N70,10,FALSE))","v":710}]
[null,{"$f":"IF(F34=\"\",\"\",N34)","v":14},null,null,"Liebich František",159,140,137,149,171,{"$f":"SUM(F34:J34)","v":756},{"$f":"MAX(F34:J34)","v":171},{"$f":"SUM(K34*1000)+L34+0.031","v":756171.03099999996},{"$f":"IF(F34=\"\",\"\",RANK(M34,M6:M70,0))","v":14},null,null,null,null,null,null,null,null,null,null,null,null,null,null,null,null,null,null,29,{"$f":"IF(AF6<29,\"\",VLOOKUP(29,B6:N70,4,FALSE))","v":"Křikavová Miroslava"},{"$f":"IF(AF6<29,\"\",VLOOKUP(29,B6:N70,10,FALSE))","v":709}]
[null,null,null,null,null,{"$f":"SUM(F30:F34)","v":679},{"$f":"SUM(G30:G34)","v":783},{"$f":"SUM(H30:H34)","v":838},{"$f":"SUM(I30:I34)","v":820},{"$f":"SUM(J30:J34)","v":771},null,null,null,null,{"$f":"SUM(F35:J35)","v":3891},{"$f":"MAX(F35:J35)+0.006","v":838.00599999999997},{"$f":"IF(F30=\"\",\"\",SUM(O35*1000)+P35)","v":3891838.0060000001},null,null,null,null,null,null,null,null,null,null,null,null,null,null,null,30,{"$f":"IF(AF6<30,\"\",VLOOKUP(30,B6:N70,4,FALSE))","v":"Pecka Jiří"},{"$f":"IF(AF6<30,\"\",VLOOKUP(30,B6:N70,10,FALSE))","v":709}]
[null,{"$f":"IF(F36=\"\",\"\",N36)","v":53},6,"VRŠOVICE II.","Aunický Ftantišek",77,122,133,104,94,{"$f":"SUM(F36:J36)","v":530},{"$f":"MAX(F36:J36)","v":133},{"$f":"SUM(K36*1000)+L36+0.03","v":530133.03},{"$f":"IF(F36=\"\",\"\",RANK(M36,M6:M70,0))","v":53},null,null,null,{"$f":"IF(F36=\"\",\"\",RANK(Q41,Q11:Q71,0))","v":11},null,null,{"$f":"IF(R36=\"\",\"\",R36)","v":11},{"$f":"IF(D36=\"\",\"\",D36)","v":"VRŠOVICE II."},{"$f":"IF(O41=\"\",\"\",O41)","v":2933},null,null,null,null,null,null,null,null,null,31,{"$f":"IF(AF6<31,\"\",VLOOKUP(31,B6:N70,4,FALSE))","v":"Ekert Michal"},{"$f":"IF(AF6<31,\"\",VLOOKUP(31,B6:N70,10,FALSE))","v":701}]
[null,{"$f":"IF(F37=\"\",\"\",N37)","v":55},null,null,"Liebichová Inke",90,89,69,77,108,{"$f":"SUM(F37:J37)","v":433},{"$f":"MAX(F37:J37)","v":108},{"$f":"SUM(K37*1000)+L37+0.029","v":433108.02899999998},{"$f":"IF(F37=\"\",\"\",RANK(M37,M6:M70,0))","v":55},null,null,null,null,null,null,null,null,null,null,null,null,null,null,null,null,null,null,32,{"$f":"IF(AF6<32,\"\",VLOOKUP(32,B6:N70,4,FALSE))","v":"Sladovník Miloslav"},{"$f":"IF(AF6<32,\"\",VLOOKUP(32,B6:N70,10,FALSE))","v":694}]
[null,{"$f":"IF(F38=\"\",\"\",N38)","v":39},null,null,"Veselý Vlastimil",116,119,176,115,149,{"$f":"SUM(F38:J38)","v":675},{"$f":"MAX(F38:J38)","v":176},{"$f":"SUM(K38*1000)+L38+0.028","v":675176.02800000005},{"$f":"IF(F38=\"\",\"\",RANK(M38,M6:M70,0))","v":39},null,null,null,null,null,null,null,null,null,null,null,null,null,null,null,null,null,null,33,{"$f":"IF(AF6<33,\"\",VLOOKUP(33,B6:N70,4,FALSE))","v":"Čermák Tomáš"},{"$f":"IF(AF6<33,\"\",VLOOKUP(33,B6:N70,10,FALSE))","v":694}]
[null,{"$f":"IF(F39=\"\",\"\",N39)","v":51},null,null,"Fay Vlastimil",112,127,97,138,111,{"$f":"SUM(F39:J39)","v":585},{"$f":"MAX(F39:J39)","v":138},{"$f":"SUM(K39*1000)+L39+0.027","v":585138.027},{"$f":"IF(F39=\"\",\"\",RANK(M39,M6:M70,0))","v":51},null,null,null,null,null,null,null,null,null,null,null,null,null,null,null,null,null,null,34,{"$f":"IF(AF6<34,\"\",VLOOKUP(34,B6:N70,4,FALSE))","v":"Skružná Pavla"},{"$f":"IF(AF6<34,\"\",VLOOKUP(34,B6:N70,10,FALSE))","v":686}]
[null,{"$f":"IF(F40=\"\",\"\",N40)","v":28},null,null,"Bošek Jan",157,119,139,129,166,{"$f":"SUM(F40:J40)","v":710},{"$f":"MAX(F40:J40)","v":166},{"$f":"SUM(K40*1000)+L40+0.026","v":710166.02599999995},{"$f":"IF(F40=\"\",\"\",RANK(M40,M6:M70,0))","v":28},null,null,null,null,null,null,null,null,null,null,null,null,null,null,null,null,null,null,35,{"$f":"IF(AF6<35,\"\",VLOOKUP(35,B6:N70,4,FALSE))","v":"Lokvenc Jiří"},{"$f":"IF(AF6<35,\"\",VLOOKUP(35,B6:N70,10,FALSE))","v":684}]
[null,null,null,null,null,{"$f":"SUM(F36:F40)","v":552},{"$f":"SUM(G36:G40)","v":576},{"$f":"SUM(H36:H40)","v":614},{"$f":"SUM(I36:I40)","v":563},{"$f":"SUM(J36:J40)","v":628},null,null,null,null,{"$f":"SUM(F41:J41)","v":2933},{"$f":"MAX(F41:J41)+0.005","v":628.005},{"$f":"IF(F36=\"\",\"\",SUM(O41*1000)+P41)","v":2933628.0049999999},null,null,null,null,null,null,null,null,null,null,null,{"$f":"SUM(O35,O41)","v":6824},null,null,null,36,{"$f":"IF(AF6<36,\"\",VLOOKUP(36,B6:N70,4,FALSE))","v":"Křikava Miroslav"},{"$f":"IF(AF6<36,\"\",VLOOKUP(36,B6:N70,10,FALSE))","v":681}]
[null,{"$f":"IF(F42=\"\",\"\",N42)","v":30},7,"KLÍČOV I.","Pecka Jiří",154,125,148,138,144,{"$f":"SUM(F42:J42)","v":709},{"$f":"MAX(F42:J42)","v":154},{"$f":"SUM(K42*1000)+L42+0.025","v":709154.02500000002},{"$f":"IF(F42=\"\",\"\",RANK(M42,M6:M70,0))","v":30},null,null,null,{"$f":"IF(F42=\"\",\"\",RANK(Q47,Q11:Q71,0))","v":5},null,{"$f":"IF(F42=\"\",\"\",RANK(AA42,AA6:AA64,0))","v":5},{"$f":"IF(R42=\"\",\"\",R42)","v":5},{"$f":"IF(D42=\"\",\"\",D42)","v":"KLÍČOV I."},{"$f":"IF(O47=\"\",\"\",O47)","v":3643},{"$f":"IF(V42=\"HOSTIVAŘ I.\",\"GARÁŽ HOSTIVAŘ\",IF(V42=\"VRŠOVICE I.\",\"GARÁŽ VRŠOVICE\",IF(V42=\"KLÍČOV I.\",\"GARÁŽ KLÍČOV\",IF(V42=\"ŘEPY I.\",\"GARÁŽ ŘEPY\",IF(V42=\"KAČEROV I.\",\"GARÁŽ KAČEROV\",\"\")))))","v":"GARÁŽ KLÍČOV"},{"$f":"MAX(F47:J47,F53:J53)+0.02","v":759.02},{"$f":"SUM(O47,O53)*1000","v":6807000},{"$f":"SUM(Y42:Z42)","v":6807759.0199999996},{"$f":"IF(AC53=\"\",\"\",AC53)","v":6807},null,{"$f":"IF(T42=\"\",\"\",T42)","v":5},null,null,37,{"$f":"IF(AF6<37,\"\",VLOOKUP(37,B6:N70,4,FALSE))","v":"Troller Pavel"},{"$f":"IF(AF6<37,\"\",VLOOKUP(37,B6:N70,10,FALSE))","v":681}]
[null,{"$f":"IF(F43=\"\",\"\",N43)","v":15},null,null,"Novotný Lukáš",145,163,148,160,139,{"$f":"SUM(F43:J43)","v":755},{"$f":"MAX(F43:J43)","v":163},{"$f":"SUM(K43*1000)+L43+0.024","v":755163.02399999998},{"$f":"IF(F43=\"\",\"\",RANK(M43,M6:M70,0))","v":15},null,null,null,null,null,null,null,null,null,null,null,null,null,null,null,null,null,null,38,{"$f":"IF(AF6<38,\"\",VLOOKUP(38,B6:N70,4,FALSE))","v":"Křápek Roman"},{"$f":"IF(AF6<38,\"\",VLOOKUP(38,B6:N70,10,FALSE))","v":679}]
[null,{"$f":"IF(F44=\"\",\"\",N44)","v":10},null,null,"Štěpánek Radek",145,129,167,165,170,{"$f":"SUM(F44:J44)","v":776},{"$f":"MAX(F44:J44)","v":170},{"$f":"SUM(K44*1000)+L44+0.023","v":776170.02300000004},{"$f":"IF(F44=\"\",\"\",RANK(M44,M6:M70,0))","v":10},null,null,null,null,null,null,null,null,null,null,null,null,null,null,null,null,null,null,39,{"$f":"IF(AF6<39,\"\",VLOOKUP(39,B6:N70,4,FALSE))","v":"Veselý Vlastimil"},{"$f":"IF(AF6<39,\"\",VLOOKUP(39,B6:N70,10,FALSE))","v":675}]
[null,{"$f":"IF(F45=\"\",\"\",N45)","v":22},null,null,"Kalfiřt Petr",133,159,155,149,126,{"$f":"SUM(F45:J45)","v":722},{"$f":"MAX(F45:J45)","v":159},{"$f":"SUM(K45*1000)+L45+0.022","v":722159.022},{"$f":"IF(F45=\"\",\"\",RANK(M45,M6:M70,0))","v":22},null,null,null,null,null,null,null,null,null,null,null,null,null,null,null,null,null,null,40,{"$f":"IF(AF6<40,\"\",VLOOKUP(40,B6:N70,4,FALSE))","v":"Červenka Ivan"},{"$f":"IF(AF6<40,\"\",VLOOKUP(40,B6:N70,10,FALSE))","v":668}]
[null,{"$f":"IF(F46=\"\",\"\",N46)","v":37},null,null,"Troller Pavel",132,128,141,132,148,{"$f":"SUM(F46:J46)","v":681},{"$f":"MAX(F46:J46)","v":148},{"$f":"SUM(K46*1000)+L46+0.021","v":681148.02099999995},{"$f":"IF(F46=\"\",\"\",RANK(M46,M6:M70,0))","v":37},null,null,null,null,null,null,null,null,null,null,null,null,null,null,null,null,null,null,41,{"$f":"IF(AF6<41,\"\",VLOOKUP(41,B6:N70,4,FALSE))","v":"Mysliveček Jaroslav"},{"$f":"IF(AF6<41,\"\",VLOOKUP(41,B6:N70,10,FALSE))","v":667}]
[null,null,null,null,null,{"$f":"SUM(F42:F46)","v":709},{"$f":"SUM(G42:G46)","v":704},{"$f":"SUM(H42:H46)","v":759},{"$f":"SUM(I42:I46)","v":744},{"$f":"SUM(J42:J46)","v":727},null,null,null,null,{"$f":"SUM(F47:J47)","v":3643},{"$f":"MAX(F47:J47)+0.004","v":759.00400000000002},{"$f":"IF(F42=\"\",\"\",SUM(O47*1000)+P47)","v":3643759.0040000002},null,null,null,null,null,null,null,null,null,null,null,null,null,null,null,42,{"$f":"IF(AF6<42,\"\",VLOOKUP(42,B6:N70,4,FALSE))","v":"Alba Vladimír"},{"$f":"IF(AF6<42,\"\",VLOOKUP(42,B6:N70,10,FALSE))","v":654}]
[null,{"$f":"IF(F48=\"\",\"\",N48)","v":52},8,"KLÍČOV II.","Novotná Petra",91,145,110,130,99,{"$f":"SUM(F48:J48)","v":575},{"$f":"MAX(F48:J48)","v":145},{"$f":"SUM(K48*1000)+L48+0.02","v":575145.02},{"$f":"IF(F48=\"\",\"\",RANK(M48,M6:M70,0))","v":52},null,null,null,{"$f":"IF(F48=\"\",\"\",RANK(Q53,Q11:Q71,0))","v":10},null,null,{"$f":"IF(R48=\"\",\"\",R48)","v":10},{"$f":"IF(D48=\"\",\"\",D48)","v":"KLÍČOV II."},{"$f":"IF(O53=\"\",\"\",O53)","v":3164},null,null,null,null,null,null,null,null,null,43,{"$f":"IF(AF6<43,\"\",VLOOKUP(43,B6:N70,4,FALSE))","v":"Růžička Václav"},{"$f":"IF(AF6<43,\"\",VLOOKUP(43,B6:N70,10,FALSE))","v":653}]
[null,{"$f":"IF(F49=\"\",\"\",N49)","v":50},null,null,"Neshyba Jaroslav",139,94,113,97,144,{"$f":"SUM(F49:J49)","v":587},{"$f":"MAX(F49:J49)","v":144},{"$f":"SUM(K49*1000)+L49+0.019","v":587144.01899999997},{"$f":"IF(F49=\"\",\"\",RANK(M49,M6:M70,0))","v":50},null,null,null,null,null,null,null,null,null,null,null,null,null,null,null,null,null,null,44,{"$f":"IF(AF6<44,\"\",VLOOKUP(44,B6:N70,4,FALSE))","v":"Kutina Pavel"},{"$f":"IF(AF6<44,\"\",VLOOKUP(44,B6:N70,10,FALSE))","v":651}]
[null,{"$f":"IF(F50=\"\",\"\",N50)","v":54},null,null,"Doman Marcel",93,99,90,87,123,{"$f":"SUM(F50:J50)","v":492},{"$f":"MAX(F50:J50)","v":123},{"$f":"SUM(K50*1000)+L50+0.018","v":492123.01799999998},{"$f":"IF(F50=\"\",\"\",RANK(M50,M6:M70,0))","v":54},null,null,null,null,null,null,null,null,null,null,null,null,null,null,null,null,null,null,45,{"$f":"IF(AF6<45,\"\",VLOOKUP(45,B6:N70,4,FALSE))","v":"Šafář Ladislav"},{"$f":"IF(AF6<45,\"\",VLOOKUP(45,B6:N70,10,FALSE))","v":622}]
[null,{"$f":"IF(F51=\"\",\"\",N51)","v":6},null,null,"Kolář Ladislav",128,171,134,176,217,{"$f":"SUM(F51:J51)","v":826},{"$f":"MAX(F51:J51)","v":217},{"$f":"SUM(K51*1000)+L51+0.017","v":826217.01699999999},{"$f":"IF(F51=\"\",\"\",RANK(M51,M6:M70,0))","v":6},null,null,null,null,null,null,null,null,null,null,null,null,null,null,null,null,null,null,46,{"$f":"IF(AF6<46,\"\",VLOOKUP(46,B6:N70,4,FALSE))","v":"Mottl Pavel"},{"$f":"IF(AF6<46,\"\",VLOOKUP(46,B6:N70,10,FALSE))","v":621}]
[null,{"$f":"IF(F52=\"\",\"\",N52)","v":35},null,null,"Lokvenc Jiří",122,146,148,141,127,{"$f":"SUM(F52:J52)","v":684},{"$f":"MAX(F52:J52)","v":148},{"$f":"SUM(K52*1000)+L52+0.016","v":684148.01599999995},{"$f":"IF(F52=\"\",\"\",RANK(M52,M6:M70,0))","v":35},null,null,null,null,null,null,null,null,null,null,null,null,null,null,null,null,null,null,47,{"$f":"IF(AF6<47,\"\",VLOOKUP(47,B6:N70,4,FALSE))","v":"Lazurová Jiřina"},{"$f":"IF(AF6<47,\"\",VLOOKUP(47,B6:N70,10,FALSE))","v":606}]
[null,null,null,null,null,{"$f":"SUM(F48:F52)","v":573},{"$f":"SUM(G48:G52)","v":655},{"$f":"SUM(H48:H52)","v":595},{"$f":"SUM(I48:I52)","v":631},{"$f":"SUM(J48:J52)","v":710},null,null,null,null,{"$f":"SUM(F53:J53)","v":3164},{"$f":"MAX(F53:J53)+0.003","v":710.00300000000004},{"$f":"IF(F48=\"\",\"\",SUM(O53*1000)+P53)","v":3164710.003},null,null,null,null,null,null,null,null,null,null,null,{"$f":"SUM(O47,O53)","v":6807},null,null,null,48,{"$f":"IF(AF6<48,\"\",VLOOKUP(48,B6:N70,4,FALSE))","v":"Jelínek Jan"},{"$f":"IF(AF6<48,\"\",VLOOKUP(48,B6:N70,10,FALSE))","v":606}]
[null,{"$f":"IF(F54=\"\",\"\",N54)","v":8},9,"ŘEPY I.","Dvořák Petr",187,144,125,175,168,{"$f":"SUM(F54:J54)","v":799},{"$f":"MAX(F54:J54)","v":187},{"$f":"SUM(K54*1000)+L54+0.015","v":799187.01500000001},{"$f":"IF(F54=\"\",\"\",RANK(M54,M6:M70,0))","v":8},null,null,null,{"$f":"IF(F54=\"\",\"\",RANK(Q59,Q11:Q71,0))","v":2},null,{"$f":"IF(F54=\"\",\"\",RANK(AA54,AA6:AA64,0))","v":1},{"$f":"IF(R54=\"\",\"\",R54)","v":2},{"$f":"IF(D54=\"\",\"\",D54)","v":"ŘEPY I."},{"$f":"IF(O59=\"\",\"\",O59)","v":3853},{"$f":"IF(V54=\"HOSTIVAŘ I.\",\"GARÁŽ HOSTIVAŘ\",IF(V54=\"VRŠOVICE I.\",\"GARÁŽ VRŠOVICE\",IF(V54=\"KLÍČOV I.\",\"GARÁŽ KLÍČOV\",IF(V54=\"ŘEPY I.\",\"GARÁŽ ŘEPY\",IF(V54=\"KAČEROV I.\",\"GARÁŽ KAČEROV\",\"\")))))","v":"GARÁŽ ŘEPY"},{"$f":"MAX(F59:J59,F65:J65)+0.01","v":843.01},{"$f":"SUM(O59,O65)*1000","v":7429000},{"$f":"SUM(Y54:Z54)","v":7429843.0099999998},{"$f":"IF(AC65=\"\",\"\",AC65)","v":7429},null,{"$f":"IF(T54=\"\",\"\",T54)","v":1},null,null,49,{"$f":"IF(AF6<49,\"\",VLOOKUP(49,B6:N70,4,FALSE))","v":"Sehnal Ivan"},{"$f":"IF(AF6<49,\"\",VLOOKUP(49,B6:N70,10,FALSE))","v":603}]
[null,{"$f":"IF(F55=\"\",\"\",N55)","v":12},null,null,"Ekert Stanislav",129,149,194,150,139,{"$f":"SUM(F55:J55)","v":761},{"$f":"MAX(F55:J55)","v":194},{"$f":"SUM(K55*1000)+L55+0.014","v":761194.01399999997},{"$f":"IF(F55=\"\",\"\",RANK(M55,M6:M70,0))","v":12},null,null,null,null,null,null,null,null,null,null,null,null,null,null,null,null,null,null,50,{"$f":"IF(AF6<50,\"\",VLOOKUP(50,B6:N70,4,FALSE))","v":"Neshyba Jaroslav"},{"$f":"IF(AF6<50,\"\",VLOOKUP(50,B6:N70,10,FALSE))","v":587}]
[null,{"$f":"IF(F56=\"\",\"\",N56)","v":11},null,null,"Froněk Martin",202,170,168,116,116,{"$f":"SUM(F56:J56)","v":772},{"$f":"MAX(F56:J56)","v":202},{"$f":"SUM(K56*1000)+L56+0.013","v":772202.01300000004},{"$f":"IF(F56=\"\",\"\",RANK(M56,M6:M70,0))","v":11},null,null,null,null,null,null,null,null,null,null,null,null,null,null,null,null,null,null,51,{"$f":"IF(AF6<51,\"\",VLOOKUP(51,B6:N70,4,FALSE))","v":"Fay Vlastimil"},{"$f":"IF(AF6<51,\"\",VLOOKUP(51,B6:N70,10,FALSE))","v":585}]
[null,{"$f":"IF(F57=\"\",\"\",N57)","v":32},null,null,"Sladovník Miloslav",130,146,176,131,111,{"$f":"SUM(F57:J57)","v":694},{"$f":"MAX(F57:J57)","v":176},{"$f":"SUM(K57*1000)+L57+0.012","v":694176.01199999999},{"$f":"IF(F57=\"\",\"\",RANK(M57,M6:M70,0))","v":32},null,null,null,null,null,null,null,null,null,null,null,null,null,null,null,null,null,null,52,{"$f":"IF(AF6<52,\"\",VLOOKUP(52,B6:N70,4,FALSE))","v":"Novotná Petra"},{"$f":"IF(AF6<52,\"\",VLOOKUP(52,B6:N70,10,FALSE))","v":575}]
[null,{"$f":"IF(F58=\"\",\"\",N58)","v":5},null,null,"Kocůr Jaroslav",163,173,180,154,157,{"$f":"SUM(F58:J58)","v":827},{"$f":"MAX(F58:J58)","v":180},{"$f":"SUM(K58*1000)+L58+0.011","v":827180.01100000006},{"$f":"IF(F58=\"\",\"\",RANK(M58,M6:M70,0))","v":5},null,null,null,null,null,null,null,null,null,null,null,null,null,null,null,null,null,null,53,{"$f":"IF(AF6<53,\"\",VLOOKUP(53,B6:N70,4,FALSE))","v":"Aunický Ftantišek"},{"$f":"IF(AF6<53,\"\",VLOOKUP(53,B6:N70,10,FALSE))","v":530}]
[null,null,null,null,null,{"$f":"SUM(F54:F58)","v":811},{"$f":"SUM(G54:G58)","v":782},{"$f":"SUM(H54:H58)","v":843},{"$f":"SUM(I54:I58)","v":726},{"$f":"SUM(J54:J58)","v":691},null,null,null,null,{"$f":"SUM(F59:J59)","v":3853},{"$f":"MAX(F59:J59)+0.002","v":843.00199999999995},{"$f":"IF(F54=\"\",\"\",SUM(O59*1000)+P59)","v":3853843.0019999999},null,null,null,null,null,null,null,null,null,null,null,null,null,null,null,54,{"$f":"IF(AF6<54,\"\",VLOOKUP(54,B6:N70,4,FALSE))","v":"Doman Marcel"},{"$f":"IF(AF6<54,\"\",VLOOKUP(54,B6:N70,10,FALSE))","v":492}]
[null,{"$f":"IF(F60=\"\",\"\",N60)","v":42},10,"ŘEPY II.","Alba Vladimír",133,103,148,142,128,{"$f":"SUM(F60:J60)","v":654},{"$f":"MAX(F60:J60)","v":148},{"$f":"SUM(K60*1000)+L60+0.01","v":654148.01},{"$f":"IF(F60=\"\",\"\",RANK(M60,M6:M70,0))","v":42},null,null,null,{"$f":"IF(F60=\"\",\"\",RANK(Q65,Q11:Q71,0))","v":6},null,null,{"$f":"IF(R60=\"\",\"\",R60)","v":6},{"$f":"IF(D60=\"\",\"\",D60)","v":"ŘEPY II."},{"$f":"IF(O65=\"\",\"\",O65)","v":3576},null,null,null,null,null,null,null,null,null,55,{"$f":"IF(AF6<55,\"\",VLOOKUP(55,B6:N70,4,FALSE))","v":"Liebichová Inke"},{"$f":"IF(AF6<55,\"\",VLOOKUP(55,B6:N70,10,FALSE))","v":433}]
[null,{"$f":"IF(F61=\"\",\"\",N61)","v":24},null,null,"Kročil Tomáš",156,147,169,137,112,{"$f":"SUM(F61:J61)","v":721},{"$f":"MAX(F61:J61)","v":169},{"$f":"SUM(K61*1000)+L61+0.009","v":721169.00899999996},{"$f":"IF(F61=\"\",\"\",RANK(M61,M6:M70,0))","v":24}]
[null,{"$f":"IF(F62=\"\",\"\",N62)","v":31},null,null,"Ekert Michal",121,165,139,135,141,{"$f":"SUM(F62:J62)","v":701},{"$f":"MAX(F62:J62)","v":165},{"$f":"SUM(K62*1000)+L62+0.008","v":701165.00800000003},{"$f":"IF(F62=\"\",\"\",RANK(M62,M6:M70,0))","v":31}]
[null,{"$f":"IF(F63=\"\",\"\",N63)","v":29},null,null,"Křikavová Miroslava",112,150,148,124,175,{"$f":"SUM(F63:J63)","v":709},{"$f":"MAX(F63:J63)","v":175},{"$f":"SUM(K63*1000)+L63+0.007","v":709175.00699999998},{"$f":"IF(F63=\"\",\"\",RANK(M63,M6:M70,0))","v":29}]
[null,{"$f":"IF(F64=\"\",\"\",N64)","v":9},null,null,"Pospíšil Václav",149,144,199,145,154,{"$f":"SUM(F64:J64)","v":791},{"$f":"MAX(F64:J64)","v":199},{"$f":"SUM(K64*1000)+L64+0.006","v":791199.00600000005},{"$f":"IF(F64=\"\",\"\",RANK(M64,M6:M70,0))","v":9}]
[null,null,null,null,null,{"$f":"SUM(F60:F64)","v":671},{"$f":"SUM(G60:G64)","v":709},{"$f":"SUM(H60:H64)","v":803},{"$f":"SUM(I60:I64)","v":683},{"$f":"SUM(J60:J64)","v":710},null,null,null,null,{"$f":"SUM(F65:J65)","v":3576},{"$f":"MAX(F65:J65)+0.001","v":803.00099999999998},{"$f":"IF(F60=\"\",\"\",SUM(O65*1000)+P65)","v":3576803.0010000002},null,null,null,null,null,null,null,null,null,null,null,{"$f":"SUM(O59,O65)","v":7429}]
[null,{"$f":"IF(F66=\"\",\"\",N66)","v":46},11,"ŘEPY III.","Mottl Pavel",119,111,122,123,146,{"$f":"SUM(F66:J66)","v":621},{"$f":"MAX(F66:J66)","v":146},{"$f":"SUM(K66*1000)+L66-0.005","v":621145.995},{"$f":"IF(F66=\"\",\"\",RANK(M66,M6:M70,0))","v":46},null,null,null,{"$f":"IF(F66=\"\",\"\",RANK(Q71,Q11:Q71,0))","v":8},null,null,{"$f":"IF(R66=\"\",\"\",R66)","v":8},{"$f":"IF(D66=\"\",\"\",D66)","v":"ŘEPY III."},{"$f":"IF(O71=\"\",\"\",O71)","v":3226},null,null,null,null,null,null,{"$f":"IF(E66=\"\",\"\",\"Mimo soutěž garáží\")","v":"Mimo soutěž garáží"}]
[null,{"$f":"IF(F67=\"\",\"\",N67)","v":36},null,null,"Křikava Miroslav",121,119,143,156,142,{"$f":"SUM(F67:J67)","v":681},{"$f":"MAX(F67:J67)","v":156},{"$f":"SUM(K67*1000)+L67-0.004","v":681155.99600000004},{"$f":"IF(F67=\"\",\"\",RANK(M67,M6:M70,0))","v":36}]
[null,{"$f":"IF(F68=\"\",\"\",N68)","v":40},null,null,"Červenka Ivan",108,133,117,149,161,{"$f":"SUM(F68:J68)","v":668},{"$f":"MAX(F68:J68)","v":161},{"$f":"SUM(K68*1000)+L68-0.003","v":668160.99699999997},{"$f":"IF(F68=\"\",\"\",RANK(M68,M6:M70,0))","v":40}]
[null,{"$f":"IF(F69=\"\",\"\",N69)","v":43},null,null,"Růžička Václav",132,137,104,167,113,{"$f":"SUM(F69:J69)","v":653},{"$f":"MAX(F69:J69)","v":167},{"$f":"SUM(K69*1000)+L69+0.002","v":653167.00199999998},{"$f":"IF(F69=\"\",\"\",RANK(M69,M6:M70,0))","v":43}]
[null,{"$f":"IF(F70=\"\",\"\",N70)","v":49},null,null,"Sehnal Ivan",108,104,132,126,133,{"$f":"SUM(F70:J70)","v":603},{"$f":"MAX(F70:J70)","v":133},{"$f":"SUM(K70*1000)+L70+0.001","v":603133.00100000005},{"$f":"IF(F70=\"\",\"\",RANK(M70,M6:M70,0))","v":49}]
[null,null,null,null,null,{"$f":"SUM(F66:F70)","v":588},{"$f":"SUM(G66:G70)","v":604},{"$f":"SUM(H66:H70)","v":618},{"$f":"SUM(I66:I70)","v":721},{"$f":"SUM(J66:J70)","v":695},null,{"$f":"MAX(L12:L70,L6:L10)","v":223},null,null,{"$f":"SUM(F71:J71)","v":3226},{"$f":"MAX(F71:J71)","v":721},{"$f":"IF(F66=\"\",\"\",SUM(O71*1000)+P71)","v":3226721}]

{"sheet":"KLÍČOV","index":5,"n_rows":65,"n_cols":53,"rows_kept":65,"cut":false,"hidden":false,"merged":[[2,3,2,39],[64,28,64,29],[52,28,52,29],[53,2,57,2],[53,3,57,3],[53,17,57,17],[53,29,63,29],[59,2,63,2],[59,3,63,3],[59,17,63,17],[35,3,39,3],[35,17,39,17],[40,28,40,29],[41,2,45,2],[41,3,45,3],[41,17,45,17],[41,29,51,29],[47,2,51,2],[47,3,51,3],[47,17,51,17],[17,37,17,39],[23,2,27,2],[23,3,27,3],[23,17,27,17],[28,28,28,29],[29,2,33,2],[29,3,33,3],[29,17,33,17],[29,29,39,29],[35,2,39,2],[11,3,15,3],[11,17,15,17],[16,28,16,29],[17,2,21,2],[17,3,21,3],[17,17,21,17],[17,29,27,29],[5,37,5,39],[0,0,3,0],[4,2,4,3],[4,13,4,14],[4,32,4,34],[5,2,9,2],[5,3,9,3],[5,17,9,17],[5,29,15,29],[11,2,15,2]]}
["ZPĚT"]
[]
[null,null,null,"Sportovní turnaj v Bowlingu o pohár ZV-OS Klíčov dne 28.2. 2015"]
[]
[null,null,"Garáž",null,"Jméno","I.","II.","III.","IV.","V.","Body",null,null,"Jednotlivci.",null,null,null,"Družstva.",null,null,null,null,null,null,null,null,null,null,null,null,null,null,"pořadí jednotlivců"]
[null,{"$f":"IF(F6=\"\",\"\",N6)","v":""},1,"ŘEPY I.",null,null,null,null,null,null,{"$f":"SUM(F6:J6)","v":0},{"$f":"MAX(F6:J6)","v":0},{"$f":"SUM(K6*1000)+L6+0.5","v":0.5},{"$f":"IF(F6=\"\",\"\",RANK(M6,M6:M65,0))","v":""},null,null,null,{"$f":"IF(F6=\"\",\"\",RANK(Q11,Q11:Q65,0))","v":""},null,{"$f":"IF(F6=\"\",\"\",RANK(AA6,AA6:AA64,0))","v":""},{"$f":"IF(R6=\"\",\"\",R6)","v":""},{"$f":"IF(D6=\"\",\"\",D6)","v":"ŘEPY I."},{"$f":"IF(O11=\"\",\"\",O11)","v":0},{"$f":"IF(V6=\"HOSTIVAŘ I.\",\"GARÁŽ HOSTIVAŘ\",IF(V6=\"VRŠOVICE I.\",\"GARÁŽ VRŠOVICE\",IF(V6=\"KLÍČOV I.\",\"GARÁŽ KLÍČOV\",IF(V6=\"ŘEPY I.\",\"GARÁŽ ŘEPY\",IF(V6=\"KAČEROV I.\",\"GARÁŽ KAČEROV\",\"\")))))","v":"GARÁŽ ŘEPY"},{"$f":"MAX(F11:J11,F17:J17)+0.05","v":0.05},{"$f":"SUM(O11,O17)*1000","v":0},{"$f":"SUM(Y6:Z6)","v":0.05},{"$f":"IF(AC17=\"\",\"\",AC17)","v":0},null,{"$f":"IF(T6=\"\",\"\",T6)","v":""},null,{"$f":"COUNT(F6:F10,F12:F16,F18:F22,F24:F28,F30:F34,F36:F40,F42:F46,F48:F52,F54:F58,F60:F64)","v":0},1,{"$f":"IF(AF6<1,\"\",VLOOKUP(1,B6:N65,4,FALSE))","v":""},{"$f":"IF(AF6<1,\"\",VLOOKUP(1,B6:N65,10,FALSE))","v":""},null,{"$f":"COUNT(U6:U16,U18:U28,U30:U40,U42:U52,U54:U64)","v":0},"POŘADÍ DRUŽSTEV",null,null,null,null,null,null,null,null,null,null,null,null,null,null,"HOSTIVAŘ I."]
[null,{"$f":"IF(F7=\"\",\"\",N7)","v":""},null,null,null,null,null,null,null,null,{"$f":"SUM(F7:J7)","v":0},0,{"$f":"SUM(K7*1000)+L7+0.49","v":0.49},{"$f":"IF(F7=\"\",\"\",RANK(M7,M6:M65,0))","v":""},null,null,null,null,null,null,null,null,null,null,null,null,null,null,null,null,null,null,{"$f":"SUM(AG6+1)","v":2},{"$f":"IF(AF6<2,\"\",VLOOKUP(2,B6:N65,4,FALSE))","v":""},{"$f":"IF(AF6<2,\"\",VLOOKUP(2,B6:N65,10,FALSE))","v":""},null,null,1,{"$f":"IF(AK6<1,\"\",VLOOKUP(1,U6:W64,2,FALSE))","v":""},{"$f":"IF(AK6<1,\"\",VLOOKUP(1,U6:W64,3,FALSE))","v":""},null,null,null,null,null,null,null,null,null,null,null,null,"VRŠOVICE I."]
[null,{"$f":"IF(F8=\"\",\"\",N8)","v":""},null,null,null,null,null,null,null,null,{"$f":"SUM(F8:J8)","v":0},0,{"$f":"SUM(K8*1000)+L8+0.48","v":0.48},{"$f":"IF(F8=\"\",\"\",RANK(M8,M6:M65,0))","v":""},null,null,null,null,null,null,null,null,null,null,null,null,null,null,null,null,null,null,{"$f":"SUM(AG7+1)","v":3},{"$f":"IF(AF6<3,\"\",VLOOKUP(3,B6:N65,4,FALSE))","v":""},{"$f":"IF(AF6<3,\"\",VLOOKUP(3,B6:N65,10,FALSE))","v":""},null,null,2,{"$f":"IF(AK6<2,\"\",VLOOKUP(2,U6:W64,2,FALSE))","v":""},{"$f":"IF(AK6<2,\"\",VLOOKUP(2,U6:W64,3,FALSE))","v":""},null,null,null,null,null,null,null,null,null,null,null,null,"KLÍČOV I."]
[null,{"$f":"IF(F9=\"\",\"\",N9)","v":""},null,null,null,null,null,null,null,null,{"$f":"SUM(F9:J9)","v":0},0,{"$f":"SUM(K9*1000)+L9+0.47","v":0.47},{"$f":"IF(F9=\"\",\"\",RANK(M9,M6:M65,0))","v":""},null,null,null,null,null,null,null,null,null,null,null,null,null,null,null,null,null,null,4,{"$f":"IF(AF6<4,\"\",VLOOKUP(4,B6:N65,4,FALSE))","v":""},{"$f":"IF(AF6<4,\"\",VLOOKUP(4,B6:N65,10,FALSE))","v":""},null,null,3,{"$f":"IF(AK6<3,\"\",VLOOKUP(3,U6:W64,2,FALSE))","v":""},{"$f":"IF(AK6<3,\"\",VLOOKUP(3,U6:W64,3,FALSE))","v":""},null,null,null,null,null,null,null,null,null,null,null,null,"ŘEPY I."]
[null,{"$f":"IF(F10=\"\",\"\",N10)","v":""},null,null,null,null,null,null,null,null,{"$f":"SUM(F10:J10)","v":0},0,{"$f":"SUM(K10*1000)+L10+0.46","v":0.46},{"$f":"IF(F10=\"\",\"\",RANK(M10,M6:M65,0))","v":""},null,null,null,null,null,null,null,null,null,null,null,null,null,null,null,null,null,null,5,{"$f":"IF(AF6<5,\"\",VLOOKUP(5,B6:N65,4,FALSE))","v":""},{"$f":"IF(AF6<5,\"\",VLOOKUP(5,B6:N65,10,FALSE))","v":""},null,null,4,{"$f":"IF(AK6<4,\"\",VLOOKUP(4,U6:W64,2,FALSE))","v":""},{"$f":"IF(AK6<4,\"\",VLOOKUP(4,U6:W64,3,FALSE))","v":""},null,null,null,null,null,null,null,null,null,null,null,null,"KAČEROV I."]
[null,null,null,null,null,{"$f":"SUM(F6:F10)","v":0},{"$f":"SUM(G6:G10)","v":0},{"$f":"SUM(H6:H10)","v":0},{"$f":"SUM(I6:I10)","v":0},{"$f":"SUM(J6:J10)","v":0},null,0,null,null,{"$f":"SUM(F11:J11)","v":0},{"$f":"MAX(F11:J11)+0.01","v":0.01},{"$f":"IF(F6=\"\",\"\",SUM(O11*1000)+P11)","v":""},null,null,null,null,null,null,null,null,null,null,null,null,null,null,null,6,{"$f":"IF(AF6<6,\"\",VLOOKUP(6,B6:N65,4,FALSE))","v":""},{"$f":"IF(AF6<6,\"\",VLOOKUP(6,B6:N65,10,FALSE))","v":""},null,null,5,{"$f":"IF(AK6<5,\"\",VLOOKUP(5,U6:W64,2,FALSE))","v":""},{"$f":"IF(AK6<5,\"\",VLOOKUP(5,U6:W64,3,FALSE))","v":""}]
[null,{"$f":"IF(F12=\"\",\"\",N12)","v":""},2,"ŘEPY II.",null,null,null,null,null,null,{"$f":"SUM(F12:J12)","v":0},0,{"$f":"SUM(K12*1000)+L12+0.45","v":0.45},{"$f":"IF(F12=\"\",\"\",RANK(M12,M6:M65,0))","v":""},null,null,null,{"$f":"IF(F12=\"\",\"\",RANK(Q17,Q11:Q65,0))","v":""},null,null,{"$f":"IF(R12=\"\",\"\",R12)","v":""},{"$f":"IF(D12=\"\",\"\",D12)","v":"ŘEPY II."},{"$f":"IF(O17=\"\",\"\",O17)","v":0},null,null,null,null,null,null,null,null,null,7,{"$f":"IF(AF6<7,\"\",VLOOKUP(7,B6:N65,4,FALSE))","v":""},{"$f":"IF(AF6<7,\"\",VLOOKUP(7,B6:N65,10,FALSE))","v":""},null,null,6,{"$f":"IF(AK6<6,\"\",VLOOKUP(6,U6:W64,2,FALSE))","v":""},{"$f":"IF(AK6<6,\"\",VLOOKUP(6,U6:W64,3,FALSE))","v":""}]
[null,{"$f":"IF(F13=\"\",\"\",N13)","v":""},null,null,null,null,null,null,null,null,{"$f":"SUM(F13:J13)","v":0},0,{"$f":"SUM(K13*1000)+L13+0.44","v":0.44},{"$f":"IF(F13=\"\",\"\",RANK(M13,M6:M65,0))","v":""},null,null,null,null,null,null,null,null,null,null,null,null,null,null,null,null,null,null,8,{"$f":"IF(AF6<8,\"\",VLOOKUP(8,B6:N65,4,FALSE))","v":""},{"$f":"IF(AF6<8,\"\",VLOOKUP(8,B6:N65,10,FALSE))","v":""},null,null,7,{"$f":"IF(AK6<7,\"\",VLOOKUP(7,U6:W64,2,FALSE))","v":""},{"$f":"IF(AK6<7,\"\",VLOOKUP(7,U6:W64,3,FALSE))","v":""}]
[null,{"$f":"IF(F14=\"\",\"\",N14)","v":""},null,null,null,null,null,null,null,null,{"$f":"SUM(F14:J14)","v":0},0,{"$f":"SUM(K14*1000)+L14+0.43","v":0.43},{"$f":"IF(F14=\"\",\"\",RANK(M14,M6:M65,0))","v":""},null,null,null,null,null,null,null,null,null,null,null,null,null,null,null,null,null,null,9,{"$f":"IF(AF6<9,\"\",VLOOKUP(9,B6:N65,4,FALSE))","v":""},{"$f":"IF(AF6<9,\"\",VLOOKUP(9,B6:N65,10,FALSE))","v":""},null,null,8,{"$f":"IF(AK6<8,\"\",VLOOKUP(8,U6:W64,2,FALSE))","v":""},{"$f":"IF(AK6<8,\"\",VLOOKUP(8,U6:W64,3,FALSE))","v":""}]
[null,{"$f":"IF(F15=\"\",\"\",N15)","v":""},null,null,null,null,null,null,null,null,{"$f":"SUM(F15:J15)","v":0},0,{"$f":"SUM(K15*1000)+L15+0.42","v":0.42},{"$f":"IF(F15=\"\",\"\",RANK(M15,M6:M65,0))","v":""},null,null,null,null,null,null,null,null,null,null,null,null,null,null,null,null,null,null,10,{"$f":"IF(AF6<10,\"\",VLOOKUP(10,B6:N65,4,FALSE))","v":""},{"$f":"IF(AF6<10,\"\",VLOOKUP(10,B6:N65,10,FALSE))","v":""},null,null,9,{"$f":"IF(AK6<9,\"\",VLOOKUP(9,U6:W64,2,FALSE))","v":""},{"$f":"IF(AK6<9,\"\",VLOOKUP(9,U6:W64,3,FALSE))","v":""}]
[null,{"$f":"IF(F16=\"\",\"\",N16)","v":""},null,null,null,null,null,null,null,null,{"$f":"SUM(F16:J16)","v":0},0,{"$f":"SUM(K16*1000)+L16+0.41","v":0.41},{"$f":"IF(F16=\"\",\"\",RANK(M16,M6:M65,0))","v":""},null,null,null,null,null,null,null,null,null,null,null,null,null,null,null,null,null,null,11,{"$f":"IF(AF6<11,\"\",VLOOKUP(11,B6:N65,4,FALSE))","v":""},{"$f":"IF(AF6<11,\"\",VLOOKUP(11,B6:N65,10,FALSE))","v":""},null,null,10,{"$f":"IF(AK6<10,\"\",VLOOKUP(10,U6:W64,2,FALSE))","v":""},{"$f":"IF(AK6<10,\"\",VLOOKUP(10,U6:W64,3,FALSE))","v":""}]
[null,null,null,null,null,{"$f":"SUM(F12:F16)","v":0},{"$f":"SUM(G12:G16)","v":0},{"$f":"SUM(H12:H16)","v":0},{"$f":"SUM(I12:I16)","v":0},{"$f":"SUM(J12:J16)","v":0},null,null,null,null,{"$f":"SUM(F17:J17)","v":0},{"$f":"MAX(F17:J17)+0.009","v":8.9999999999999993E-3},{"$f":"IF(F12=\"\",\"\",SUM(O17*1000)+P17)","v":""},null,null,null,null,null,null,null,null,null,null,null,{"$f":"SUM(O11,O17)","v":0},null,null,null,12,{"$f":"IF(AF6<12,\"\",VLOOKUP(12,B6:N65,4,FALSE))","v":""},{"$f":"IF(AF6<12,\"\",VLOOKUP(12,B6:N65,10,FALSE))","v":""}]
[null,{"$f":"IF(F18=\"\",\"\",N18)","v":""},3,"KAČEROV I.",null,null,null,null,null,null,{"$f":"SUM(F18:J18)","v":0},{"$f":"MAX(F18:J18)","v":0},{"$f":"SUM(K18*1000)+L18+0.4","v":0.4},{"$f":"IF(F18=\"\",\"\",RANK(M18,M6:M65,0))","v":""},null,null,null,{"$f":"IF(F18=\"\",\"\",RANK(Q23,Q11:Q65,0))","v":""},null,{"$f":"IF(F18=\"\",\"\",RANK(AA18,AA6:AA64,0))","v":""},{"$f":"IF(R18=\"\",\"\",R18)","v":""},{"$f":"IF(D18=\"\",\"\",D18)","v":"KAČEROV I."},{"$f":"IF(O23=\"\",\"\",O23)","v":0},{"$f":"IF(V18=\"HOSTIVAŘ I.\",\"GARÁŽ HOSTIVAŘ\",IF(V18=\"VRŠOVICE I.\",\"GARÁŽ VRŠOVICE\",IF(V18=\"KLÍČOV I.\",\"GARÁŽ KLÍČOV\",IF(V18=\"ŘEPY I.\",\"GARÁŽ ŘEPY\",IF(V18=\"KAČEROV I.\",\"GARÁŽ KAČEROV\",\"\")))))","v":"GARÁŽ KAČEROV"},{"$f":"MAX(F23:J23,F29:J29)+0.04","v":0.04},{"$f":"SUM(O23,O29)*1000","v":0},{"$f":"SUM(Y18:Z18)","v":0.04},{"$f":"IF(AC29=\"\",\"\",AC29)","v":0},null,{"$f":"IF(T18=\"\",\"\",T18)","v":""},null,null,13,{"$f":"IF(AF6<13,\"\",VLOOKUP(13,B6:N65,4,FALSE))","v":""},{"$f":"IF(AF6<13,\"\",VLOOKUP(13,B6:N65,10,FALSE))","v":""},null,{"$f":"COUNT(T6:T64)","v":0},"POŘEDÍ GARÁŽÍ"]
[null,{"$f":"IF(F19=\"\",\"\",N19)","v":""},null,null,null,null,null,null,null,null,{"$f":"SUM(F19:J19)","v":0},{"$f":"MAX(F19:J19)","v":0},{"$f":"SUM(K19*1000)+L19+0.39","v":0.39},{"$f":"IF(F19=\"\",\"\",RANK(M19,M6:M65,0))","v":""},null,null,null,null,null,null,null,null,null,null,null,null,null,null,null,null,null,null,14,{"$f":"IF(AF6<14,\"\",VLOOKUP(14,B6:N65,4,FALSE))","v":""},{"$f":"IF(AF6<14,\"\",VLOOKUP(14,B6:N65,10,FALSE))","v":""},null,null,1,{"$f":"IF(AK18<1,\"\",VLOOKUP(1,T6:AB64,5,FALSE))","v":""},{"$f":"IF(AK18<1,\"\",VLOOKUP(1,T6:AB64,9,FALSE))","v":""}]
[null,{"$f":"IF(F20=\"\",\"\",N20)","v":""},null,null,null,null,null,null,null,null,{"$f":"SUM(F20:J20)","v":0},{"$f":"MAX(F20:J20)","v":0},{"$f":"SUM(K20*1000)+L20+0.38","v":0.38},{"$f":"IF(F20=\"\",\"\",RANK(M20,M6:M65,0))","v":""},null,null,null,null,null,null,null,null,null,null,null,null,null,null,null,null,null,null,15,{"$f":"IF(AF6<15,\"\",VLOOKUP(15,B6:N65,4,FALSE))","v":""},{"$f":"IF(AF6<15,\"\",VLOOKUP(15,B6:N65,10,FALSE))","v":""},null,null,2,{"$f":"IF(AK18<2,\"\",VLOOKUP(2,T6:AB64,5,FALSE))","v":""},{"$f":"IF(AK18<2,\"\",VLOOKUP(2,T6:AB64,9,FALSE))","v":""}]
[null,{"$f":"IF(F21=\"\",\"\",N21)","v":""},null,null,null,null,null,null,null,null,{"$f":"SUM(F21:J21)","v":0},{"$f":"MAX(F21:J21)","v":0},{"$f":"SUM(K21*1000)+L21+0.37","v":0.37},{"$f":"IF(F21=\"\",\"\",RANK(M21,M6:M65,0))","v":""},null,null,null,null,null,null,null,null,null,null,null,null,null,null,null,null,null,null,16,{"$f":"IF(AF6<16,\"\",VLOOKUP(16,B6:N65,4,FALSE))","v":""},{"$f":"IF(AF6<16,\"\",VLOOKUP(16,B6:N65,10,FALSE))","v":""},null,null,3,{"$f":"IF(AK18<3,\"\",VLOOKUP(3,T6:AB64,5,FALSE))","v":""},{"$f":"IF(AK18<3,\"\",VLOOKUP(3,T6:AB64,9,FALSE))","v":""}]
[null,{"$f":"IF(F22=\"\",\"\",N22)","v":""},null,null,null,null,null,null,null,null,{"$f":"SUM(F22:J22)","v":0},{"$f":"MAX(F22:J22)","v":0},{"$f":"SUM(K22*1000)+L22+0.36","v":0.36},{"$f":"IF(F22=\"\",\"\",RANK(M22,M6:M65,0))","v":""},null,null,null,null,null,null,null,null,null,null,null,null,null,null,null,null,null,null,17,{"$f":"IF(AF6<17,\"\",VLOOKUP(17,B6:N65,4,FALSE))","v":""},{"$f":"IF(AF6<17,\"\",VLOOKUP(17,B6:N65,10,FALSE))","v":""},null,null,4,{"$f":"IF(AK18<4,\"\",VLOOKUP(4,T6:AB64,5,FALSE))","v":""},{"$f":"IF(AK18<4,\"\",VLOOKUP(4,T6:AB64,9,FALSE))","v":""}]
[null,null,null,null,null,{"$f":"SUM(F18:F22)","v":0},{"$f":"SUM(G18:G22)","v":0},{"$f":"SUM(H18:H22)","v":0},{"$f":"SUM(I18:I22)","v":0},{"$f":"SUM(J18:J22)","v":0},null,null,null,null,{"$f":"SUM(F23:J23)","v":0},{"$f":"MAX(F23:J23)+0.008","v":8.0000000000000002E-3},{"$f":"IF(F18=\"\",\"\",SUM(O23*1000)+P23)","v":""},null,null,null,null,null,null,null,null,null,null,null,null,null,null,null,18,{"$f":"IF(AF6<18,\"\",VLOOKUP(18,B6:N65,4,FALSE))","v":""},{"$f":"IF(AF6<18,\"\",VLOOKUP(18,B6:N65,10,FALSE))","v":""},null,null,5,{"$f":"IF(AK18<5,\"\",VLOOKUP(5,T6:AB64,5,FALSE))","v":""},{"$f":"IF(AK18<5,\"\",VLOOKUP(5,T6:AB64,9,FALSE))","v":""}]
[null,{"$f":"IF(F24=\"\",\"\",N24)","v":""},4,"KAČEROV II.",null,null,null,null,null,null,{"$f":"SUM(F24:J24)","v":0},{"$f":"MAX(F24:J24)","v":0},{"$f":"SUM(K24*1000)+L24+0.35","v":0.35},{"$f":"IF(F24=\"\",\"\",RANK(M24,M6:M65,0))","v":""},null,null,null,{"$f":"IF(F24=\"\",\"\",RANK(Q29,Q11:Q65,0))","v":""},null,null,{"$f":"IF(R24=\"\",\"\",R24)","v":""},{"$f":"IF(D24=\"\",\"\",D24)","v":"KAČEROV II."},{"$f":"IF(O29=\"\",\"\",O29)","v":0},null,null,null,null,null,null,null,null,null,19,{"$f":"IF(AF6<19,\"\",VLOOKUP(19,B6:N65,4,FALSE))","v":""},{"$f":"IF(AF6<19,\"\",VLOOKUP(19,B6:N65,10,FALSE))","v":""}]
[null,{"$f":"IF(F25=\"\",\"\",N25)","v":""},null,null,null,null,null,null,null,null,{"$f":"SUM(F25:J25)","v":0},{"$f":"MAX(F25:J25)","v":0},{"$f":"SUM(K25*1000)+L25+0.34","v":0.34},{"$f":"IF(F25=\"\",\"\",RANK(M25,M6:M65,0))","v":""},null,null,null,null,null,null,null,null,null,null,null,null,null,null,null,null,null,null,20,{"$f":"IF(AF6<20,\"\",VLOOKUP(20,B6:N65,4,FALSE))","v":""},{"$f":"IF(AF6<20,\"\",VLOOKUP(20,B6:N65,10,FALSE))","v":""}]
[null,{"$f":"IF(F26=\"\",\"\",N26)","v":""},null,null,null,null,null,null,null,null,{"$f":"SUM(F26:J26)","v":0},{"$f":"MAX(F26:J26)","v":0},{"$f":"SUM(K26*1000)+L26+0.33","v":0.33},{"$f":"IF(F26=\"\",\"\",RANK(M26,M6:M65,0))","v":""},null,null,null,null,null,null,null,null,null,null,null,null,null,null,null,null,null,null,21,{"$f":"IF(AF6<21,\"\",VLOOKUP(21,B6:N65,4,FALSE))","v":""},{"$f":"IF(AF6<21,\"\",VLOOKUP(21,B6:N65,10,FALSE))","v":""}]
[null,{"$f":"IF(F27=\"\",\"\",N27)","v":""},null,null,null,null,null,null,null,null,{"$f":"SUM(F27:J27)","v":0},{"$f":"MAX(F27:J27)","v":0},{"$f":"SUM(K27*1000)+L27+0.32","v":0.32},{"$f":"IF(F27=\"\",\"\",RANK(M27,M6:M65,0))","v":""},null,null,null,null,null,null,null,null,null,null,null,null,null,null,null,null,null,null,22,{"$f":"IF(AF6<22,\"\",VLOOKUP(22,B6:N65,4,FALSE))","v":""},{"$f":"IF(AF6<22,\"\",VLOOKUP(22,B6:N65,10,FALSE))","v":""}]
[null,{"$f":"IF(F28=\"\",\"\",N28)","v":""},null,null,null,null,null,null,null,null,{"$f":"SUM(F28:J28)","v":0},{"$f":"MAX(F28:J28)","v":0},{"$f":"SUM(K28*1000)+L28+0.31","v":0.31},{"$f":"IF(F28=\"\",\"\",RANK(M28,M6:M65,0))","v":""},null,null,null,null,null,null,null,null,null,null,null,null,null,null,null,null,null,null,23,{"$f":"IF(AF6<23,\"\",VLOOKUP(23,B6:N65,4,FALSE))","v":""},{"$f":"IF(AF6<23,\"\",VLOOKUP(23,B6:N65,10,FALSE))","v":""}]
[null,null,null,null,null,{"$f":"SUM(F24:F28)","v":0},{"$f":"SUM(G24:G28)","v":0},{"$f":"SUM(H24:H28)","v":0},{"$f":"SUM(I24:I28)","v":0},{"$f":"SUM(J24:J28)","v":0},null,null,null,null,{"$f":"SUM(F29:J29)","v":0},{"$f":"MAX(F29:J29)+0.007","v":7.0000000000000001E-3},{"$f":"IF(F24=\"\",\"\",SUM(O29*1000)+P29)","v":""},null,null,null,null,null,null,null,null,null,null,null,{"$f":"SUM(O23,O29)","v":0},null,null,null,24,{"$f":"IF(AF6<24,\"\",VLOOKUP(24,B6:N65,4,FALSE))","v":""},{"$f":"IF(AF6<24,\"\",VLOOKUP(24,B6:N65,10,FALSE))","v":""}]
[null,{"$f":"IF(F30=\"\",\"\",N30)","v":""},5,"HOSTIVAŘ I.",null,null,null,null,null,null,{"$f":"SUM(F30:J30)","v":0},{"$f":"MAX(F30:J30)","v":0},{"$f":"SUM(K30*1000)+L30+0.3","v":0.3},{"$f":"IF(F30=\"\",\"\",RANK(M30,M6:M65,0))","v":""},null,null,null,{"$f":"IF(F30=\"\",\"\",RANK(Q35,Q11:Q65,0))","v":""},null,{"$f":"IF(F30=\"\",\"\",RANK(AA30,AA6:AA64,0))","v":""},{"$f":"IF(R30=\"\",\"\",R30)","v":""},{"$f":"IF(D30=\"\",\"\",D30)","v":"HOSTIVAŘ I."},{"$f":"IF(O35=\"\",\"\",O35)","v":0},{"$f":"IF(V30=\"HOSTIVAŘ I.\",\"GARÁŽ HOSTIVAŘ\",IF(V30=\"VRŠOVICE I.\",\"GARÁŽ VRŠOVICE\",IF(V30=\"KLÍČOV I.\",\"GARÁŽ KLÍČOV\",IF(V30=\"ŘEPY I.\",\"GARÁŽ ŘEPY\",IF(V30=\"KAČEROV I.\",\"GARÁŽ KAČEROV\",\"\")))))","v":"GARÁŽ HOSTIVAŘ"},{"$f":"MAX(F35:J35,F41:J41)+0.03","v":0.03},{"$f":"SUM(O35,O41)*1000","v":0},{"$f":"SUM(Y30:Z30)","v":0.03},{"$f":"IF(AC41=\"\",\"\",AC41)","v":0},null,{"$f":"IF(T30=\"\",\"\",T30)","v":""},null,null,25,{"$f":"IF(AF6<25,\"\",VLOOKUP(25,B6:N65,4,FALSE))","v":""},{"$f":"IF(AF6<25,\"\",VLOOKUP(25,B6:N65,10,FALSE))","v":""}]
[null,{"$f":"IF(F31=\"\",\"\",N31)","v":""},null,null,null,null,null,null,null,null,{"$f":"SUM(F31:J31)","v":0},{"$f":"MAX(F31:J31)","v":0},{"$f":"SUM(K31*1000)+L31+0.29","v":0.28999999999999998},{"$f":"IF(F31=\"\",\"\",RANK(M31,M6:M65,0))","v":""},null,null,null,null,null,null,null,null,null,null,null,null,null,null,null,null,null,null,26,{"$f":"IF(AF6<26,\"\",VLOOKUP(26,B6:N65,4,FALSE))","v":""},{"$f":"IF(AF6<26,\"\",VLOOKUP(26,B6:N65,10,FALSE))","v":""}]
[null,{"$f":"IF(F32=\"\",\"\",N32)","v":""},null,null,null,null,null,null,null,null,{"$f":"SUM(F32:J32)","v":0},{"$f":"MAX(F32:J32)","v":0},{"$f":"SUM(K32*1000)+L32+0.28","v":0.28000000000000003},{"$f":"IF(F32=\"\",\"\",RANK(M32,M6:M65,0))","v":""},null,null,null,null,null,null,null,null,null,null,null,null,null,null,null,null,null,null,27,{"$f":"IF(AF6<27,\"\",VLOOKUP(27,B6:N65,4,FALSE))","v":""},{"$f":"IF(AF6<27,\"\",VLOOKUP(27,B6:N65,10,FALSE))","v":""}]
[null,{"$f":"IF(F33=\"\",\"\",N33)","v":""},null,null,null,null,null,null,null,null,{"$f":"SUM(F33:J33)","v":0},{"$f":"MAX(F33:J33)","v":0},{"$f":"SUM(K33*1000)+L33+0.27","v":0.27},{"$f":"IF(F33=\"\",\"\",RANK(M33,M6:M65,0))","v":""},null,null,null,null,null,null,null,null,null,null,null,null,null,null,null,null,null,null,28,{"$f":"IF(AF6<28,\"\",VLOOKUP(28,B6:N65,4,FALSE))","v":""},{"$f":"IF(AF6<28,\"\",VLOOKUP(28,B6:N65,10,FALSE))","v":""}]
[null,{"$f":"IF(F34=\"\",\"\",N34)","v":""},null,null,null,null,null,null,null,null,{"$f":"SUM(F34:J34)","v":0},{"$f":"MAX(F34:J34)","v":0},{"$f":"SUM(K34*1000)+L34+0.26","v":0.26},{"$f":"IF(F34=\"\",\"\",RANK(M34,M6:M65,0))","v":""},null,null,null,null,null,null,null,null,null,null,null,null,null,null,null,null,null,null,29,{"$f":"IF(AF6<29,\"\",VLOOKUP(29,B6:N65,4,FALSE))","v":""},{"$f":"IF(AF6<29,\"\",VLOOKUP(29,B6:N65,10,FALSE))","v":""}]
[null,null,null,null,null,{"$f":"SUM(F30:F34)","v":0},{"$f":"SUM(G30:G34)","v":0},{"$f":"SUM(H30:H34)","v":0},{"$f":"SUM(I30:I34)","v":0},{"$f":"SUM(J30:J34)","v":0},null,null,null,null,{"$f":"SUM(F35:J35)","v":0},{"$f":"MAX(F35:J35)+0.006","v":6.0000000000000001E-3},{"$f":"IF(F30=\"\",\"\",SUM(O35*1000)+P35)","v":""},null,null,null,null,null,null,null,null,null,null,null,null,null,null,null,30,{"$f":"IF(AF6<30,\"\",VLOOKUP(30,B6:N65,4,FALSE))","v":""},{"$f":"IF(AF6<30,\"\",VLOOKUP(30,B6:N65,10,FALSE))","v":""}]
[null,{"$f":"IF(F36=\"\",\"\",N36)","v":""},6,"HOSTIVAŘ II.",null,null,null,null,null,null,{"$f":"SUM(F36:J36)","v":0},{"$f":"MAX(F36:J36)","v":0},{"$f":"SUM(K36*1000)+L36+0.25","v":0.25},{"$f":"IF(F36=\"\",\"\",RANK(M36,M6:M65,0))","v":""},null,null,null,{"$f":"IF(F36=\"\",\"\",RANK(Q41,Q11:Q65,0))","v":""},null,null,{"$f":"IF(R36=\"\",\"\",R36)","v":""},{"$f":"IF(D36=\"\",\"\",D36)","v":"HOSTIVAŘ II."},{"$f":"IF(O41=\"\",\"\",O41)","v":0},null,null,null,null,null,null,null,null,null,31,{"$f":"IF(AF6<31,\"\",VLOOKUP(31,B6:N65,4,FALSE))","v":""},{"$f":"IF(AF6<31,\"\",VLOOKUP(31,B6:N65,10,FALSE))","v":""}]
[null,{"$f":"IF(F37=\"\",\"\",N37)","v":""},null,null,null,null,null,null,null,null,{"$f":"SUM(F37:J37)","v":0},{"$f":"MAX(F37:J37)","v":0},{"$f":"SUM(K37*1000)+L37+0.24","v":0.24},{"$f":"IF(F37=\"\",\"\",RANK(M37,M6:M65,0))","v":""},null,null,null,null,null,null,null,null,null,null,null,null,null,null,null,null,null,null,32,{"$f":"IF(AF6<32,\"\",VLOOKUP(32,B6:N65,4,FALSE))","v":""},{"$f":"IF(AF6<32,\"\",VLOOKUP(32,B6:N65,10,FALSE))","v":""}]
[null,{"$f":"IF(F38=\"\",\"\",N38)","v":""},null,null,null,null,null,null,null,null,{"$f":"SUM(F38:J38)","v":0},{"$f":"MAX(F38:J38)","v":0},{"$f":"SUM(K38*1000)+L38+0.23","v":0.23},{"$f":"IF(F38=\"\",\"\",RANK(M38,M6:M65,0))","v":""},null,null,null,null,null,null,null,null,null,null,null,null,null,null,null,null,null,null,33,{"$f":"IF(AF6<33,\"\",VLOOKUP(33,B6:N65,4,FALSE))","v":""},{"$f":"IF(AF6<33,\"\",VLOOKUP(33,B6:N65,10,FALSE))","v":""}]
[null,{"$f":"IF(F39=\"\",\"\",N39)","v":""},null,null,null,null,null,null,null,null,{"$f":"SUM(F39:J39)","v":0},{"$f":"MAX(F39:J39)","v":0},{"$f":"SUM(K39*1000)+L39+0.21","v":0.21},{"$f":"IF(F39=\"\",\"\",RANK(M39,M6:M65,0))","v":""},null,null,null,null,null,null,null,null,null,null,null,null,null,null,null,null,null,null,34,{"$f":"IF(AF6<34,\"\",VLOOKUP(34,B6:N65,4,FALSE))","v":""},{"$f":"IF(AF6<34,\"\",VLOOKUP(34,B6:N65,10,FALSE))","v":""}]
[null,{"$f":"IF(F40=\"\",\"\",N40)","v":""},null,null,null,null,null,null,null,null,{"$f":"SUM(F40:J40)","v":0},{"$f":"MAX(F40:J40)","v":0},{"$f":"SUM(K40*1000)+L40+0.2","v":0.2},{"$f":"IF(F40=\"\",\"\",RANK(M40,M6:M65,0))","v":""},null,null,null,null,null,null,null,null,null,null,null,null,null,null,null,null,null,null,35,{"$f":"IF(AF6<35,\"\",VLOOKUP(35,B6:N65,4,FALSE))","v":""},{"$f":"IF(AF6<35,\"\",VLOOKUP(35,B6:N65,10,FALSE))","v":""}]
[null,null,null,null,null,{"$f":"SUM(F36:F40)","v":0},{"$f":"SUM(G36:G40)","v":0},{"$f":"SUM(H36:H40)","v":0},{"$f":"SUM(I36:I40)","v":0},{"$f":"SUM(J36:J40)","v":0},null,null,null,null,{"$f":"SUM(F41:J41)","v":0},{"$f":"MAX(F41:J41)+0.005","v":5.0000000000000001E-3},{"$f":"IF(F36=\"\",\"\",SUM(O41*1000)+P41)","v":""},null,null,null,null,null,null,null,null,null,null,null,{"$f":"SUM(O35,O41)","v":0},null,null,null,36,{"$f":"IF(AF6<36,\"\",VLOOKUP(36,B6:N65,4,FALSE))","v":""},{"$f":"IF(AF6<36,\"\",VLOOKUP(36,B6:N65,10,FALSE))","v":""}]
[null,{"$f":"IF(F42=\"\",\"\",N42)","v":""},7,"VRŠOVICE I.",null,null,null,null,null,null,{"$f":"SUM(F42:J42)","v":0},{"$f":"MAX(F42:J42)","v":0},{"$f":"SUM(K42*1000)+L42+0.19","v":0.19},{"$f":"IF(F42=\"\",\"\",RANK(M42,M6:M65,0))","v":""},null,null,null,{"$f":"IF(F42=\"\",\"\",RANK(Q47,Q11:Q65,0))","v":""},null,{"$f":"IF(F42=\"\",\"\",RANK(AA42,AA6:AA64,0))","v":""},{"$f":"IF(R42=\"\",\"\",R42)","v":""},{"$f":"IF(D42=\"\",\"\",D42)","v":"VRŠOVICE I."},{"$f":"IF(O47=\"\",\"\",O47)","v":0},{"$f":"IF(V42=\"HOSTIVAŘ I.\",\"GARÁŽ HOSTIVAŘ\",IF(V42=\"VRŠOVICE I.\",\"GARÁŽ VRŠOVICE\",IF(V42=\"KLÍČOV I.\",\"GARÁŽ KLÍČOV\",IF(V42=\"ŘEPY I.\",\"GARÁŽ ŘEPY\",IF(V42=\"KAČEROV I.\",\"GARÁŽ KAČEROV\",\"\")))))","v":"GARÁŽ VRŠOVICE"},{"$f":"MAX(F47:J47,F53:J53)+0.02","v":0.02},{"$f":"SUM(O47,O53)*1000","v":0},{"$f":"SUM(Y42:Z42)","v":0.02},{"$f":"IF(AC53=\"\",\"\",AC53)","v":0},null,{"$f":"IF(T42=\"\",\"\",T42)","v":""},null,null,37,{"$f":"IF(AF6<37,\"\",VLOOKUP(37,B6:N65,4,FALSE))","v":""},{"$f":"IF(AF6<37,\"\",VLOOKUP(37,B6:N65,10,FALSE))","v":""}]
[null,{"$f":"IF(F43=\"\",\"\",N43)","v":""},null,null,null,null,null,null,null,null,{"$f":"SUM(F43:J43)","v":0},{"$f":"MAX(F43:J43)","v":0},{"$f":"SUM(K43*1000)+L43+0.18","v":0.18},{"$f":"IF(F43=\"\",\"\",RANK(M43,M6:M65,0))","v":""},null,null,null,null,null,null,null,null,null,null,null,null,null,null,null,null,null,null,38,{"$f":"IF(AF6<38,\"\",VLOOKUP(38,B6:N65,4,FALSE))","v":""},{"$f":"IF(AF6<38,\"\",VLOOKUP(38,B6:N65,10,FALSE))","v":""}]
[null,{"$f":"IF(F44=\"\",\"\",N44)","v":""},null,null,null,null,null,null,null,null,{"$f":"SUM(F44:J44)","v":0},{"$f":"MAX(F44:J44)","v":0},{"$f":"SUM(K44*1000)+L44+0.17","v":0.17},{"$f":"IF(F44=\"\",\"\",RANK(M44,M6:M65,0))","v":""},null,null,null,null,null,null,null,null,null,null,null,null,null,null,null,null,null,null,39,{"$f":"IF(AF6<39,\"\",VLOOKUP(39,B6:N65,4,FALSE))","v":""},{"$f":"IF(AF6<39,\"\",VLOOKUP(39,B6:N65,10,FALSE))","v":""}]
[null,{"$f":"IF(F45=\"\",\"\",N45)","v":""},null,null,null,null,null,null,null,null,{"$f":"SUM(F45:J45)","v":0},{"$f":"MAX(F45:J45)","v":0},{"$f":"SUM(K45*1000)+L45+0.16","v":0.16},{"$f":"IF(F45=\"\",\"\",RANK(M45,M6:M65,0))","v":""},null,null,null,null,null,null,null,null,null,null,null,null,null,null,null,null,null,null,40,{"$f":"IF(AF6<40,\"\",VLOOKUP(40,B6:N65,4,FALSE))","v":""},{"$f":"IF(AF6<40,\"\",VLOOKUP(40,B6:N65,10,FALSE))","v":""}]
[null,{"$f":"IF(F46=\"\",\"\",N46)","v":""},null,null,null,null,null,null,null,null,{"$f":"SUM(F46:J46)","v":0},{"$f":"MAX(F46:J46)","v":0},{"$f":"SUM(K46*1000)+L46+0.15","v":0.15},{"$f":"IF(F46=\"\",\"\",RANK(M46,M6:M65,0))","v":""},null,null,null,null,null,null,null,null,null,null,null,null,null,null,null,null,null,null,41,{"$f":"IF(AF6<41,\"\",VLOOKUP(41,B6:N65,4,FALSE))","v":""},{"$f":"IF(AF6<41,\"\",VLOOKUP(41,B6:N65,10,FALSE))","v":""}]
[null,null,null,null,null,{"$f":"SUM(F42:F46)","v":0},{"$f":"SUM(G42:G46)","v":0},{"$f":"SUM(H42:H46)","v":0},{"$f":"SUM(I42:I46)","v":0},{"$f":"SUM(J42:J46)","v":0},null,null,null,null,{"$f":"SUM(F47:J47)","v":0},{"$f":"MAX(F47:J47)+0.004","v":4.0000000000000001E-3},{"$f":"IF(F42=\"\",\"\",SUM(O47*1000)+P47)","v":""},null,null,null,null,null,null,null,null,null,null,null,null,null,null,null,42,{"$f":"IF(AF6<42,\"\",VLOOKUP(42,B6:N65,4,FALSE))","v":""},{"$f":"IF(AF6<42,\"\",VLOOKUP(42,B6:N65,10,FALSE))","v":""}]
[null,{"$f":"IF(F48=\"\",\"\",N48)","v":""},8,"VRŠOVICE II.",null,null,null,null,null,null,{"$f":"SUM(F48:J48)","v":0},{"$f":"MAX(F48:J48)","v":0},{"$f":"SUM(K48*1000)+L48+0.14","v":0.14000000000000001},{"$f":"IF(F48=\"\",\"\",RANK(M48,M6:M65,0))","v":""},null,null,null,{"$f":"IF(F48=\"\",\"\",RANK(Q53,Q11:Q65,0))","v":""},null,null,{"$f":"IF(R48=\"\",\"\",R48)","v":""},{"$f":"IF(D48=\"\",\"\",D48)","v":"VRŠOVICE II."},{"$f":"IF(O53=\"\",\"\",O53)","v":0},null,null,null,null,null,null,null,null,null,43,{"$f":"IF(AF6<43,\"\",VLOOKUP(43,B6:N65,4,FALSE))","v":""},{"$f":"IF(AF6<43,\"\",VLOOKUP(43,B6:N65,10,FALSE))","v":""}]
[null,{"$f":"IF(F49=\"\",\"\",N49)","v":""},null,null,null,null,null,null,null,null,{"$f":"SUM(F49:J49)","v":0},{"$f":"MAX(F49:J49)","v":0},{"$f":"SUM(K49*1000)+L49+0.13","v":0.13},{"$f":"IF(F49=\"\",\"\",RANK(M49,M6:M65,0))","v":""},null,null,null,null,null,null,null,null,null,null,null,null,null,null,null,null,null,null,44,{"$f":"IF(AF6<44,\"\",VLOOKUP(44,B6:N65,4,FALSE))","v":""},{"$f":"IF(AF6<44,\"\",VLOOKUP(44,B6:N65,10,FALSE))","v":""}]
[null,{"$f":"IF(F50=\"\",\"\",N50)","v":""},null,null,null,null,null,null,null,null,{"$f":"SUM(F50:J50)","v":0},{"$f":"MAX(F50:J50)","v":0},{"$f":"SUM(K50*1000)+L50+0.12","v":0.12},{"$f":"IF(F50=\"\",\"\",RANK(M50,M6:M65,0))","v":""},null,null,null,null,null,null,null,null,null,null,null,null,null,null,null,null,null,null,45,{"$f":"IF(AF6<45,\"\",VLOOKUP(45,B6:N65,4,FALSE))","v":""},{"$f":"IF(AF6<45,\"\",VLOOKUP(45,B6:N65,10,FALSE))","v":""}]
[null,{"$f":"IF(F51=\"\",\"\",N51)","v":""},null,null,null,null,null,null,null,null,{"$f":"SUM(F51:J51)","v":0},{"$f":"MAX(F51:J51)","v":0},{"$f":"SUM(K51*1000)+L51+0.11","v":0.11},{"$f":"IF(F51=\"\",\"\",RANK(M51,M6:M65,0))","v":""},null,null,null,null,null,null,null,null,null,null,null,null,null,null,null,null,null,null,46,{"$f":"IF(AF6<46,\"\",VLOOKUP(46,B6:N65,4,FALSE))","v":""},{"$f":"IF(AF6<46,\"\",VLOOKUP(46,B6:N65,10,FALSE))","v":""}]
[null,{"$f":"IF(F52=\"\",\"\",N52)","v":""},null,null,null,null,null,null,null,null,{"$f":"SUM(F52:J52)","v":0},{"$f":"MAX(F52:J52)","v":0},{"$f":"SUM(K52*1000)+L52+0.1","v":0.1},{"$f":"IF(F52=\"\",\"\",RANK(M52,M6:M65,0))","v":""},null,null,null,null,null,null,null,null,null,null,null,null,null,null,null,null,null,null,47,{"$f":"IF(AF6<47,\"\",VLOOKUP(47,B6:N65,4,FALSE))","v":""},{"$f":"IF(AF6<47,\"\",VLOOKUP(47,B6:N65,10,FALSE))","v":""}]
[null,null,null,null,null,{"$f":"SUM(F48:F52)","v":0},{"$f":"SUM(G48:G52)","v":0},{"$f":"SUM(H48:H52)","v":0},{"$f":"SUM(I48:I52)","v":0},{"$f":"SUM(J48:J52)","v":0},null,null,null,null,{"$f":"SUM(F53:J53)","v":0},{"$f":"MAX(F53:J53)+0.003","v":3.0000000000000001E-3},{"$f":"IF(F48=\"\",\"\",SUM(O53*1000)+P53)","v":""},null,null,null,null,null,null,null,null,null,null,null,{"$f":"SUM(O47,O53)","v":0},null,null,null,48,{"$f":"IF(AF6<48,\"\",VLOOKUP(48,B6:N65,4,FALSE))","v":""},{"$f":"IF(AF6<48,\"\",VLOOKUP(48,B6:N65,10,FALSE))","v":""}]
[null,{"$f":"IF(F54=\"\",\"\",N54)","v":""},9,"KLÍČOV I.",null,null,null,null,null,null,{"$f":"SUM(F54:J54)","v":0},{"$f":"MAX(F54:J54)","v":0},{"$f":"SUM(K54*1000)+L54+0.09","v":0.09},{"$f":"IF(F54=\"\",\"\",RANK(M54,M6:M65,0))","v":""},null,null,null,{"$f":"IF(F54=\"\",\"\",RANK(Q59,Q11:Q65,0))","v":""},null,{"$f":"IF(F54=\"\",\"\",RANK(AA54,AA6:AA64,0))","v":""},{"$f":"IF(R54=\"\",\"\",R54)","v":""},{"$f":"IF(D54=\"\",\"\",D54)","v":"KLÍČOV I."},{"$f":"IF(O59=\"\",\"\",O59)","v":0},{"$f":"IF(V54=\"HOSTIVAŘ I.\",\"GARÁŽ HOSTIVAŘ\",IF(V54=\"VRŠOVICE I.\",\"GARÁŽ VRŠOVICE\",IF(V54=\"KLÍČOV I.\",\"GARÁŽ KLÍČOV\",IF(V54=\"ŘEPY I.\",\"GARÁŽ ŘEPY\",IF(V54=\"KAČEROV I.\",\"GARÁŽ KAČEROV\",\"\")))))","v":"GARÁŽ KLÍČOV"},{"$f":"MAX(F59:J59,F65:J65)+0.01","v":0.01},{"$f":"SUM(O59,O65)*1000","v":0},{"$f":"SUM(Y54:Z54)","v":0.01},{"$f":"IF(AC65=\"\",\"\",AC65)","v":0},null,{"$f":"IF(T54=\"\",\"\",T54)","v":""},null,null,49,{"$f":"IF(AF6<49,\"\",VLOOKUP(49,B6:N65,4,FALSE))","v":""},{"$f":"IF(AF6<49,\"\",VLOOKUP(49,B6:N65,10,FALSE))","v":""}]
[null,{"$f":"IF(F55=\"\",\"\",N55)","v":""},null,null,null,null,null,null,null,null,{"$f":"SUM(F55:J55)","v":0},{"$f":"MAX(F55:J55)","v":0},{"$f":"SUM(K55*1000)+L55+0.08","v":0.08},{"$f":"IF(F55=\"\",\"\",RANK(M55,M6:M65,0))","v":""},null,null,null,null,null,null,null,null,null,null,null,null,null,null,null,null,null,null,50,{"$f":"IF(AF6<50,\"\",VLOOKUP(50,B6:N65,4,FALSE))","v":""},{"$f":"IF(AF6<50,\"\",VLOOKUP(50,B6:N65,10,FALSE))","v":""}]
[null,{"$f":"IF(F56=\"\",\"\",N56)","v":""},null,null,null,null,null,null,null,null,{"$f":"SUM(F56:J56)","v":0},{"$f":"MAX(F56:J56)","v":0},{"$f":"SUM(K56*1000)+L56+0.07","v":7.0000000000000007E-2},{"$f":"IF(F56=\"\",\"\",RANK(M56,M6:M65,0))","v":""}]
[null,{"$f":"IF(F57=\"\",\"\",N57)","v":""},null,null,null,null,null,null,null,null,{"$f":"SUM(F57:J57)","v":0},{"$f":"MAX(F57:J57)","v":0},{"$f":"SUM(K57*1000)+L57+0.06","v":0.06},{"$f":"IF(F57=\"\",\"\",RANK(M57,M6:M65,0))","v":""}]
[null,{"$f":"IF(F58=\"\",\"\",N58)","v":""},null,null,null,null,null,null,null,null,{"$f":"SUM(F58:J58)","v":0},{"$f":"MAX(F58:J58)","v":0},{"$f":"SUM(K58*1000)+L58+0.05","v":0.05},{"$f":"IF(F58=\"\",\"\",RANK(M58,M6:M65,0))","v":""}]
[null,null,null,null,null,{"$f":"SUM(F54:F58)","v":0},{"$f":"SUM(G54:G58)","v":0},{"$f":"SUM(H54:H58)","v":0},{"$f":"SUM(I54:I58)","v":0},{"$f":"SUM(J54:J58)","v":0},null,null,null,null,{"$f":"SUM(F59:J59)","v":0},{"$f":"MAX(F59:J59)+0.002","v":2E-3},{"$f":"IF(F54=\"\",\"\",SUM(O59*1000)+P59)","v":""}]
[null,{"$f":"IF(F60=\"\",\"\",N60)","v":""},10,"KLÍČOV II.",null,null,null,null,null,null,{"$f":"SUM(F60:J60)","v":0},{"$f":"MAX(F60:J60)","v":0},{"$f":"SUM(K60*1000)+L60+0.04","v":0.04},{"$f":"IF(F60=\"\",\"\",RANK(M60,M6:M65,0))","v":""},null,null,null,{"$f":"IF(F60=\"\",\"\",RANK(Q65,Q11:Q65,0))","v":""},null,null,{"$f":"IF(R60=\"\",\"\",R60)","v":""},{"$f":"IF(D60=\"\",\"\",D60)","v":"KLÍČOV II."},{"$f":"IF(O65=\"\",\"\",O65)","v":0}]
[null,{"$f":"IF(F61=\"\",\"\",N61)","v":""},null,null,null,null,null,null,null,null,{"$f":"SUM(F61:J61)","v":0},{"$f":"MAX(F61:J61)","v":0},{"$f":"SUM(K61*1000)+L61+0.03","v":0.03},{"$f":"IF(F61=\"\",\"\",RANK(M61,M6:M65,0))","v":""}]
[null,{"$f":"IF(F62=\"\",\"\",N62)","v":""},null,null,null,null,null,null,null,null,{"$f":"SUM(F62:J62)","v":0},{"$f":"MAX(F62:J62)","v":0},{"$f":"SUM(K62*1000)+L62+0.02","v":0.02},{"$f":"IF(F62=\"\",\"\",RANK(M62,M6:M65,0))","v":""}]
[null,{"$f":"IF(F63=\"\",\"\",N63)","v":""},null,null,null,null,null,null,null,null,{"$f":"SUM(F63:J63)","v":0},{"$f":"MAX(F63:J63)","v":0},{"$f":"SUM(K63*1000)+L63+0.01","v":0.01},{"$f":"IF(F63=\"\",\"\",RANK(M63,M6:M65,0))","v":""}]
[null,{"$f":"IF(F64=\"\",\"\",N64)","v":""},null,null,null,null,null,null,null,null,{"$f":"SUM(F64:J64)","v":0},{"$f":"MAX(F64:J64)","v":0},{"$f":"SUM(K64*1000)+L64","v":0},{"$f":"IF(F64=\"\",\"\",RANK(M64,M6:M65,0))","v":""}]
[null,null,null,null,null,{"$f":"SUM(F60:F64)","v":0},{"$f":"SUM(G60:G64)","v":0},{"$f":"SUM(H60:H64)","v":0},{"$f":"SUM(I60:I64)","v":0},{"$f":"SUM(J60:J64)","v":0},null,{"$f":"MAX(L12:L64,L6:L10)","v":0},null,null,{"$f":"SUM(F65:J65)","v":0},{"$f":"MAX(F65:J65)+0.001","v":1E-3},{"$f":"IF(F60=\"\",\"\",SUM(O65*1000)+P65)","v":""},null,null,null,null,null,null,null,null,null,null,null,{"$f":"SUM(O59,O65)","v":0}]

{"sheet":"ŘEPY","index":6,"n_rows":65,"n_cols":53,"rows_kept":65,"cut":false,"hidden":false,"merged":[[2,3,2,39],[64,28,64,29],[52,28,52,29],[53,2,57,2],[53,3,57,3],[53,17,57,17],[53,29,63,29],[59,2,63,2],[59,3,63,3],[59,17,63,17],[35,3,39,3],[35,17,39,17],[40,28,40,29],[41,2,45,2],[41,3,45,3],[41,17,45,17],[41,29,51,29],[47,2,51,2],[47,3,51,3],[47,17,51,17],[17,37,17,39],[23,2,27,2],[23,3,27,3],[23,17,27,17],[28,28,28,29],[29,2,33,2],[29,3,33,3],[29,17,33,17],[29,29,39,29],[35,2,39,2],[11,3,15,3],[11,17,15,17],[16,28,16,29],[17,2,21,2],[17,3,21,3],[17,17,21,17],[17,29,27,29],[5,37,5,39],[0,0,3,0],[4,2,4,3],[4,13,4,14],[4,32,4,34],[5,2,9,2],[5,3,9,3],[5,17,9,17],[5,29,15,29],[11,2,15,2]]}
["ZPĚT"]
[]
[null,null,null,"Sportovní turnaj v Bowlingu o pohár ZV-OS Řepy dne 28.3. 2015"]
[]
[null,null,"Garáž",null,"Jméno","I.","II.","III.","IV.","V.","Body",null,null,"Jednotlivci.",null,null,null,"Družstva.",null,null,null,null,null,null,null,null,null,null,null,null,null,null,"pořadí jednotlivců"]
[null,{"$f":"IF(F6=\"\",\"\",N6)","v":""},1,"KLÍČOV I.",null,null,null,null,null,null,{"$f":"SUM(F6:J6)","v":0},{"$f":"MAX(F6:J6)","v":0},{"$f":"SUM(K6*1000)+L6+0.5","v":0.5},{"$f":"IF(F6=\"\",\"\",RANK(M6,M6:M65,0))","v":""},null,null,null,{"$f":"IF(F6=\"\",\"\",RANK(Q11,Q11:Q65,0))","v":""},null,{"$f":"IF(F6=\"\",\"\",RANK(AA6,AA6:AA64,0))","v":""},{"$f":"IF(R6=\"\",\"\",R6)","v":""},{"$f":"IF(D6=\"\",\"\",D6)","v":"KLÍČOV I."},{"$f":"IF(O11=\"\",\"\",O11)","v":0},{"$f":"IF(V6=\"HOSTIVAŘ I.\",\"GARÁŽ HOSTIVAŘ\",IF(V6=\"VRŠOVICE I.\",\"GARÁŽ VRŠOVICE\",IF(V6=\"KLÍČOV I.\",\"GARÁŽ KLÍČOV\",IF(V6=\"ŘEPY I.\",\"GARÁŽ ŘEPY\",IF(V6=\"KAČEROV I.\",\"GARÁŽ KAČEROV\",\"\")))))","v":"GARÁŽ KLÍČOV"},{"$f":"MAX(F11:J11,F17:J17)+0.05","v":0.05},{"$f":"SUM(O11,O17)*1000","v":0},{"$f":"SUM(Y6:Z6)","v":0.05},{"$f":"IF(AC17=\"\",\"\",AC17)","v":0},null,{"$f":"IF(T6=\"\",\"\",T6)","v":""},null,{"$f":"COUNT(F6:F10,F12:F16,F18:F22,F24:F28,F30:F34,F36:F40,F42:F46,F48:F52,F54:F58,F60:F64)","v":0},1,{"$f":"IF(AF6<1,\"\",VLOOKUP(1,B6:N65,4,FALSE))","v":""},{"$f":"IF(AF6<1,\"\",VLOOKUP(1,B6:N65,10,FALSE))","v":""},null,{"$f":"COUNT(U6:U16,U18:U28,U30:U40,U42:U52,U54:U64)","v":0},"POŘADÍ DRUŽSTEV",null,null,null,null,null,null,null,null,null,null,null,null,null,null,"HOSTIVAŘ I."]
[null,{"$f":"IF(F7=\"\",\"\",N7)","v":""},null,null,null,null,null,null,null,null,{"$f":"SUM(F7:J7)","v":0},0,{"$f":"SUM(K7*1000)+L7+0.49","v":0.49},{"$f":"IF(F7=\"\",\"\",RANK(M7,M6:M65,0))","v":""},null,null,null,null,null,null,null,null,null,null,null,null,null,null,null,null,null,null,{"$f":"SUM(AG6+1)","v":2},{"$f":"IF(AF6<2,\"\",VLOOKUP(2,B6:N65,4,FALSE))","v":""},{"$f":"IF(AF6<2,\"\",VLOOKUP(2,B6:N65,10,FALSE))","v":""},null,null,1,{"$f":"IF(AK6<1,\"\",VLOOKUP(1,U6:W64,2,FALSE))","v":""},{"$f":"IF(AK6<1,\"\",VLOOKUP(1,U6:W64,3,FALSE))","v":""},null,null,null,null,null,null,null,null,null,null,null,null,"VRŠOVICE I."]
[null,{"$f":"IF(F8=\"\",\"\",N8)","v":""},null,null,null,null,null,null,null,null,{"$f":"SUM(F8:J8)","v":0},0,{"$f":"SUM(K8*1000)+L8+0.48","v":0.48},{"$f":"IF(F8=\"\",\"\",RANK(M8,M6:M65,0))","v":""},null,null,null,null,null,null,null,null,null,null,null,null,null,null,null,null,null,null,{"$f":"SUM(AG7+1)","v":3},{"$f":"IF(AF6<3,\"\",VLOOKUP(3,B6:N65,4,FALSE))","v":""},{"$f":"IF(AF6<3,\"\",VLOOKUP(3,B6:N65,10,FALSE))","v":""},null,null,2,{"$f":"IF(AK6<2,\"\",VLOOKUP(2,U6:W64,2,FALSE))","v":""},{"$f":"IF(AK6<2,\"\",VLOOKUP(2,U6:W64,3,FALSE))","v":""},null,null,null,null,null,null,null,null,null,null,null,null,"KLÍČOV I."]
[null,{"$f":"IF(F9=\"\",\"\",N9)","v":""},null,null,null,null,null,null,null,null,{"$f":"SUM(F9:J9)","v":0},0,{"$f":"SUM(K9*1000)+L9+0.47","v":0.47},{"$f":"IF(F9=\"\",\"\",RANK(M9,M6:M65,0))","v":""},null,null,null,null,null,null,null,null,null,null,null,null,null,null,null,null,null,null,4,{"$f":"IF(AF6<4,\"\",VLOOKUP(4,B6:N65,4,FALSE))","v":""},{"$f":"IF(AF6<4,\"\",VLOOKUP(4,B6:N65,10,FALSE))","v":""},null,null,3,{"$f":"IF(AK6<3,\"\",VLOOKUP(3,U6:W64,2,FALSE))","v":""},{"$f":"IF(AK6<3,\"\",VLOOKUP(3,U6:W64,3,FALSE))","v":""},null,null,null,null,null,null,null,null,null,null,null,null,"ŘEPY I."]
[null,{"$f":"IF(F10=\"\",\"\",N10)","v":""},null,null,null,null,null,null,null,null,{"$f":"SUM(F10:J10)","v":0},0,{"$f":"SUM(K10*1000)+L10+0.46","v":0.46},{"$f":"IF(F10=\"\",\"\",RANK(M10,M6:M65,0))","v":""},null,null,null,null,null,null,null,null,null,null,null,null,null,null,null,null,null,null,5,{"$f":"IF(AF6<5,\"\",VLOOKUP(5,B6:N65,4,FALSE))","v":""},{"$f":"IF(AF6<5,\"\",VLOOKUP(5,B6:N65,10,FALSE))","v":""},null,null,4,{"$f":"IF(AK6<4,\"\",VLOOKUP(4,U6:W64,2,FALSE))","v":""},{"$f":"IF(AK6<4,\"\",VLOOKUP(4,U6:W64,3,FALSE))","v":""},null,null,null,null,null,null,null,null,null,null,null,null,"KAČEROV I."]
[null,null,null,null,null,{"$f":"SUM(F6:F10)","v":0},{"$f":"SUM(G6:G10)","v":0},{"$f":"SUM(H6:H10)","v":0},{"$f":"SUM(I6:I10)","v":0},{"$f":"SUM(J6:J10)","v":0},null,0,null,null,{"$f":"SUM(F11:J11)","v":0},{"$f":"MAX(F11:J11)+0.01","v":0.01},{"$f":"IF(F6=\"\",\"\",SUM(O11*1000)+P11)","v":""},null,null,null,null,null,null,null,null,null,null,null,null,null,null,null,6,{"$f":"IF(AF6<6,\"\",VLOOKUP(6,B6:N65,4,FALSE))","v":""},{"$f":"IF(AF6<6,\"\",VLOOKUP(6,B6:N65,10,FALSE))","v":""},null,null,5,{"$f":"IF(AK6<5,\"\",VLOOKUP(5,U6:W64,2,FALSE))","v":""},{"$f":"IF(AK6<5,\"\",VLOOKUP(5,U6:W64,3,FALSE))","v":""}]
[null,{"$f":"IF(F12=\"\",\"\",N12)","v":""},2,"KLÍČOV II.",null,null,null,null,null,null,{"$f":"SUM(F12:J12)","v":0},0,{"$f":"SUM(K12*1000)+L12+0.45","v":0.45},{"$f":"IF(F12=\"\",\"\",RANK(M12,M6:M65,0))","v":""},null,null,null,{"$f":"IF(F12=\"\",\"\",RANK(Q17,Q11:Q65,0))","v":""},null,null,{"$f":"IF(R12=\"\",\"\",R12)","v":""},{"$f":"IF(D12=\"\",\"\",D12)","v":"KLÍČOV II."},{"$f":"IF(O17=\"\",\"\",O17)","v":0},null,null,null,null,null,null,null,null,null,7,{"$f":"IF(AF6<7,\"\",VLOOKUP(7,B6:N65,4,FALSE))","v":""},{"$f":"IF(AF6<7,\"\",VLOOKUP(7,B6:N65,10,FALSE))","v":""},null,null,6,{"$f":"IF(AK6<6,\"\",VLOOKUP(6,U6:W64,2,FALSE))","v":""},{"$f":"IF(AK6<6,\"\",VLOOKUP(6,U6:W64,3,FALSE))","v":""}]
[null,{"$f":"IF(F13=\"\",\"\",N13)","v":""},null,null,null,null,null,null,null,null,{"$f":"SUM(F13:J13)","v":0},0,{"$f":"SUM(K13*1000)+L13+0.44","v":0.44},{"$f":"IF(F13=\"\",\"\",RANK(M13,M6:M65,0))","v":""},null,null,null,null,null,null,null,null,null,null,null,null,null,null,null,null,null,null,8,{"$f":"IF(AF6<8,\"\",VLOOKUP(8,B6:N65,4,FALSE))","v":""},{"$f":"IF(AF6<8,\"\",VLOOKUP(8,B6:N65,10,FALSE))","v":""},null,null,7,{"$f":"IF(AK6<7,\"\",VLOOKUP(7,U6:W64,2,FALSE))","v":""},{"$f":"IF(AK6<7,\"\",VLOOKUP(7,U6:W64,3,FALSE))","v":""}]
[null,{"$f":"IF(F14=\"\",\"\",N14)","v":""},null,null,null,null,null,null,null,null,{"$f":"SUM(F14:J14)","v":0},0,{"$f":"SUM(K14*1000)+L14+0.43","v":0.43},{"$f":"IF(F14=\"\",\"\",RANK(M14,M6:M65,0))","v":""},null,null,null,null,null,null,null,null,null,null,null,null,null,null,null,null,null,null,9,{"$f":"IF(AF6<9,\"\",VLOOKUP(9,B6:N65,4,FALSE))","v":""},{"$f":"IF(AF6<9,\"\",VLOOKUP(9,B6:N65,10,FALSE))","v":""},null,null,8,{"$f":"IF(AK6<8,\"\",VLOOKUP(8,U6:W64,2,FALSE))","v":""},{"$f":"IF(AK6<8,\"\",VLOOKUP(8,U6:W64,3,FALSE))","v":""}]
[null,{"$f":"IF(F15=\"\",\"\",N15)","v":""},null,null,null,null,null,null,null,null,{"$f":"SUM(F15:J15)","v":0},0,{"$f":"SUM(K15*1000)+L15+0.42","v":0.42},{"$f":"IF(F15=\"\",\"\",RANK(M15,M6:M65,0))","v":""},null,null,null,null,null,null,null,null,null,null,null,null,null,null,null,null,null,null,10,{"$f":"IF(AF6<10,\"\",VLOOKUP(10,B6:N65,4,FALSE))","v":""},{"$f":"IF(AF6<10,\"\",VLOOKUP(10,B6:N65,10,FALSE))","v":""},null,null,9,{"$f":"IF(AK6<9,\"\",VLOOKUP(9,U6:W64,2,FALSE))","v":""},{"$f":"IF(AK6<9,\"\",VLOOKUP(9,U6:W64,3,FALSE))","v":""}]
[null,{"$f":"IF(F16=\"\",\"\",N16)","v":""},null,null,null,null,null,null,null,null,{"$f":"SUM(F16:J16)","v":0},0,{"$f":"SUM(K16*1000)+L16+0.41","v":0.41},{"$f":"IF(F16=\"\",\"\",RANK(M16,M6:M65,0))","v":""},null,null,null,null,null,null,null,null,null,null,null,null,null,null,null,null,null,null,11,{"$f":"IF(AF6<11,\"\",VLOOKUP(11,B6:N65,4,FALSE))","v":""},{"$f":"IF(AF6<11,\"\",VLOOKUP(11,B6:N65,10,FALSE))","v":""},null,null,10,{"$f":"IF(AK6<10,\"\",VLOOKUP(10,U6:W64,2,FALSE))","v":""},{"$f":"IF(AK6<10,\"\",VLOOKUP(10,U6:W64,3,FALSE))","v":""}]
[null,null,null,null,null,{"$f":"SUM(F12:F16)","v":0},{"$f":"SUM(G12:G16)","v":0},{"$f":"SUM(H12:H16)","v":0},{"$f":"SUM(I12:I16)","v":0},{"$f":"SUM(J12:J16)","v":0},null,null,null,null,{"$f":"SUM(F17:J17)","v":0},{"$f":"MAX(F17:J17)+0.009","v":8.9999999999999993E-3},{"$f":"IF(F12=\"\",\"\",SUM(O17*1000)+P17)","v":""},null,null,null,null,null,null,null,null,null,null,null,{"$f":"SUM(O11,O17)","v":0},null,null,null,12,{"$f":"IF(AF6<12,\"\",VLOOKUP(12,B6:N65,4,FALSE))","v":""},{"$f":"IF(AF6<12,\"\",VLOOKUP(12,B6:N65,10,FALSE))","v":""}]
[null,{"$f":"IF(F18=\"\",\"\",N18)","v":""},3,"ŘEPY I.",null,null,null,null,null,null,{"$f":"SUM(F18:J18)","v":0},{"$f":"MAX(F18:J18)","v":0},{"$f":"SUM(K18*1000)+L18+0.4","v":0.4},{"$f":"IF(F18=\"\",\"\",RANK(M18,M6:M65,0))","v":""},null,null,null,{"$f":"IF(F18=\"\",\"\",RANK(Q23,Q11:Q65,0))","v":""},null,{"$f":"IF(F18=\"\",\"\",RANK(AA18,AA6:AA64,0))","v":""},{"$f":"IF(R18=\"\",\"\",R18)","v":""},{"$f":"IF(D18=\"\",\"\",D18)","v":"ŘEPY I."},{"$f":"IF(O23=\"\",\"\",O23)","v":0},{"$f":"IF(V18=\"HOSTIVAŘ I.\",\"GARÁŽ HOSTIVAŘ\",IF(V18=\"VRŠOVICE I.\",\"GARÁŽ VRŠOVICE\",IF(V18=\"KLÍČOV I.\",\"GARÁŽ KLÍČOV\",IF(V18=\"ŘEPY I.\",\"GARÁŽ ŘEPY\",IF(V18=\"KAČEROV I.\",\"GARÁŽ KAČEROV\",\"\")))))","v":"GARÁŽ ŘEPY"},{"$f":"MAX(F23:J23,F29:J29)+0.04","v":0.04},{"$f":"SUM(O23,O29)*1000","v":0},{"$f":"SUM(Y18:Z18)","v":0.04},{"$f":"IF(AC29=\"\",\"\",AC29)","v":0},null,{"$f":"IF(T18=\"\",\"\",T18)","v":""},null,null,13,{"$f":"IF(AF6<13,\"\",VLOOKUP(13,B6:N65,4,FALSE))","v":""},{"$f":"IF(AF6<13,\"\",VLOOKUP(13,B6:N65,10,FALSE))","v":""},null,{"$f":"COUNT(T6:T64)","v":0},"POŘEDÍ GARÁŽÍ"]
[null,{"$f":"IF(F19=\"\",\"\",N19)","v":""},null,null,null,null,null,null,null,null,{"$f":"SUM(F19:J19)","v":0},{"$f":"MAX(F19:J19)","v":0},{"$f":"SUM(K19*1000)+L19+0.39","v":0.39},{"$f":"IF(F19=\"\",\"\",RANK(M19,M6:M65,0))","v":""},null,null,null,null,null,null,null,null,null,null,null,null,null,null,null,null,null,null,14,{"$f":"IF(AF6<14,\"\",VLOOKUP(14,B6:N65,4,FALSE))","v":""},{"$f":"IF(AF6<14,\"\",VLOOKUP(14,B6:N65,10,FALSE))","v":""},null,null,1,{"$f":"IF(AK18<1,\"\",VLOOKUP(1,T6:AB64,5,FALSE))","v":""},{"$f":"IF(AK18<1,\"\",VLOOKUP(1,T6:AB64,9,FALSE))","v":""}]
[null,{"$f":"IF(F20=\"\",\"\",N20)","v":""},null,null,null,null,null,null,null,null,{"$f":"SUM(F20:J20)","v":0},{"$f":"MAX(F20:J20)","v":0},{"$f":"SUM(K20*1000)+L20+0.38","v":0.38},{"$f":"IF(F20=\"\",\"\",RANK(M20,M6:M65,0))","v":""},null,null,null,null,null,null,null,null,null,null,null,null,null,null,null,null,null,null,15,{"$f":"IF(AF6<15,\"\",VLOOKUP(15,B6:N65,4,FALSE))","v":""},{"$f":"IF(AF6<15,\"\",VLOOKUP(15,B6:N65,10,FALSE))","v":""},null,null,2,{"$f":"IF(AK18<2,\"\",VLOOKUP(2,T6:AB64,5,FALSE))","v":""},{"$f":"IF(AK18<2,\"\",VLOOKUP(2,T6:AB64,9,FALSE))","v":""}]
[null,{"$f":"IF(F21=\"\",\"\",N21)","v":""},null,null,null,null,null,null,null,null,{"$f":"SUM(F21:J21)","v":0},{"$f":"MAX(F21:J21)","v":0},{"$f":"SUM(K21*1000)+L21+0.37","v":0.37},{"$f":"IF(F21=\"\",\"\",RANK(M21,M6:M65,0))","v":""},null,null,null,null,null,null,null,null,null,null,null,null,null,null,null,null,null,null,16,{"$f":"IF(AF6<16,\"\",VLOOKUP(16,B6:N65,4,FALSE))","v":""},{"$f":"IF(AF6<16,\"\",VLOOKUP(16,B6:N65,10,FALSE))","v":""},null,null,3,{"$f":"IF(AK18<3,\"\",VLOOKUP(3,T6:AB64,5,FALSE))","v":""},{"$f":"IF(AK18<3,\"\",VLOOKUP(3,T6:AB64,9,FALSE))","v":""}]
[null,{"$f":"IF(F22=\"\",\"\",N22)","v":""},null,null,null,null,null,null,null,null,{"$f":"SUM(F22:J22)","v":0},{"$f":"MAX(F22:J22)","v":0},{"$f":"SUM(K22*1000)+L22+0.36","v":0.36},{"$f":"IF(F22=\"\",\"\",RANK(M22,M6:M65,0))","v":""},null,null,null,null,null,null,null,null,null,null,null,null,null,null,null,null,null,null,17,{"$f":"IF(AF6<17,\"\",VLOOKUP(17,B6:N65,4,FALSE))","v":""},{"$f":"IF(AF6<17,\"\",VLOOKUP(17,B6:N65,10,FALSE))","v":""},null,null,4,{"$f":"IF(AK18<4,\"\",VLOOKUP(4,T6:AB64,5,FALSE))","v":""},{"$f":"IF(AK18<4,\"\",VLOOKUP(4,T6:AB64,9,FALSE))","v":""}]
[null,null,null,null,null,{"$f":"SUM(F18:F22)","v":0},{"$f":"SUM(G18:G22)","v":0},{"$f":"SUM(H18:H22)","v":0},{"$f":"SUM(I18:I22)","v":0},{"$f":"SUM(J18:J22)","v":0},null,null,null,null,{"$f":"SUM(F23:J23)","v":0},{"$f":"MAX(F23:J23)+0.008","v":8.0000000000000002E-3},{"$f":"IF(F18=\"\",\"\",SUM(O23*1000)+P23)","v":""},null,null,null,null,null,null,null,null,null,null,null,null,null,null,null,18,{"$f":"IF(AF6<18,\"\",VLOOKUP(18,B6:N65,4,FALSE))","v":""},{"$f":"IF(AF6<18,\"\",VLOOKUP(18,B6:N65,10,FALSE))","v":""},null,null,5,{"$f":"IF(AK18<5,\"\",VLOOKUP(5,T6:AB64,5,FALSE))","v":""},{"$f":"IF(AK18<5,\"\",VLOOKUP(5,T6:AB64,9,FALSE))","v":""}]
[null,{"$f":"IF(F24=\"\",\"\",N24)","v":""},4,"ŘEPY II.",null,null,null,null,null,null,{"$f":"SUM(F24:J24)","v":0},{"$f":"MAX(F24:J24)","v":0},{"$f":"SUM(K24*1000)+L24+0.35","v":0.35},{"$f":"IF(F24=\"\",\"\",RANK(M24,M6:M65,0))","v":""},null,null,null,{"$f":"IF(F24=\"\",\"\",RANK(Q29,Q11:Q65,0))","v":""},null,null,{"$f":"IF(R24=\"\",\"\",R24)","v":""},{"$f":"IF(D24=\"\",\"\",D24)","v":"ŘEPY II."},{"$f":"IF(O29=\"\",\"\",O29)","v":0},null,null,null,null,null,null,null,null,null,19,{"$f":"IF(AF6<19,\"\",VLOOKUP(19,B6:N65,4,FALSE))","v":""},{"$f":"IF(AF6<19,\"\",VLOOKUP(19,B6:N65,10,FALSE))","v":""}]
[null,{"$f":"IF(F25=\"\",\"\",N25)","v":""},null,null,null,null,null,null,null,null,{"$f":"SUM(F25:J25)","v":0},{"$f":"MAX(F25:J25)","v":0},{"$f":"SUM(K25*1000)+L25+0.34","v":0.34},{"$f":"IF(F25=\"\",\"\",RANK(M25,M6:M65,0))","v":""},null,null,null,null,null,null,null,null,null,null,null,null,null,null,null,null,null,null,20,{"$f":"IF(AF6<20,\"\",VLOOKUP(20,B6:N65,4,FALSE))","v":""},{"$f":"IF(AF6<20,\"\",VLOOKUP(20,B6:N65,10,FALSE))","v":""}]
[null,{"$f":"IF(F26=\"\",\"\",N26)","v":""},null,null,null,null,null,null,null,null,{"$f":"SUM(F26:J26)","v":0},{"$f":"MAX(F26:J26)","v":0},{"$f":"SUM(K26*1000)+L26+0.33","v":0.33},{"$f":"IF(F26=\"\",\"\",RANK(M26,M6:M65,0))","v":""},null,null,null,null,null,null,null,null,null,null,null,null,null,null,null,null,null,null,21,{"$f":"IF(AF6<21,\"\",VLOOKUP(21,B6:N65,4,FALSE))","v":""},{"$f":"IF(AF6<21,\"\",VLOOKUP(21,B6:N65,10,FALSE))","v":""}]
[null,{"$f":"IF(F27=\"\",\"\",N27)","v":""},null,null,null,null,null,null,null,null,{"$f":"SUM(F27:J27)","v":0},{"$f":"MAX(F27:J27)","v":0},{"$f":"SUM(K27*1000)+L27+0.32","v":0.32},{"$f":"IF(F27=\"\",\"\",RANK(M27,M6:M65,0))","v":""},null,null,null,null,null,null,null,null,null,null,null,null,null,null,null,null,null,null,22,{"$f":"IF(AF6<22,\"\",VLOOKUP(22,B6:N65,4,FALSE))","v":""},{"$f":"IF(AF6<22,\"\",VLOOKUP(22,B6:N65,10,FALSE))","v":""}]
[null,{"$f":"IF(F28=\"\",\"\",N28)","v":""},null,null,null,null,null,null,null,null,{"$f":"SUM(F28:J28)","v":0},{"$f":"MAX(F28:J28)","v":0},{"$f":"SUM(K28*1000)+L28+0.31","v":0.31},{"$f":"IF(F28=\"\",\"\",RANK(M28,M6:M65,0))","v":""},null,null,null,null,null,null,null,null,null,null,null,null,null,null,null,null,null,null,23,{"$f":"IF(AF6<23,\"\",VLOOKUP(23,B6:N65,4,FALSE))","v":""},{"$f":"IF(AF6<23,\"\",VLOOKUP(23,B6:N65,10,FALSE))","v":""}]
[null,null,null,null,null,{"$f":"SUM(F24:F28)","v":0},{"$f":"SUM(G24:G28)","v":0},{"$f":"SUM(H24:H28)","v":0},{"$f":"SUM(I24:I28)","v":0},{"$f":"SUM(J24:J28)","v":0},null,null,null,null,{"$f":"SUM(F29:J29)","v":0},{"$f":"MAX(F29:J29)+0.007","v":7.0000000000000001E-3},{"$f":"IF(F24=\"\",\"\",SUM(O29*1000)+P29)","v":""},null,null,null,null,null,null,null,null,null,null,null,{"$f":"SUM(O23,O29)","v":0},null,null,null,24,{"$f":"IF(AF6<24,\"\",VLOOKUP(24,B6:N65,4,FALSE))","v":""},{"$f":"IF(AF6<24,\"\",VLOOKUP(24,B6:N65,10,FALSE))","v":""}]
[null,{"$f":"IF(F30=\"\",\"\",N30)","v":""},5,"KAČEROV I.",null,null,null,null,null,null,{"$f":"SUM(F30:J30)","v":0},{"$f":"MAX(F30:J30)","v":0},{"$f":"SUM(K30*1000)+L30+0.3","v":0.3},{"$f":"IF(F30=\"\",\"\",RANK(M30,M6:M65,0))","v":""},null,null,null,{"$f":"IF(F30=\"\",\"\",RANK(Q35,Q11:Q65,0))","v":""},null,{"$f":"IF(F30=\"\",\"\",RANK(AA30,AA6:AA64,0))","v":""},{"$f":"IF(R30=\"\",\"\",R30)","v":""},{"$f":"IF(D30=\"\",\"\",D30)","v":"KAČEROV I."},{"$f":"IF(O35=\"\",\"\",O35)","v":0},{"$f":"IF(V30=\"HOSTIVAŘ I.\",\"GARÁŽ HOSTIVAŘ\",IF(V30=\"VRŠOVICE I.\",\"GARÁŽ VRŠOVICE\",IF(V30=\"KLÍČOV I.\",\"GARÁŽ KLÍČOV\",IF(V30=\"ŘEPY I.\",\"GARÁŽ ŘEPY\",IF(V30=\"KAČEROV I.\",\"GARÁŽ KAČEROV\",\"\")))))","v":"GARÁŽ KAČEROV"},{"$f":"MAX(F35:J35,F41:J41)+0.03","v":0.03},{"$f":"SUM(O35,O41)*1000","v":0},{"$f":"SUM(Y30:Z30)","v":0.03},{"$f":"IF(AC41=\"\",\"\",AC41)","v":0},null,{"$f":"IF(T30=\"\",\"\",T30)","v":""},null,null,25,{"$f":"IF(AF6<25,\"\",VLOOKUP(25,B6:N65,4,FALSE))","v":""},{"$f":"IF(AF6<25,\"\",VLOOKUP(25,B6:N65,10,FALSE))","v":""}]
[null,{"$f":"IF(F31=\"\",\"\",N31)","v":""},null,null,null,null,null,null,null,null,{"$f":"SUM(F31:J31)","v":0},{"$f":"MAX(F31:J31)","v":0},{"$f":"SUM(K31*1000)+L31+0.29","v":0.28999999999999998},{"$f":"IF(F31=\"\",\"\",RANK(M31,M6:M65,0))","v":""},null,null,null,null,null,null,null,null,null,null,null,null,null,null,null,null,null,null,26,{"$f":"IF(AF6<26,\"\",VLOOKUP(26,B6:N65,4,FALSE))","v":""},{"$f":"IF(AF6<26,\"\",VLOOKUP(26,B6:N65,10,FALSE))","v":""}]
[null,{"$f":"IF(F32=\"\",\"\",N32)","v":""},null,null,null,null,null,null,null,null,{"$f":"SUM(F32:J32)","v":0},{"$f":"MAX(F32:J32)","v":0},{"$f":"SUM(K32*1000)+L32+0.28","v":0.28000000000000003},{"$f":"IF(F32=\"\",\"\",RANK(M32,M6:M65,0))","v":""},null,null,null,null,null,null,null,null,null,null,null,null,null,null,null,null,null,null,27,{"$f":"IF(AF6<27,\"\",VLOOKUP(27,B6:N65,4,FALSE))","v":""},{"$f":"IF(AF6<27,\"\",VLOOKUP(27,B6:N65,10,FALSE))","v":""}]
[null,{"$f":"IF(F33=\"\",\"\",N33)","v":""},null,null,null,null,null,null,null,null,{"$f":"SUM(F33:J33)","v":0},{"$f":"MAX(F33:J33)","v":0},{"$f":"SUM(K33*1000)+L33+0.27","v":0.27},{"$f":"IF(F33=\"\",\"\",RANK(M33,M6:M65,0))","v":""},null,null,null,null,null,null,null,null,null,null,null,null,null,null,null,null,null,null,28,{"$f":"IF(AF6<28,\"\",VLOOKUP(28,B6:N65,4,FALSE))","v":""},{"$f":"IF(AF6<28,\"\",VLOOKUP(28,B6:N65,10,FALSE))","v":""}]
[null,{"$f":"IF(F34=\"\",\"\",N34)","v":""},null,null,null,null,null,null,null,null,{"$f":"SUM(F34:J34)","v":0},{"$f":"MAX(F34:J34)","v":0},{"$f":"SUM(K34*1000)+L34+0.26","v":0.26},{"$f":"IF(F34=\"\",\"\",RANK(M34,M6:M65,0))","v":""},null,null,null,null,null,null,null,null,null,null,null,null,null,null,null,null,null,null,29,{"$f":"IF(AF6<29,\"\",VLOOKUP(29,B6:N65,4,FALSE))","v":""},{"$f":"IF(AF6<29,\"\",VLOOKUP(29,B6:N65,10,FALSE))","v":""}]
[null,null,null,null,null,{"$f":"SUM(F30:F34)","v":0},{"$f":"SUM(G30:G34)","v":0},{"$f":"SUM(H30:H34)","v":0},{"$f":"SUM(I30:I34)","v":0},{"$f":"SUM(J30:J34)","v":0},null,null,null,null,{"$f":"SUM(F35:J35)","v":0},{"$f":"MAX(F35:J35)+0.006","v":6.0000000000000001E-3},{"$f":"IF(F30=\"\",\"\",SUM(O35*1000)+P35)","v":""},null,null,null,null,null,null,null,null,null,null,null,null,null,null,null,30,{"$f":"IF(AF6<30,\"\",VLOOKUP(30,B6:N65,4,FALSE))","v":""},{"$f":"IF(AF6<30,\"\",VLOOKUP(30,B6:N65,10,FALSE))","v":""}]
[null,{"$f":"IF(F36=\"\",\"\",N36)","v":""},6,"KAČEROV II.",null,null,null,null,null,null,{"$f":"SUM(F36:J36)","v":0},{"$f":"MAX(F36:J36)","v":0},{"$f":"SUM(K36*1000)+L36+0.25","v":0.25},{"$f":"IF(F36=\"\",\"\",RANK(M36,M6:M65,0))","v":""},null,null,null,{"$f":"IF(F36=\"\",\"\",RANK(Q41,Q11:Q65,0))","v":""},null,null,{"$f":"IF(R36=\"\",\"\",R36)","v":""},{"$f":"IF(D36=\"\",\"\",D36)","v":"KAČEROV II."},{"$f":"IF(O41=\"\",\"\",O41)","v":0},null,null,null,null,null,null,null,null,null,31,{"$f":"IF(AF6<31,\"\",VLOOKUP(31,B6:N65,4,FALSE))","v":""},{"$f":"IF(AF6<31,\"\",VLOOKUP(31,B6:N65,10,FALSE))","v":""}]
[null,{"$f":"IF(F37=\"\",\"\",N37)","v":""},null,null,null,null,null,null,null,null,{"$f":"SUM(F37:J37)","v":0},{"$f":"MAX(F37:J37)","v":0},{"$f":"SUM(K37*1000)+L37+0.24","v":0.24},{"$f":"IF(F37=\"\",\"\",RANK(M37,M6:M65,0))","v":""},null,null,null,null,null,null,null,null,null,null,null,null,null,null,null,null,null,null,32,{"$f":"IF(AF6<32,\"\",VLOOKUP(32,B6:N65,4,FALSE))","v":""},{"$f":"IF(AF6<32,\"\",VLOOKUP(32,B6:N65,10,FALSE))","v":""}]
[null,{"$f":"IF(F38=\"\",\"\",N38)","v":""},null,null,null,null,null,null,null,null,{"$f":"SUM(F38:J38)","v":0},{"$f":"MAX(F38:J38)","v":0},{"$f":"SUM(K38*1000)+L38+0.23","v":0.23},{"$f":"IF(F38=\"\",\"\",RANK(M38,M6:M65,0))","v":""},null,null,null,null,null,null,null,null,null,null,null,null,null,null,null,null,null,null,33,{"$f":"IF(AF6<33,\"\",VLOOKUP(33,B6:N65,4,FALSE))","v":""},{"$f":"IF(AF6<33,\"\",VLOOKUP(33,B6:N65,10,FALSE))","v":""}]
[null,{"$f":"IF(F39=\"\",\"\",N39)","v":""},null,null,null,null,null,null,null,null,{"$f":"SUM(F39:J39)","v":0},{"$f":"MAX(F39:J39)","v":0},{"$f":"SUM(K39*1000)+L39+0.21","v":0.21},{"$f":"IF(F39=\"\",\"\",RANK(M39,M6:M65,0))","v":""},null,null,null,null,null,null,null,null,null,null,null,null,null,null,null,null,null,null,34,{"$f":"IF(AF6<34,\"\",VLOOKUP(34,B6:N65,4,FALSE))","v":""},{"$f":"IF(AF6<34,\"\",VLOOKUP(34,B6:N65,10,FALSE))","v":""}]
[null,{"$f":"IF(F40=\"\",\"\",N40)","v":""},null,null,null,null,null,null,null,null,{"$f":"SUM(F40:J40)","v":0},{"$f":"MAX(F40:J40)","v":0},{"$f":"SUM(K40*1000)+L40+0.2","v":0.2},{"$f":"IF(F40=\"\",\"\",RANK(M40,M6:M65,0))","v":""},null,null,null,null,null,null,null,null,null,null,null,null,null,null,null,null,null,null,35,{"$f":"IF(AF6<35,\"\",VLOOKUP(35,B6:N65,4,FALSE))","v":""},{"$f":"IF(AF6<35,\"\",VLOOKUP(35,B6:N65,10,FALSE))","v":""}]
[null,null,null,null,null,{"$f":"SUM(F36:F40)","v":0},{"$f":"SUM(G36:G40)","v":0},{"$f":"SUM(H36:H40)","v":0},{"$f":"SUM(I36:I40)","v":0},{"$f":"SUM(J36:J40)","v":0},null,null,null,null,{"$f":"SUM(F41:J41)","v":0},{"$f":"MAX(F41:J41)+0.005","v":5.0000000000000001E-3},{"$f":"IF(F36=\"\",\"\",SUM(O41*1000)+P41)","v":""},null,null,null,null,null,null,null,null,null,null,null,{"$f":"SUM(O35,O41)","v":0},null,null,null,36,{"$f":"IF(AF6<36,\"\",VLOOKUP(36,B6:N65,4,FALSE))","v":""},{"$f":"IF(AF6<36,\"\",VLOOKUP(36,B6:N65,10,FALSE))","v":""}]
[null,{"$f":"IF(F42=\"\",\"\",N42)","v":""},7,"HOSTIVAŘ I.",null,null,null,null,null,null,{"$f":"SUM(F42:J42)","v":0},{"$f":"MAX(F42:J42)","v":0},{"$f":"SUM(K42*1000)+L42+0.19","v":0.19},{"$f":"IF(F42=\"\",\"\",RANK(M42,M6:M65,0))","v":""},null,null,null,{"$f":"IF(F42=\"\",\"\",RANK(Q47,Q11:Q65,0))","v":""},null,{"$f":"IF(F42=\"\",\"\",RANK(AA42,AA6:AA64,0))","v":""},{"$f":"IF(R42=\"\",\"\",R42)","v":""},{"$f":"IF(D42=\"\",\"\",D42)","v":"HOSTIVAŘ I."},{"$f":"IF(O47=\"\",\"\",O47)","v":0},{"$f":"IF(V42=\"HOSTIVAŘ I.\",\"GARÁŽ HOSTIVAŘ\",IF(V42=\"VRŠOVICE I.\",\"GARÁŽ VRŠOVICE\",IF(V42=\"KLÍČOV I.\",\"GARÁŽ KLÍČOV\",IF(V42=\"ŘEPY I.\",\"GARÁŽ ŘEPY\",IF(V42=\"KAČEROV I.\",\"GARÁŽ KAČEROV\",\"\")))))","v":"GARÁŽ HOSTIVAŘ"},{"$f":"MAX(F47:J47,F53:J53)+0.02","v":0.02},{"$f":"SUM(O47,O53)*1000","v":0},{"$f":"SUM(Y42:Z42)","v":0.02},{"$f":"IF(AC53=\"\",\"\",AC53)","v":0},null,{"$f":"IF(T42=\"\",\"\",T42)","v":""},null,null,37,{"$f":"IF(AF6<37,\"\",VLOOKUP(37,B6:N65,4,FALSE))","v":""},{"$f":"IF(AF6<37,\"\",VLOOKUP(37,B6:N65,10,FALSE))","v":""}]
[null,{"$f":"IF(F43=\"\",\"\",N43)","v":""},null,null,null,null,null,null,null,null,{"$f":"SUM(F43:J43)","v":0},{"$f":"MAX(F43:J43)","v":0},{"$f":"SUM(K43*1000)+L43+0.18","v":0.18},{"$f":"IF(F43=\"\",\"\",RANK(M43,M6:M65,0))","v":""},null,null,null,null,null,null,null,null,null,null,null,null,null,null,null,null,null,null,38,{"$f":"IF(AF6<38,\"\",VLOOKUP(38,B6:N65,4,FALSE))","v":""},{"$f":"IF(AF6<38,\"\",VLOOKUP(38,B6:N65,10,FALSE))","v":""}]
[null,{"$f":"IF(F44=\"\",\"\",N44)","v":""},null,null,null,null,null,null,null,null,{"$f":"SUM(F44:J44)","v":0},{"$f":"MAX(F44:J44)","v":0},{"$f":"SUM(K44*1000)+L44+0.17","v":0.17},{"$f":"IF(F44=\"\",\"\",RANK(M44,M6:M65,0))","v":""},null,null,null,null,null,null,null,null,null,null,null,null,null,null,null,null,null,null,39,{"$f":"IF(AF6<39,\"\",VLOOKUP(39,B6:N65,4,FALSE))","v":""},{"$f":"IF(AF6<39,\"\",VLOOKUP(39,B6:N65,10,FALSE))","v":""}]
[null,{"$f":"IF(F45=\"\",\"\",N45)","v":""},null,null,null,null,null,null,null,null,{"$f":"SUM(F45:J45)","v":0},{"$f":"MAX(F45:J45)","v":0},{"$f":"SUM(K45*1000)+L45+0.16","v":0.16},{"$f":"IF(F45=\"\",\"\",RANK(M45,M6:M65,0))","v":""},null,null,null,null,null,null,null,null,null,null,null,null,null,null,null,null,null,null,40,{"$f":"IF(AF6<40,\"\",VLOOKUP(40,B6:N65,4,FALSE))","v":""},{"$f":"IF(AF6<40,\"\",VLOOKUP(40,B6:N65,10,FALSE))","v":""}]
[null,{"$f":"IF(F46=\"\",\"\",N46)","v":""},null,null,null,null,null,null,null,null,{"$f":"SUM(F46:J46)","v":0},{"$f":"MAX(F46:J46)","v":0},{"$f":"SUM(K46*1000)+L46+0.15","v":0.15},{"$f":"IF(F46=\"\",\"\",RANK(M46,M6:M65,0))","v":""},null,null,null,null,null,null,null,null,null,null,null,null,null,null,null,null,null,null,41,{"$f":"IF(AF6<41,\"\",VLOOKUP(41,B6:N65,4,FALSE))","v":""},{"$f":"IF(AF6<41,\"\",VLOOKUP(41,B6:N65,10,FALSE))","v":""}]
[null,null,null,null,null,{"$f":"SUM(F42:F46)","v":0},{"$f":"SUM(G42:G46)","v":0},{"$f":"SUM(H42:H46)","v":0},{"$f":"SUM(I42:I46)","v":0},{"$f":"SUM(J42:J46)","v":0},null,null,null,null,{"$f":"SUM(F47:J47)","v":0},{"$f":"MAX(F47:J47)+0.004","v":4.0000000000000001E-3},{"$f":"IF(F42=\"\",\"\",SUM(O47*1000)+P47)","v":""},null,null,null,null,null,null,null,null,null,null,null,null,null,null,null,42,{"$f":"IF(AF6<42,\"\",VLOOKUP(42,B6:N65,4,FALSE))","v":""},{"$f":"IF(AF6<42,\"\",VLOOKUP(42,B6:N65,10,FALSE))","v":""}]
[null,{"$f":"IF(F48=\"\",\"\",N48)","v":""},8,"HOSTIVAŘ II.",null,null,null,null,null,null,{"$f":"SUM(F48:J48)","v":0},{"$f":"MAX(F48:J48)","v":0},{"$f":"SUM(K48*1000)+L48+0.14","v":0.14000000000000001},{"$f":"IF(F48=\"\",\"\",RANK(M48,M6:M65,0))","v":""},null,null,null,{"$f":"IF(F48=\"\",\"\",RANK(Q53,Q11:Q65,0))","v":""},null,null,{"$f":"IF(R48=\"\",\"\",R48)","v":""},{"$f":"IF(D48=\"\",\"\",D48)","v":"HOSTIVAŘ II."},{"$f":"IF(O53=\"\",\"\",O53)","v":0},null,null,null,null,null,null,null,null,null,43,{"$f":"IF(AF6<43,\"\",VLOOKUP(43,B6:N65,4,FALSE))","v":""},{"$f":"IF(AF6<43,\"\",VLOOKUP(43,B6:N65,10,FALSE))","v":""}]
[null,{"$f":"IF(F49=\"\",\"\",N49)","v":""},null,null,null,null,null,null,null,null,{"$f":"SUM(F49:J49)","v":0},{"$f":"MAX(F49:J49)","v":0},{"$f":"SUM(K49*1000)+L49+0.13","v":0.13},{"$f":"IF(F49=\"\",\"\",RANK(M49,M6:M65,0))","v":""},null,null,null,null,null,null,null,null,null,null,null,null,null,null,null,null,null,null,44,{"$f":"IF(AF6<44,\"\",VLOOKUP(44,B6:N65,4,FALSE))","v":""},{"$f":"IF(AF6<44,\"\",VLOOKUP(44,B6:N65,10,FALSE))","v":""}]
[null,{"$f":"IF(F50=\"\",\"\",N50)","v":""},null,null,null,null,null,null,null,null,{"$f":"SUM(F50:J50)","v":0},{"$f":"MAX(F50:J50)","v":0},{"$f":"SUM(K50*1000)+L50+0.12","v":0.12},{"$f":"IF(F50=\"\",\"\",RANK(M50,M6:M65,0))","v":""},null,null,null,null,null,null,null,null,null,null,null,null,null,null,null,null,null,null,45,{"$f":"IF(AF6<45,\"\",VLOOKUP(45,B6:N65,4,FALSE))","v":""},{"$f":"IF(AF6<45,\"\",VLOOKUP(45,B6:N65,10,FALSE))","v":""}]
[null,{"$f":"IF(F51=\"\",\"\",N51)","v":""},null,null,null,null,null,null,null,null,{"$f":"SUM(F51:J51)","v":0},{"$f":"MAX(F51:J51)","v":0},{"$f":"SUM(K51*1000)+L51+0.11","v":0.11},{"$f":"IF(F51=\"\",\"\",RANK(M51,M6:M65,0))","v":""},null,null,null,null,null,null,null,null,null,null,null,null,null,null,null,null,null,null,46,{"$f":"IF(AF6<46,\"\",VLOOKUP(46,B6:N65,4,FALSE))","v":""},{"$f":"IF(AF6<46,\"\",VLOOKUP(46,B6:N65,10,FALSE))","v":""}]
[null,{"$f":"IF(F52=\"\",\"\",N52)","v":""},null,null,null,null,null,null,null,null,{"$f":"SUM(F52:J52)","v":0},{"$f":"MAX(F52:J52)","v":0},{"$f":"SUM(K52*1000)+L52+0.1","v":0.1},{"$f":"IF(F52=\"\",\"\",RANK(M52,M6:M65,0))","v":""},null,null,null,null,null,null,null,null,null,null,null,null,null,null,null,null,null,null,47,{"$f":"IF(AF6<47,\"\",VLOOKUP(47,B6:N65,4,FALSE))","v":""},{"$f":"IF(AF6<47,\"\",VLOOKUP(47,B6:N65,10,FALSE))","v":""}]
[null,null,null,null,null,{"$f":"SUM(F48:F52)","v":0},{"$f":"SUM(G48:G52)","v":0},{"$f":"SUM(H48:H52)","v":0},{"$f":"SUM(I48:I52)","v":0},{"$f":"SUM(J48:J52)","v":0},null,null,null,null,{"$f":"SUM(F53:J53)","v":0},{"$f":"MAX(F53:J53)+0.003","v":3.0000000000000001E-3},{"$f":"IF(F48=\"\",\"\",SUM(O53*1000)+P53)","v":""},null,null,null,null,null,null,null,null,null,null,null,{"$f":"SUM(O47,O53)","v":0},null,null,null,48,{"$f":"IF(AF6<48,\"\",VLOOKUP(48,B6:N65,4,FALSE))","v":""},{"$f":"IF(AF6<48,\"\",VLOOKUP(48,B6:N65,10,FALSE))","v":""}]
[null,{"$f":"IF(F54=\"\",\"\",N54)","v":""},9,"VRŠOVICE I.",null,null,null,null,null,null,{"$f":"SUM(F54:J54)","v":0},{"$f":"MAX(F54:J54)","v":0},{"$f":"SUM(K54*1000)+L54+0.09","v":0.09},{"$f":"IF(F54=\"\",\"\",RANK(M54,M6:M65,0))","v":""},null,null,null,{"$f":"IF(F54=\"\",\"\",RANK(Q59,Q11:Q65,0))","v":""},null,{"$f":"IF(F54=\"\",\"\",RANK(AA54,AA6:AA64,0))","v":""},{"$f":"IF(R54=\"\",\"\",R54)","v":""},{"$f":"IF(D54=\"\",\"\",D54)","v":"VRŠOVICE I."},{"$f":"IF(O59=\"\",\"\",O59)","v":0},{"$f":"IF(V54=\"HOSTIVAŘ I.\",\"GARÁŽ HOSTIVAŘ\",IF(V54=\"VRŠOVICE I.\",\"GARÁŽ VRŠOVICE\",IF(V54=\"KLÍČOV I.\",\"GARÁŽ KLÍČOV\",IF(V54=\"ŘEPY I.\",\"GARÁŽ ŘEPY\",IF(V54=\"KAČEROV I.\",\"GARÁŽ KAČEROV\",\"\")))))","v":"GARÁŽ VRŠOVICE"},{"$f":"MAX(F59:J59,F65:J65)+0.01","v":0.01},{"$f":"SUM(O59,O65)*1000","v":0},{"$f":"SUM(Y54:Z54)","v":0.01},{"$f":"IF(AC65=\"\",\"\",AC65)","v":0},null,{"$f":"IF(T54=\"\",\"\",T54)","v":""},null,null,49,{"$f":"IF(AF6<49,\"\",VLOOKUP(49,B6:N65,4,FALSE))","v":""},{"$f":"IF(AF6<49,\"\",VLOOKUP(49,B6:N65,10,FALSE))","v":""}]
[null,{"$f":"IF(F55=\"\",\"\",N55)","v":""},null,null,null,null,null,null,null,null,{"$f":"SUM(F55:J55)","v":0},{"$f":"MAX(F55:J55)","v":0},{"$f":"SUM(K55*1000)+L55+0.08","v":0.08},{"$f":"IF(F55=\"\",\"\",RANK(M55,M6:M65,0))","v":""},null,null,null,null,null,null,null,null,null,null,null,null,null,null,null,null,null,null,50,{"$f":"IF(AF6<50,\"\",VLOOKUP(50,B6:N65,4,FALSE))","v":""},{"$f":"IF(AF6<50,\"\",VLOOKUP(50,B6:N65,10,FALSE))","v":""}]
[null,{"$f":"IF(F56=\"\",\"\",N56)","v":""},null,null,null,null,null,null,null,null,{"$f":"SUM(F56:J56)","v":0},{"$f":"MAX(F56:J56)","v":0},{"$f":"SUM(K56*1000)+L56+0.07","v":7.0000000000000007E-2},{"$f":"IF(F56=\"\",\"\",RANK(M56,M6:M65,0))","v":""}]
[null,{"$f":"IF(F57=\"\",\"\",N57)","v":""},null,null,null,null,null,null,null,null,{"$f":"SUM(F57:J57)","v":0},{"$f":"MAX(F57:J57)","v":0},{"$f":"SUM(K57*1000)+L57+0.06","v":0.06},{"$f":"IF(F57=\"\",\"\",RANK(M57,M6:M65,0))","v":""}]
[null,{"$f":"IF(F58=\"\",\"\",N58)","v":""},null,null,null,null,null,null,null,null,{"$f":"SUM(F58:J58)","v":0},{"$f":"MAX(F58:J58)","v":0},{"$f":"SUM(K58*1000)+L58+0.05","v":0.05},{"$f":"IF(F58=\"\",\"\",RANK(M58,M6:M65,0))","v":""}]
[null,null,null,null,null,{"$f":"SUM(F54:F58)","v":0},{"$f":"SUM(G54:G58)","v":0},{"$f":"SUM(H54:H58)","v":0},{"$f":"SUM(I54:I58)","v":0},{"$f":"SUM(J54:J58)","v":0},null,null,null,null,{"$f":"SUM(F59:J59)","v":0},{"$f":"MAX(F59:J59)+0.002","v":2E-3},{"$f":"IF(F54=\"\",\"\",SUM(O59*1000)+P59)","v":""}]
[null,{"$f":"IF(F60=\"\",\"\",N60)","v":""},10,"VRŠOVICE II.",null,null,null,null,null,null,{"$f":"SUM(F60:J60)","v":0},{"$f":"MAX(F60:J60)","v":0},{"$f":"SUM(K60*1000)+L60+0.04","v":0.04},{"$f":"IF(F60=\"\",\"\",RANK(M60,M6:M65,0))","v":""},null,null,null,{"$f":"IF(F60=\"\",\"\",RANK(Q65,Q11:Q65,0))","v":""},null,null,{"$f":"IF(R60=\"\",\"\",R60)","v":""},{"$f":"IF(D60=\"\",\"\",D60)","v":"VRŠOVICE II."},{"$f":"IF(O65=\"\",\"\",O65)","v":0}]
[null,{"$f":"IF(F61=\"\",\"\",N61)","v":""},null,null,null,null,null,null,null,null,{"$f":"SUM(F61:J61)","v":0},{"$f":"MAX(F61:J61)","v":0},{"$f":"SUM(K61*1000)+L61+0.03","v":0.03},{"$f":"IF(F61=\"\",\"\",RANK(M61,M6:M65,0))","v":""}]
[null,{"$f":"IF(F62=\"\",\"\",N62)","v":""},null,null,null,null,null,null,null,null,{"$f":"SUM(F62:J62)","v":0},{"$f":"MAX(F62:J62)","v":0},{"$f":"SUM(K62*1000)+L62+0.02","v":0.02},{"$f":"IF(F62=\"\",\"\",RANK(M62,M6:M65,0))","v":""}]
[null,{"$f":"IF(F63=\"\",\"\",N63)","v":""},null,null,null,null,null,null,null,null,{"$f":"SUM(F63:J63)","v":0},{"$f":"MAX(F63:J63)","v":0},{"$f":"SUM(K63*1000)+L63+0.01","v":0.01},{"$f":"IF(F63=\"\",\"\",RANK(M63,M6:M65,0))","v":""}]
[null,{"$f":"IF(F64=\"\",\"\",N64)","v":""},null,null,null,null,null,null,null,null,{"$f":"SUM(F64:J64)","v":0},{"$f":"MAX(F64:J64)","v":0},{"$f":"SUM(K64*1000)+L64","v":0},{"$f":"IF(F64=\"\",\"\",RANK(M64,M6:M65,0))","v":""}]
[null,null,null,null,null,{"$f":"SUM(F60:F64)","v":0},{"$f":"SUM(G60:G64)","v":0},{"$f":"SUM(H60:H64)","v":0},{"$f":"SUM(I60:I64)","v":0},{"$f":"SUM(J60:J64)","v":0},null,{"$f":"MAX(L12:L64,L6:L10)","v":0},null,null,{"$f":"SUM(F65:J65)","v":0},{"$f":"MAX(F65:J65)+0.001","v":1E-3},{"$f":"IF(F60=\"\",\"\",SUM(O65*1000)+P65)","v":""},null,null,null,null,null,null,null,null,null,null,null,{"$f":"SUM(O59,O65)","v":0}]

{"sheet":"HOSTIVAŘ","index":7,"n_rows":65,"n_cols":53,"rows_kept":65,"cut":false,"hidden":false,"merged":[[64,28,64,29],[52,28,52,29],[53,2,57,2],[53,3,57,3],[53,17,57,17],[53,29,63,29],[59,2,63,2],[59,3,63,3],[59,17,63,17],[35,3,39,3],[35,17,39,17],[40,28,40,29],[41,2,45,2],[41,3,45,3],[41,17,45,17],[41,29,51,29],[47,2,51,2],[47,3,51,3],[47,17,51,17],[17,37,17,39],[23,2,27,2],[23,3,27,3],[23,17,27,17],[28,28,28,29],[29,2,33,2],[29,3,33,3],[29,17,33,17],[29,29,39,29],[35,2,39,2],[11,2,15,2],[11,3,15,3],[11,17,15,17],[16,28,16,29],[17,2,21,2],[17,3,21,3],[17,17,21,17],[17,29,27,29],[2,3,2,39],[0,0,3,0],[4,2,4,3],[4,13,4,14],[4,32,4,34],[5,2,9,2],[5,3,9,3],[5,17,9,17],[5,29,15,29],[5,37,5,39]]}
["ZPĚT"]
[]
[null,null,null,"Sportovní turnaj v Bowlingu o pohár ZV-OS Hostivař dne 25.4. 2015"]
[]
[null,null,"Garáž",null,"Jméno","I.","II.","III.","IV.","V.","Body",null,null,"Jednotlivci.",null,null,null,"Družstva.",null,null,null,null,null,null,null,null,null,null,null,null,null,null,"pořadí jednotlivců"]
[null,{"$f":"IF(F6=\"\",\"\",N6)","v":""},1,"VRŠOVICE I.",null,null,null,null,null,null,{"$f":"SUM(F6:J6)","v":0},{"$f":"MAX(F6:J6)","v":0},{"$f":"SUM(K6*1000)+L6+0.5","v":0.5},{"$f":"IF(F6=\"\",\"\",RANK(M6,M6:M65,0))","v":""},null,null,null,{"$f":"IF(F6=\"\",\"\",RANK(Q11,Q11:Q65,0))","v":""},null,{"$f":"IF(F6=\"\",\"\",RANK(AA6,AA6:AA64,0))","v":""},{"$f":"IF(R6=\"\",\"\",R6)","v":""},{"$f":"IF(D6=\"\",\"\",D6)","v":"VRŠOVICE I."},{"$f":"IF(O11=\"\",\"\",O11)","v":0},{"$f":"IF(V6=\"HOSTIVAŘ I.\",\"GARÁŽ HOSTIVAŘ\",IF(V6=\"VRŠOVICE I.\",\"GARÁŽ VRŠOVICE\",IF(V6=\"KLÍČOV I.\",\"GARÁŽ KLÍČOV\",IF(V6=\"ŘEPY I.\",\"GARÁŽ ŘEPY\",IF(V6=\"KAČEROV I.\",\"GARÁŽ KAČEROV\",\"\")))))","v":"GARÁŽ VRŠOVICE"},{"$f":"MAX(F11:J11,F17:J17)+0.05","v":0.05},{"$f":"SUM(O11,O17)*1000","v":0},{"$f":"SUM(Y6:Z6)","v":0.05},{"$f":"IF(AC17=\"\",\"\",AC17)","v":0},null,{"$f":"IF(T6=\"\",\"\",T6)","v":""},null,{"$f":"COUNT(F6:F10,F12:F16,F18:F22,F24:F28,F30:F34,F36:F40,F42:F46,F48:F52,F54:F58,F60:F64)","v":0},1,{"$f":"IF(AF6<1,\"\",VLOOKUP(1,B6:N65,4,FALSE))","v":""},{"$f":"IF(AF6<1,\"\",VLOOKUP(1,B6:N65,10,FALSE))","v":""},null,{"$f":"COUNT(U6:U16,U18:U28,U30:U40,U42:U52,U54:U64)","v":0},"POŘADÍ DRUŽSTEV",null,null,null,null,null,null,null,null,null,null,null,null,null,null,"HOSTIVAŘ I."]
[null,{"$f":"IF(F7=\"\",\"\",N7)","v":""},null,null,null,null,null,null,null,null,{"$f":"SUM(F7:J7)","v":0},0,{"$f":"SUM(K7*1000)+L7+0.49","v":0.49},{"$f":"IF(F7=\"\",\"\",RANK(M7,M6:M65,0))","v":""},null,null,null,null,null,null,null,null,null,null,null,null,null,null,null,null,null,null,{"$f":"SUM(AG6+1)","v":2},{"$f":"IF(AF6<2,\"\",VLOOKUP(2,B6:N65,4,FALSE))","v":""},{"$f":"IF(AF6<2,\"\",VLOOKUP(2,B6:N65,10,FALSE))","v":""},null,null,1,{"$f":"IF(AK6<1,\"\",VLOOKUP(1,U6:W64,2,FALSE))","v":""},{"$f":"IF(AK6<1,\"\",VLOOKUP(1,U6:W64,3,FALSE))","v":""},null,null,null,null,null,null,null,null,null,null,null,null,"VRŠOVICE I."]
[null,{"$f":"IF(F8=\"\",\"\",N8)","v":""},null,null,null,null,null,null,null,null,{"$f":"SUM(F8:J8)","v":0},0,{"$f":"SUM(K8*1000)+L8+0.48","v":0.48},{"$f":"IF(F8=\"\",\"\",RANK(M8,M6:M65,0))","v":""},null,null,null,null,null,null,null,null,null,null,null,null,null,null,null,null,null,null,{"$f":"SUM(AG7+1)","v":3},{"$f":"IF(AF6<3,\"\",VLOOKUP(3,B6:N65,4,FALSE))","v":""},{"$f":"IF(AF6<3,\"\",VLOOKUP(3,B6:N65,10,FALSE))","v":""},null,null,2,{"$f":"IF(AK6<2,\"\",VLOOKUP(2,U6:W64,2,FALSE))","v":""},{"$f":"IF(AK6<2,\"\",VLOOKUP(2,U6:W64,3,FALSE))","v":""},null,null,null,null,null,null,null,null,null,null,null,null,"KLÍČOV I."]
[null,{"$f":"IF(F9=\"\",\"\",N9)","v":""},null,null,null,null,null,null,null,null,{"$f":"SUM(F9:J9)","v":0},0,{"$f":"SUM(K9*1000)+L9+0.47","v":0.47},{"$f":"IF(F9=\"\",\"\",RANK(M9,M6:M65,0))","v":""},null,null,null,null,null,null,null,null,null,null,null,null,null,null,null,null,null,null,4,{"$f":"IF(AF6<4,\"\",VLOOKUP(4,B6:N65,4,FALSE))","v":""},{"$f":"IF(AF6<4,\"\",VLOOKUP(4,B6:N65,10,FALSE))","v":""},null,null,3,{"$f":"IF(AK6<3,\"\",VLOOKUP(3,U6:W64,2,FALSE))","v":""},{"$f":"IF(AK6<3,\"\",VLOOKUP(3,U6:W64,3,FALSE))","v":""},null,null,null,null,null,null,null,null,null,null,null,null,"ŘEPY I."]
[null,{"$f":"IF(F10=\"\",\"\",N10)","v":""},null,null,null,null,null,null,null,null,{"$f":"SUM(F10:J10)","v":0},0,{"$f":"SUM(K10*1000)+L10+0.46","v":0.46},{"$f":"IF(F10=\"\",\"\",RANK(M10,M6:M65,0))","v":""},null,null,null,null,null,null,null,null,null,null,null,null,null,null,null,null,null,null,5,{"$f":"IF(AF6<5,\"\",VLOOKUP(5,B6:N65,4,FALSE))","v":""},{"$f":"IF(AF6<5,\"\",VLOOKUP(5,B6:N65,10,FALSE))","v":""},null,null,4,{"$f":"IF(AK6<4,\"\",VLOOKUP(4,U6:W64,2,FALSE))","v":""},{"$f":"IF(AK6<4,\"\",VLOOKUP(4,U6:W64,3,FALSE))","v":""},null,null,null,null,null,null,null,null,null,null,null,null,"KAČEROV I."]
[null,null,null,null,null,{"$f":"SUM(F6:F10)","v":0},{"$f":"SUM(G6:G10)","v":0},{"$f":"SUM(H6:H10)","v":0},{"$f":"SUM(I6:I10)","v":0},{"$f":"SUM(J6:J10)","v":0},null,0,null,null,{"$f":"SUM(F11:J11)","v":0},{"$f":"MAX(F11:J11)+0.01","v":0.01},{"$f":"IF(F6=\"\",\"\",SUM(O11*1000)+P11)","v":""},null,null,null,null,null,null,null,null,null,null,null,null,null,null,null,6,{"$f":"IF(AF6<6,\"\",VLOOKUP(6,B6:N65,4,FALSE))","v":""},{"$f":"IF(AF6<6,\"\",VLOOKUP(6,B6:N65,10,FALSE))","v":""},null,null,5,{"$f":"IF(AK6<5,\"\",VLOOKUP(5,U6:W64,2,FALSE))","v":""},{"$f":"IF(AK6<5,\"\",VLOOKUP(5,U6:W64,3,FALSE))","v":""}]
[null,{"$f":"IF(F12=\"\",\"\",N12)","v":""},2,"VRŠOVICE II.",null,null,null,null,null,null,{"$f":"SUM(F12:J12)","v":0},0,{"$f":"SUM(K12*1000)+L12+0.45","v":0.45},{"$f":"IF(F12=\"\",\"\",RANK(M12,M6:M65,0))","v":""},null,null,null,{"$f":"IF(F12=\"\",\"\",RANK(Q17,Q11:Q65,0))","v":""},null,null,{"$f":"IF(R12=\"\",\"\",R12)","v":""},{"$f":"IF(D12=\"\",\"\",D12)","v":"VRŠOVICE II."},{"$f":"IF(O17=\"\",\"\",O17)","v":0},null,null,null,null,null,null,null,null,null,7,{"$f":"IF(AF6<7,\"\",VLOOKUP(7,B6:N65,4,FALSE))","v":""},{"$f":"IF(AF6<7,\"\",VLOOKUP(7,B6:N65,10,FALSE))","v":""},null,null,6,{"$f":"IF(AK6<6,\"\",VLOOKUP(6,U6:W64,2,FALSE))","v":""},{"$f":"IF(AK6<6,\"\",VLOOKUP(6,U6:W64,3,FALSE))","v":""}]
[null,{"$f":"IF(F13=\"\",\"\",N13)","v":""},null,null,null,null,null,null,null,null,{"$f":"SUM(F13:J13)","v":0},0,{"$f":"SUM(K13*1000)+L13+0.44","v":0.44},{"$f":"IF(F13=\"\",\"\",RANK(M13,M6:M65,0))","v":""},null,null,null,null,null,null,null,null,null,null,null,null,null,null,null,null,null,null,8,{"$f":"IF(AF6<8,\"\",VLOOKUP(8,B6:N65,4,FALSE))","v":""},{"$f":"IF(AF6<8,\"\",VLOOKUP(8,B6:N65,10,FALSE))","v":""},null,null,7,{"$f":"IF(AK6<7,\"\",VLOOKUP(7,U6:W64,2,FALSE))","v":""},{"$f":"IF(AK6<7,\"\",VLOOKUP(7,U6:W64,3,FALSE))","v":""}]
[null,{"$f":"IF(F14=\"\",\"\",N14)","v":""},null,null,null,null,null,null,null,null,{"$f":"SUM(F14:J14)","v":0},0,{"$f":"SUM(K14*1000)+L14+0.43","v":0.43},{"$f":"IF(F14=\"\",\"\",RANK(M14,M6:M65,0))","v":""},null,null,null,null,null,null,null,null,null,null,null,null,null,null,null,null,null,null,9,{"$f":"IF(AF6<9,\"\",VLOOKUP(9,B6:N65,4,FALSE))","v":""},{"$f":"IF(AF6<9,\"\",VLOOKUP(9,B6:N65,10,FALSE))","v":""},null,null,8,{"$f":"IF(AK6<8,\"\",VLOOKUP(8,U6:W64,2,FALSE))","v":""},{"$f":"IF(AK6<8,\"\",VLOOKUP(8,U6:W64,3,FALSE))","v":""}]
[null,{"$f":"IF(F15=\"\",\"\",N15)","v":""},null,null,null,null,null,null,null,null,{"$f":"SUM(F15:J15)","v":0},0,{"$f":"SUM(K15*1000)+L15+0.42","v":0.42},{"$f":"IF(F15=\"\",\"\",RANK(M15,M6:M65,0))","v":""},null,null,null,null,null,null,null,null,null,null,null,null,null,null,null,null,null,null,10,{"$f":"IF(AF6<10,\"\",VLOOKUP(10,B6:N65,4,FALSE))","v":""},{"$f":"IF(AF6<10,\"\",VLOOKUP(10,B6:N65,10,FALSE))","v":""},null,null,9,{"$f":"IF(AK6<9,\"\",VLOOKUP(9,U6:W64,2,FALSE))","v":""},{"$f":"IF(AK6<9,\"\",VLOOKUP(9,U6:W64,3,FALSE))","v":""}]
[null,{"$f":"IF(F16=\"\",\"\",N16)","v":""},null,null,null,null,null,null,null,null,{"$f":"SUM(F16:J16)","v":0},0,{"$f":"SUM(K16*1000)+L16+0.41","v":0.41},{"$f":"IF(F16=\"\",\"\",RANK(M16,M6:M65,0))","v":""},null,null,null,null,null,null,null,null,null,null,null,null,null,null,null,null,null,null,11,{"$f":"IF(AF6<11,\"\",VLOOKUP(11,B6:N65,4,FALSE))","v":""},{"$f":"IF(AF6<11,\"\",VLOOKUP(11,B6:N65,10,FALSE))","v":""},null,null,10,{"$f":"IF(AK6<10,\"\",VLOOKUP(10,U6:W64,2,FALSE))","v":""},{"$f":"IF(AK6<10,\"\",VLOOKUP(10,U6:W64,3,FALSE))","v":""}]
[null,null,null,null,null,{"$f":"SUM(F12:F16)","v":0},{"$f":"SUM(G12:G16)","v":0},{"$f":"SUM(H12:H16)","v":0},{"$f":"SUM(I12:I16)","v":0},{"$f":"SUM(J12:J16)","v":0},null,null,null,null,{"$f":"SUM(F17:J17)","v":0},{"$f":"MAX(F17:J17)+0.009","v":8.9999999999999993E-3},{"$f":"IF(F12=\"\",\"\",SUM(O17*1000)+P17)","v":""},null,null,null,null,null,null,null,null,null,null,null,{"$f":"SUM(O11,O17)","v":0},null,null,null,12,{"$f":"IF(AF6<12,\"\",VLOOKUP(12,B6:N65,4,FALSE))","v":""},{"$f":"IF(AF6<12,\"\",VLOOKUP(12,B6:N65,10,FALSE))","v":""}]
[null,{"$f":"IF(F18=\"\",\"\",N18)","v":""},3,"KLÍČOV I.",null,null,null,null,null,null,{"$f":"SUM(F18:J18)","v":0},{"$f":"MAX(F18:J18)","v":0},{"$f":"SUM(K18*1000)+L18+0.4","v":0.4},{"$f":"IF(F18=\"\",\"\",RANK(M18,M6:M65,0))","v":""},null,null,null,{"$f":"IF(F18=\"\",\"\",RANK(Q23,Q11:Q65,0))","v":""},null,{"$f":"IF(F18=\"\",\"\",RANK(AA18,AA6:AA64,0))","v":""},{"$f":"IF(R18=\"\",\"\",R18)","v":""},{"$f":"IF(D18=\"\",\"\",D18)","v":"KLÍČOV I."},{"$f":"IF(O23=\"\",\"\",O23)","v":0},{"$f":"IF(V18=\"HOSTIVAŘ I.\",\"GARÁŽ HOSTIVAŘ\",IF(V18=\"VRŠOVICE I.\",\"GARÁŽ VRŠOVICE\",IF(V18=\"KLÍČOV I.\",\"GARÁŽ KLÍČOV\",IF(V18=\"ŘEPY I.\",\"GARÁŽ ŘEPY\",IF(V18=\"KAČEROV I.\",\"GARÁŽ KAČEROV\",\"\")))))","v":"GARÁŽ KLÍČOV"},{"$f":"MAX(F23:J23,F29:J29)+0.04","v":0.04},{"$f":"SUM(O23,O29)*1000","v":0},{"$f":"SUM(Y18:Z18)","v":0.04},{"$f":"IF(AC29=\"\",\"\",AC29)","v":0},null,{"$f":"IF(T18=\"\",\"\",T18)","v":""},null,null,13,{"$f":"IF(AF6<13,\"\",VLOOKUP(13,B6:N65,4,FALSE))","v":""},{"$f":"IF(AF6<13,\"\",VLOOKUP(13,B6:N65,10,FALSE))","v":""},null,{"$f":"COUNT(T6:T64)","v":0},"POŘEDÍ GARÁŽÍ"]
[null,{"$f":"IF(F19=\"\",\"\",N19)","v":""},null,null,null,null,null,null,null,null,{"$f":"SUM(F19:J19)","v":0},{"$f":"MAX(F19:J19)","v":0},{"$f":"SUM(K19*1000)+L19+0.39","v":0.39},{"$f":"IF(F19=\"\",\"\",RANK(M19,M6:M65,0))","v":""},null,null,null,null,null,null,null,null,null,null,null,null,null,null,null,null,null,null,14,{"$f":"IF(AF6<14,\"\",VLOOKUP(14,B6:N65,4,FALSE))","v":""},{"$f":"IF(AF6<14,\"\",VLOOKUP(14,B6:N65,10,FALSE))","v":""},null,null,1,{"$f":"IF(AK18<1,\"\",VLOOKUP(1,T6:AB64,5,FALSE))","v":""},{"$f":"IF(AK18<1,\"\",VLOOKUP(1,T6:AB64,9,FALSE))","v":""}]
[null,{"$f":"IF(F20=\"\",\"\",N20)","v":""},null,null,null,null,null,null,null,null,{"$f":"SUM(F20:J20)","v":0},{"$f":"MAX(F20:J20)","v":0},{"$f":"SUM(K20*1000)+L20+0.38","v":0.38},{"$f":"IF(F20=\"\",\"\",RANK(M20,M6:M65,0))","v":""},null,null,null,null,null,null,null,null,null,null,null,null,null,null,null,null,null,null,15,{"$f":"IF(AF6<15,\"\",VLOOKUP(15,B6:N65,4,FALSE))","v":""},{"$f":"IF(AF6<15,\"\",VLOOKUP(15,B6:N65,10,FALSE))","v":""},null,null,2,{"$f":"IF(AK18<2,\"\",VLOOKUP(2,T6:AB64,5,FALSE))","v":""},{"$f":"IF(AK18<2,\"\",VLOOKUP(2,T6:AB64,9,FALSE))","v":""}]
[null,{"$f":"IF(F21=\"\",\"\",N21)","v":""},null,null,null,null,null,null,null,null,{"$f":"SUM(F21:J21)","v":0},{"$f":"MAX(F21:J21)","v":0},{"$f":"SUM(K21*1000)+L21+0.37","v":0.37},{"$f":"IF(F21=\"\",\"\",RANK(M21,M6:M65,0))","v":""},null,null,null,null,null,null,null,null,null,null,null,null,null,null,null,null,null,null,16,{"$f":"IF(AF6<16,\"\",VLOOKUP(16,B6:N65,4,FALSE))","v":""},{"$f":"IF(AF6<16,\"\",VLOOKUP(16,B6:N65,10,FALSE))","v":""},null,null,3,{"$f":"IF(AK18<3,\"\",VLOOKUP(3,T6:AB64,5,FALSE))","v":""},{"$f":"IF(AK18<3,\"\",VLOOKUP(3,T6:AB64,9,FALSE))","v":""}]
[null,{"$f":"IF(F22=\"\",\"\",N22)","v":""},null,null,null,null,null,null,null,null,{"$f":"SUM(F22:J22)","v":0},{"$f":"MAX(F22:J22)","v":0},{"$f":"SUM(K22*1000)+L22+0.36","v":0.36},{"$f":"IF(F22=\"\",\"\",RANK(M22,M6:M65,0))","v":""},null,null,null,null,null,null,null,null,null,null,null,null,null,null,null,null,null,null,17,{"$f":"IF(AF6<17,\"\",VLOOKUP(17,B6:N65,4,FALSE))","v":""},{"$f":"IF(AF6<17,\"\",VLOOKUP(17,B6:N65,10,FALSE))","v":""},null,null,4,{"$f":"IF(AK18<4,\"\",VLOOKUP(4,T6:AB64,5,FALSE))","v":""},{"$f":"IF(AK18<4,\"\",VLOOKUP(4,T6:AB64,9,FALSE))","v":""}]
[null,null,null,null,null,{"$f":"SUM(F18:F22)","v":0},{"$f":"SUM(G18:G22)","v":0},{"$f":"SUM(H18:H22)","v":0},{"$f":"SUM(I18:I22)","v":0},{"$f":"SUM(J18:J22)","v":0},null,null,null,null,{"$f":"SUM(F23:J23)","v":0},{"$f":"MAX(F23:J23)+0.008","v":8.0000000000000002E-3},{"$f":"IF(F18=\"\",\"\",SUM(O23*1000)+P23)","v":""},null,null,null,null,null,null,null,null,null,null,null,null,null,null,null,18,{"$f":"IF(AF6<18,\"\",VLOOKUP(18,B6:N65,4,FALSE))","v":""},{"$f":"IF(AF6<18,\"\",VLOOKUP(18,B6:N65,10,FALSE))","v":""},null,null,5,{"$f":"IF(AK18<5,\"\",VLOOKUP(5,T6:AB64,5,FALSE))","v":""},{"$f":"IF(AK18<5,\"\",VLOOKUP(5,T6:AB64,9,FALSE))","v":""}]
[null,{"$f":"IF(F24=\"\",\"\",N24)","v":""},4,"KLÍČOV II.",null,null,null,null,null,null,{"$f":"SUM(F24:J24)","v":0},{"$f":"MAX(F24:J24)","v":0},{"$f":"SUM(K24*1000)+L24+0.35","v":0.35},{"$f":"IF(F24=\"\",\"\",RANK(M24,M6:M65,0))","v":""},null,null,null,{"$f":"IF(F24=\"\",\"\",RANK(Q29,Q11:Q65,0))","v":""},null,null,{"$f":"IF(R24=\"\",\"\",R24)","v":""},{"$f":"IF(D24=\"\",\"\",D24)","v":"KLÍČOV II."},{"$f":"IF(O29=\"\",\"\",O29)","v":0},null,null,null,null,null,null,null,null,null,19,{"$f":"IF(AF6<19,\"\",VLOOKUP(19,B6:N65,4,FALSE))","v":""},{"$f":"IF(AF6<19,\"\",VLOOKUP(19,B6:N65,10,FALSE))","v":""}]
[null,{"$f":"IF(F25=\"\",\"\",N25)","v":""},null,null,null,null,null,null,null,null,{"$f":"SUM(F25:J25)","v":0},{"$f":"MAX(F25:J25)","v":0},{"$f":"SUM(K25*1000)+L25+0.34","v":0.34},{"$f":"IF(F25=\"\",\"\",RANK(M25,M6:M65,0))","v":""},null,null,null,null,null,null,null,null,null,null,null,null,null,null,null,null,null,null,20,{"$f":"IF(AF6<20,\"\",VLOOKUP(20,B6:N65,4,FALSE))","v":""},{"$f":"IF(AF6<20,\"\",VLOOKUP(20,B6:N65,10,FALSE))","v":""}]
[null,{"$f":"IF(F26=\"\",\"\",N26)","v":""},null,null,null,null,null,null,null,null,{"$f":"SUM(F26:J26)","v":0},{"$f":"MAX(F26:J26)","v":0},{"$f":"SUM(K26*1000)+L26+0.33","v":0.33},{"$f":"IF(F26=\"\",\"\",RANK(M26,M6:M65,0))","v":""},null,null,null,null,null,null,null,null,null,null,null,null,null,null,null,null,null,null,21,{"$f":"IF(AF6<21,\"\",VLOOKUP(21,B6:N65,4,FALSE))","v":""},{"$f":"IF(AF6<21,\"\",VLOOKUP(21,B6:N65,10,FALSE))","v":""}]
[null,{"$f":"IF(F27=\"\",\"\",N27)","v":""},null,null,null,null,null,null,null,null,{"$f":"SUM(F27:J27)","v":0},{"$f":"MAX(F27:J27)","v":0},{"$f":"SUM(K27*1000)+L27+0.32","v":0.32},{"$f":"IF(F27=\"\",\"\",RANK(M27,M6:M65,0))","v":""},null,null,null,null,null,null,null,null,null,null,null,null,null,null,null,null,null,null,22,{"$f":"IF(AF6<22,\"\",VLOOKUP(22,B6:N65,4,FALSE))","v":""},{"$f":"IF(AF6<22,\"\",VLOOKUP(22,B6:N65,10,FALSE))","v":""}]
[null,{"$f":"IF(F28=\"\",\"\",N28)","v":""},null,null,null,null,null,null,null,null,{"$f":"SUM(F28:J28)","v":0},{"$f":"MAX(F28:J28)","v":0},{"$f":"SUM(K28*1000)+L28+0.31","v":0.31},{"$f":"IF(F28=\"\",\"\",RANK(M28,M6:M65,0))","v":""},null,null,null,null,null,null,null,null,null,null,null,null,null,null,null,null,null,null,23,{"$f":"IF(AF6<23,\"\",VLOOKUP(23,B6:N65,4,FALSE))","v":""},{"$f":"IF(AF6<23,\"\",VLOOKUP(23,B6:N65,10,FALSE))","v":""}]
[null,null,null,null,null,{"$f":"SUM(F24:F28)","v":0},{"$f":"SUM(G24:G28)","v":0},{"$f":"SUM(H24:H28)","v":0},{"$f":"SUM(I24:I28)","v":0},{"$f":"SUM(J24:J28)","v":0},null,null,null,null,{"$f":"SUM(F29:J29)","v":0},{"$f":"MAX(F29:J29)+0.007","v":7.0000000000000001E-3},{"$f":"IF(F24=\"\",\"\",SUM(O29*1000)+P29)","v":""},null,null,null,null,null,null,null,null,null,null,null,{"$f":"SUM(O23,O29)","v":0},null,null,null,24,{"$f":"IF(AF6<24,\"\",VLOOKUP(24,B6:N65,4,FALSE))","v":""},{"$f":"IF(AF6<24,\"\",VLOOKUP(24,B6:N65,10,FALSE))","v":""}]
[null,{"$f":"IF(F30=\"\",\"\",N30)","v":""},5,"ŘEPY I.",null,null,null,null,null,null,{"$f":"SUM(F30:J30)","v":0},{"$f":"MAX(F30:J30)","v":0},{"$f":"SUM(K30*1000)+L30+0.3","v":0.3},{"$f":"IF(F30=\"\",\"\",RANK(M30,M6:M65,0))","v":""},null,null,null,{"$f":"IF(F30=\"\",\"\",RANK(Q35,Q11:Q65,0))","v":""},null,{"$f":"IF(F30=\"\",\"\",RANK(AA30,AA6:AA64,0))","v":""},{"$f":"IF(R30=\"\",\"\",R30)","v":""},{"$f":"IF(D30=\"\",\"\",D30)","v":"ŘEPY I."},{"$f":"IF(O35=\"\",\"\",O35)","v":0},{"$f":"IF(V30=\"HOSTIVAŘ I.\",\"GARÁŽ HOSTIVAŘ\",IF(V30=\"VRŠOVICE I.\",\"GARÁŽ VRŠOVICE\",IF(V30=\"KLÍČOV I.\",\"GARÁŽ KLÍČOV\",IF(V30=\"ŘEPY I.\",\"GARÁŽ ŘEPY\",IF(V30=\"KAČEROV I.\",\"GARÁŽ KAČEROV\",\"\")))))","v":"GARÁŽ ŘEPY"},{"$f":"MAX(F35:J35,F41:J41)+0.03","v":0.03},{"$f":"SUM(O35,O41)*1000","v":0},{"$f":"SUM(Y30:Z30)","v":0.03},{"$f":"IF(AC41=\"\",\"\",AC41)","v":0},null,{"$f":"IF(T30=\"\",\"\",T30)","v":""},null,null,25,{"$f":"IF(AF6<25,\"\",VLOOKUP(25,B6:N65,4,FALSE))","v":""},{"$f":"IF(AF6<25,\"\",VLOOKUP(25,B6:N65,10,FALSE))","v":""}]
[null,{"$f":"IF(F31=\"\",\"\",N31)","v":""},null,null,null,null,null,null,null,null,{"$f":"SUM(F31:J31)","v":0},{"$f":"MAX(F31:J31)","v":0},{"$f":"SUM(K31*1000)+L31+0.29","v":0.28999999999999998},{"$f":"IF(F31=\"\",\"\",RANK(M31,M6:M65,0))","v":""},null,null,null,null,null,null,null,null,null,null,null,null,null,null,null,null,null,null,26,{"$f":"IF(AF6<26,\"\",VLOOKUP(26,B6:N65,4,FALSE))","v":""},{"$f":"IF(AF6<26,\"\",VLOOKUP(26,B6:N65,10,FALSE))","v":""}]
[null,{"$f":"IF(F32=\"\",\"\",N32)","v":""},null,null,null,null,null,null,null,null,{"$f":"SUM(F32:J32)","v":0},{"$f":"MAX(F32:J32)","v":0},{"$f":"SUM(K32*1000)+L32+0.28","v":0.28000000000000003},{"$f":"IF(F32=\"\",\"\",RANK(M32,M6:M65,0))","v":""},null,null,null,null,null,null,null,null,null,null,null,null,null,null,null,null,null,null,27,{"$f":"IF(AF6<27,\"\",VLOOKUP(27,B6:N65,4,FALSE))","v":""},{"$f":"IF(AF6<27,\"\",VLOOKUP(27,B6:N65,10,FALSE))","v":""}]
[null,{"$f":"IF(F33=\"\",\"\",N33)","v":""},null,null,null,null,null,null,null,null,{"$f":"SUM(F33:J33)","v":0},{"$f":"MAX(F33:J33)","v":0},{"$f":"SUM(K33*1000)+L33+0.27","v":0.27},{"$f":"IF(F33=\"\",\"\",RANK(M33,M6:M65,0))","v":""},null,null,null,null,null,null,null,null,null,null,null,null,null,null,null,null,null,null,28,{"$f":"IF(AF6<28,\"\",VLOOKUP(28,B6:N65,4,FALSE))","v":""},{"$f":"IF(AF6<28,\"\",VLOOKUP(28,B6:N65,10,FALSE))","v":""}]
[null,{"$f":"IF(F34=\"\",\"\",N34)","v":""},null,null,null,null,null,null,null,null,{"$f":"SUM(F34:J34)","v":0},{"$f":"MAX(F34:J34)","v":0},{"$f":"SUM(K34*1000)+L34+0.26","v":0.26},{"$f":"IF(F34=\"\",\"\",RANK(M34,M6:M65,0))","v":""},null,null,null,null,null,null,null,null,null,null,null,null,null,null,null,null,null,null,29,{"$f":"IF(AF6<29,\"\",VLOOKUP(29,B6:N65,4,FALSE))","v":""},{"$f":"IF(AF6<29,\"\",VLOOKUP(29,B6:N65,10,FALSE))","v":""}]
[null,null,null,null,null,{"$f":"SUM(F30:F34)","v":0},{"$f":"SUM(G30:G34)","v":0},{"$f":"SUM(H30:H34)","v":0},{"$f":"SUM(I30:I34)","v":0},{"$f":"SUM(J30:J34)","v":0},null,null,null,null,{"$f":"SUM(F35:J35)","v":0},{"$f":"MAX(F35:J35)+0.006","v":6.0000000000000001E-3},{"$f":"IF(F30=\"\",\"\",SUM(O35*1000)+P35)","v":""},null,null,null,null,null,null,null,null,null,null,null,null,null,null,null,30,{"$f":"IF(AF6<30,\"\",VLOOKUP(30,B6:N65,4,FALSE))","v":""},{"$f":"IF(AF6<30,\"\",VLOOKUP(30,B6:N65,10,FALSE))","v":""}]
[null,{"$f":"IF(F36=\"\",\"\",N36)","v":""},6,"ŘEPY II.",null,null,null,null,null,null,{"$f":"SUM(F36:J36)","v":0},{"$f":"MAX(F36:J36)","v":0},{"$f":"SUM(K36*1000)+L36+0.25","v":0.25},{"$f":"IF(F36=\"\",\"\",RANK(M36,M6:M65,0))","v":""},null,null,null,{"$f":"IF(F36=\"\",\"\",RANK(Q41,Q11:Q65,0))","v":""},null,null,{"$f":"IF(R36=\"\",\"\",R36)","v":""},{"$f":"IF(D36=\"\",\"\",D36)","v":"ŘEPY II."},{"$f":"IF(O41=\"\",\"\",O41)","v":0},null,null,null,null,null,null,null,null,null,31,{"$f":"IF(AF6<31,\"\",VLOOKUP(31,B6:N65,4,FALSE))","v":""},{"$f":"IF(AF6<31,\"\",VLOOKUP(31,B6:N65,10,FALSE))","v":""}]
[null,{"$f":"IF(F37=\"\",\"\",N37)","v":""},null,null,null,null,null,null,null,null,{"$f":"SUM(F37:J37)","v":0},{"$f":"MAX(F37:J37)","v":0},{"$f":"SUM(K37*1000)+L37+0.24","v":0.24},{"$f":"IF(F37=\"\",\"\",RANK(M37,M6:M65,0))","v":""},null,null,null,null,null,null,null,null,null,null,null,null,null,null,null,null,null,null,32,{"$f":"IF(AF6<32,\"\",VLOOKUP(32,B6:N65,4,FALSE))","v":""},{"$f":"IF(AF6<32,\"\",VLOOKUP(32,B6:N65,10,FALSE))","v":""}]
[null,{"$f":"IF(F38=\"\",\"\",N38)","v":""},null,null,null,null,null,null,null,null,{"$f":"SUM(F38:J38)","v":0},{"$f":"MAX(F38:J38)","v":0},{"$f":"SUM(K38*1000)+L38+0.23","v":0.23},{"$f":"IF(F38=\"\",\"\",RANK(M38,M6:M65,0))","v":""},null,null,null,null,null,null,null,null,null,null,null,null,null,null,null,null,null,null,33,{"$f":"IF(AF6<33,\"\",VLOOKUP(33,B6:N65,4,FALSE))","v":""},{"$f":"IF(AF6<33,\"\",VLOOKUP(33,B6:N65,10,FALSE))","v":""}]
[null,{"$f":"IF(F39=\"\",\"\",N39)","v":""},null,null,null,null,null,null,null,null,{"$f":"SUM(F39:J39)","v":0},{"$f":"MAX(F39:J39)","v":0},{"$f":"SUM(K39*1000)+L39+0.21","v":0.21},{"$f":"IF(F39=\"\",\"\",RANK(M39,M6:M65,0))","v":""},null,null,null,null,null,null,null,null,null,null,null,null,null,null,null,null,null,null,34,{"$f":"IF(AF6<34,\"\",VLOOKUP(34,B6:N65,4,FALSE))","v":""},{"$f":"IF(AF6<34,\"\",VLOOKUP(34,B6:N65,10,FALSE))","v":""}]
[null,{"$f":"IF(F40=\"\",\"\",N40)","v":""},null,null,null,null,null,null,null,null,{"$f":"SUM(F40:J40)","v":0},{"$f":"MAX(F40:J40)","v":0},{"$f":"SUM(K40*1000)+L40+0.2","v":0.2},{"$f":"IF(F40=\"\",\"\",RANK(M40,M6:M65,0))","v":""},null,null,null,null,null,null,null,null,null,null,null,null,null,null,null,null,null,null,35,{"$f":"IF(AF6<35,\"\",VLOOKUP(35,B6:N65,4,FALSE))","v":""},{"$f":"IF(AF6<35,\"\",VLOOKUP(35,B6:N65,10,FALSE))","v":""}]
[null,null,null,null,null,{"$f":"SUM(F36:F40)","v":0},{"$f":"SUM(G36:G40)","v":0},{"$f":"SUM(H36:H40)","v":0},{"$f":"SUM(I36:I40)","v":0},{"$f":"SUM(J36:J40)","v":0},null,null,null,null,{"$f":"SUM(F41:J41)","v":0},{"$f":"MAX(F41:J41)+0.005","v":5.0000000000000001E-3},{"$f":"IF(F36=\"\",\"\",SUM(O41*1000)+P41)","v":""},null,null,null,null,null,null,null,null,null,null,null,{"$f":"SUM(O35,O41)","v":0},null,null,null,36,{"$f":"IF(AF6<36,\"\",VLOOKUP(36,B6:N65,4,FALSE))","v":""},{"$f":"IF(AF6<36,\"\",VLOOKUP(36,B6:N65,10,FALSE))","v":""}]
[null,{"$f":"IF(F42=\"\",\"\",N42)","v":""},7,"KAČEROV I.",null,null,null,null,null,null,{"$f":"SUM(F42:J42)","v":0},{"$f":"MAX(F42:J42)","v":0},{"$f":"SUM(K42*1000)+L42+0.19","v":0.19},{"$f":"IF(F42=\"\",\"\",RANK(M42,M6:M65,0))","v":""},null,null,null,{"$f":"IF(F42=\"\",\"\",RANK(Q47,Q11:Q65,0))","v":""},null,{"$f":"IF(F42=\"\",\"\",RANK(AA42,AA6:AA64,0))","v":""},{"$f":"IF(R42=\"\",\"\",R42)","v":""},{"$f":"IF(D42=\"\",\"\",D42)","v":"KAČEROV I."},{"$f":"IF(O47=\"\",\"\",O47)","v":0},{"$f":"IF(V42=\"HOSTIVAŘ I.\",\"GARÁŽ HOSTIVAŘ\",IF(V42=\"VRŠOVICE I.\",\"GARÁŽ VRŠOVICE\",IF(V42=\"KLÍČOV I.\",\"GARÁŽ KLÍČOV\",IF(V42=\"ŘEPY I.\",\"GARÁŽ ŘEPY\",IF(V42=\"KAČEROV I.\",\"GARÁŽ KAČEROV\",\"\")))))","v":"GARÁŽ KAČEROV"},{"$f":"MAX(F47:J47,F53:J53)+0.02","v":0.02},{"$f":"SUM(O47,O53)*1000","v":0},{"$f":"SUM(Y42:Z42)","v":0.02},{"$f":"IF(AC53=\"\",\"\",AC53)","v":0},null,{"$f":"IF(T42=\"\",\"\",T42)","v":""},null,null,37,{"$f":"IF(AF6<37,\"\",VLOOKUP(37,B6:N65,4,FALSE))","v":""},{"$f":"IF(AF6<37,\"\",VLOOKUP(37,B6:N65,10,FALSE))","v":""}]
[null,{"$f":"IF(F43=\"\",\"\",N43)","v":""},null,null,null,null,null,null,null,null,{"$f":"SUM(F43:J43)","v":0},{"$f":"MAX(F43:J43)","v":0},{"$f":"SUM(K43*1000)+L43+0.18","v":0.18},{"$f":"IF(F43=\"\",\"\",RANK(M43,M6:M65,0))","v":""},null,null,null,null,null,null,null,null,null,null,null,null,null,null,null,null,null,null,38,{"$f":"IF(AF6<38,\"\",VLOOKUP(38,B6:N65,4,FALSE))","v":""},{"$f":"IF(AF6<38,\"\",VLOOKUP(38,B6:N65,10,FALSE))","v":""}]
[null,{"$f":"IF(F44=\"\",\"\",N44)","v":""},null,null,null,null,null,null,null,null,{"$f":"SUM(F44:J44)","v":0},{"$f":"MAX(F44:J44)","v":0},{"$f":"SUM(K44*1000)+L44+0.17","v":0.17},{"$f":"IF(F44=\"\",\"\",RANK(M44,M6:M65,0))","v":""},null,null,null,null,null,null,null,null,null,null,null,null,null,null,null,null,null,null,39,{"$f":"IF(AF6<39,\"\",VLOOKUP(39,B6:N65,4,FALSE))","v":""},{"$f":"IF(AF6<39,\"\",VLOOKUP(39,B6:N65,10,FALSE))","v":""}]
[null,{"$f":"IF(F45=\"\",\"\",N45)","v":""},null,null,null,null,null,null,null,null,{"$f":"SUM(F45:J45)","v":0},{"$f":"MAX(F45:J45)","v":0},{"$f":"SUM(K45*1000)+L45+0.16","v":0.16},{"$f":"IF(F45=\"\",\"\",RANK(M45,M6:M65,0))","v":""},null,null,null,null,null,null,null,null,null,null,null,null,null,null,null,null,null,null,40,{"$f":"IF(AF6<40,\"\",VLOOKUP(40,B6:N65,4,FALSE))","v":""},{"$f":"IF(AF6<40,\"\",VLOOKUP(40,B6:N65,10,FALSE))","v":""}]
[null,{"$f":"IF(F46=\"\",\"\",N46)","v":""},null,null,null,null,null,null,null,null,{"$f":"SUM(F46:J46)","v":0},{"$f":"MAX(F46:J46)","v":0},{"$f":"SUM(K46*1000)+L46+0.15","v":0.15},{"$f":"IF(F46=\"\",\"\",RANK(M46,M6:M65,0))","v":""},null,null,null,null,null,null,null,null,null,null,null,null,null,null,null,null,null,null,41,{"$f":"IF(AF6<41,\"\",VLOOKUP(41,B6:N65,4,FALSE))","v":""},{"$f":"IF(AF6<41,\"\",VLOOKUP(41,B6:N65,10,FALSE))","v":""}]
[null,null,null,null,null,{"$f":"SUM(F42:F46)","v":0},{"$f":"SUM(G42:G46)","v":0},{"$f":"SUM(H42:H46)","v":0},{"$f":"SUM(I42:I46)","v":0},{"$f":"SUM(J42:J46)","v":0},null,null,null,null,{"$f":"SUM(F47:J47)","v":0},{"$f":"MAX(F47:J47)+0.004","v":4.0000000000000001E-3},{"$f":"IF(F42=\"\",\"\",SUM(O47*1000)+P47)","v":""},null,null,null,null,null,null,null,null,null,null,null,null,null,null,null,42,{"$f":"IF(AF6<42,\"\",VLOOKUP(42,B6:N65,4,FALSE))","v":""},{"$f":"IF(AF6<42,\"\",VLOOKUP(42,B6:N65,10,FALSE))","v":""}]
[null,{"$f":"IF(F48=\"\",\"\",N48)","v":""},8,"KAČEROV II.",null,null,null,null,null,null,{"$f":"SUM(F48:J48)","v":0},{"$f":"MAX(F48:J48)","v":0},{"$f":"SUM(K48*1000)+L48+0.14","v":0.14000000000000001},{"$f":"IF(F48=\"\",\"\",RANK(M48,M6:M65,0))","v":""},null,null,null,{"$f":"IF(F48=\"\",\"\",RANK(Q53,Q11:Q65,0))","v":""},null,null,{"$f":"IF(R48=\"\",\"\",R48)","v":""},{"$f":"IF(D48=\"\",\"\",D48)","v":"KAČEROV II."},{"$f":"IF(O53=\"\",\"\",O53)","v":0},null,null,null,null,null,null,null,null,null,43,{"$f":"IF(AF6<43,\"\",VLOOKUP(43,B6:N65,4,FALSE))","v":""},{"$f":"IF(AF6<43,\"\",VLOOKUP(43,B6:N65,10,FALSE))","v":""}]
[null,{"$f":"IF(F49=\"\",\"\",N49)","v":""},null,null,null,null,null,null,null,null,{"$f":"SUM(F49:J49)","v":0},{"$f":"MAX(F49:J49)","v":0},{"$f":"SUM(K49*1000)+L49+0.13","v":0.13},{"$f":"IF(F49=\"\",\"\",RANK(M49,M6:M65,0))","v":""},null,null,null,null,null,null,null,null,null,null,null,null,null,null,null,null,null,null,44,{"$f":"IF(AF6<44,\"\",VLOOKUP(44,B6:N65,4,FALSE))","v":""},{"$f":"IF(AF6<44,\"\",VLOOKUP(44,B6:N65,10,FALSE))","v":""}]
[null,{"$f":"IF(F50=\"\",\"\",N50)","v":""},null,null,null,null,null,null,null,null,{"$f":"SUM(F50:J50)","v":0},{"$f":"MAX(F50:J50)","v":0},{"$f":"SUM(K50*1000)+L50+0.12","v":0.12},{"$f":"IF(F50=\"\",\"\",RANK(M50,M6:M65,0))","v":""},null,null,null,null,null,null,null,null,null,null,null,null,null,null,null,null,null,null,45,{"$f":"IF(AF6<45,\"\",VLOOKUP(45,B6:N65,4,FALSE))","v":""},{"$f":"IF(AF6<45,\"\",VLOOKUP(45,B6:N65,10,FALSE))","v":""}]
[null,{"$f":"IF(F51=\"\",\"\",N51)","v":""},null,null,null,null,null,null,null,null,{"$f":"SUM(F51:J51)","v":0},{"$f":"MAX(F51:J51)","v":0},{"$f":"SUM(K51*1000)+L51+0.11","v":0.11},{"$f":"IF(F51=\"\",\"\",RANK(M51,M6:M65,0))","v":""},null,null,null,null,null,null,null,null,null,null,null,null,null,null,null,null,null,null,46,{"$f":"IF(AF6<46,\"\",VLOOKUP(46,B6:N65,4,FALSE))","v":""},{"$f":"IF(AF6<46,\"\",VLOOKUP(46,B6:N65,10,FALSE))","v":""}]
[null,{"$f":"IF(F52=\"\",\"\",N52)","v":""},null,null,null,null,null,null,null,null,{"$f":"SUM(F52:J52)","v":0},{"$f":"MAX(F52:J52)","v":0},{"$f":"SUM(K52*1000)+L52+0.1","v":0.1},{"$f":"IF(F52=\"\",\"\",RANK(M52,M6:M65,0))","v":""},null,null,null,null,null,null,null,null,null,null,null,null,null,null,null,null,null,null,47,{"$f":"IF(AF6<47,\"\",VLOOKUP(47,B6:N65,4,FALSE))","v":""},{"$f":"IF(AF6<47,\"\",VLOOKUP(47,B6:N65,10,FALSE))","v":""}]
[null,null,null,null,null,{"$f":"SUM(F48:F52)","v":0},{"$f":"SUM(G48:G52)","v":0},{"$f":"SUM(H48:H52)","v":0},{"$f":"SUM(I48:I52)","v":0},{"$f":"SUM(J48:J52)","v":0},null,null,null,null,{"$f":"SUM(F53:J53)","v":0},{"$f":"MAX(F53:J53)+0.003","v":3.0000000000000001E-3},{"$f":"IF(F48=\"\",\"\",SUM(O53*1000)+P53)","v":""},null,null,null,null,null,null,null,null,null,null,null,{"$f":"SUM(O47,O53)","v":0},null,null,null,48,{"$f":"IF(AF6<48,\"\",VLOOKUP(48,B6:N65,4,FALSE))","v":""},{"$f":"IF(AF6<48,\"\",VLOOKUP(48,B6:N65,10,FALSE))","v":""}]
[null,{"$f":"IF(F54=\"\",\"\",N54)","v":""},9,"HOSTIVAŘ I.",null,null,null,null,null,null,{"$f":"SUM(F54:J54)","v":0},{"$f":"MAX(F54:J54)","v":0},{"$f":"SUM(K54*1000)+L54+0.09","v":0.09},{"$f":"IF(F54=\"\",\"\",RANK(M54,M6:M65,0))","v":""},null,null,null,{"$f":"IF(F54=\"\",\"\",RANK(Q59,Q11:Q65,0))","v":""},null,{"$f":"IF(F54=\"\",\"\",RANK(AA54,AA6:AA64,0))","v":""},{"$f":"IF(R54=\"\",\"\",R54)","v":""},{"$f":"IF(D54=\"\",\"\",D54)","v":"HOSTIVAŘ I."},{"$f":"IF(O59=\"\",\"\",O59)","v":0},{"$f":"IF(V54=\"HOSTIVAŘ I.\",\"GARÁŽ HOSTIVAŘ\",IF(V54=\"VRŠOVICE I.\",\"GARÁŽ VRŠOVICE\",IF(V54=\"KLÍČOV I.\",\"GARÁŽ KLÍČOV\",IF(V54=\"ŘEPY I.\",\"GARÁŽ ŘEPY\",IF(V54=\"KAČEROV I.\",\"GARÁŽ KAČEROV\",\"\")))))","v":"GARÁŽ HOSTIVAŘ"},{"$f":"MAX(F59:J59,F65:J65)+0.01","v":0.01},{"$f":"SUM(O59,O65)*1000","v":0},{"$f":"SUM(Y54:Z54)","v":0.01},{"$f":"IF(AC65=\"\",\"\",AC65)","v":0},null,{"$f":"IF(T54=\"\",\"\",T54)","v":""},null,null,49,{"$f":"IF(AF6<49,\"\",VLOOKUP(49,B6:N65,4,FALSE))","v":""},{"$f":"IF(AF6<49,\"\",VLOOKUP(49,B6:N65,10,FALSE))","v":""}]
[null,{"$f":"IF(F55=\"\",\"\",N55)","v":""},null,null,null,null,null,null,null,null,{"$f":"SUM(F55:J55)","v":0},{"$f":"MAX(F55:J55)","v":0},{"$f":"SUM(K55*1000)+L55+0.08","v":0.08},{"$f":"IF(F55=\"\",\"\",RANK(M55,M6:M65,0))","v":""},null,null,null,null,null,null,null,null,null,null,null,null,null,null,null,null,null,null,50,{"$f":"IF(AF6<50,\"\",VLOOKUP(50,B6:N65,4,FALSE))","v":""},{"$f":"IF(AF6<50,\"\",VLOOKUP(50,B6:N65,10,FALSE))","v":""}]
[null,{"$f":"IF(F56=\"\",\"\",N56)","v":""},null,null,null,null,null,null,null,null,{"$f":"SUM(F56:J56)","v":0},{"$f":"MAX(F56:J56)","v":0},{"$f":"SUM(K56*1000)+L56+0.07","v":7.0000000000000007E-2},{"$f":"IF(F56=\"\",\"\",RANK(M56,M6:M65,0))","v":""}]
[null,{"$f":"IF(F57=\"\",\"\",N57)","v":""},null,null,null,null,null,null,null,null,{"$f":"SUM(F57:J57)","v":0},{"$f":"MAX(F57:J57)","v":0},{"$f":"SUM(K57*1000)+L57+0.06","v":0.06},{"$f":"IF(F57=\"\",\"\",RANK(M57,M6:M65,0))","v":""}]
[null,{"$f":"IF(F58=\"\",\"\",N58)","v":""},null,null,null,null,null,null,null,null,{"$f":"SUM(F58:J58)","v":0},{"$f":"MAX(F58:J58)","v":0},{"$f":"SUM(K58*1000)+L58+0.05","v":0.05},{"$f":"IF(F58=\"\",\"\",RANK(M58,M6:M65,0))","v":""}]
[null,null,null,null,null,{"$f":"SUM(F54:F58)","v":0},{"$f":"SUM(G54:G58)","v":0},{"$f":"SUM(H54:H58)","v":0},{"$f":"SUM(I54:I58)","v":0},{"$f":"SUM(J54:J58)","v":0},null,null,null,null,{"$f":"SUM(F59:J59)","v":0},{"$f":"MAX(F59:J59)+0.002","v":2E-3},{"$f":"IF(F54=\"\",\"\",SUM(O59*1000)+P59)","v":""}]
[null,{"$f":"IF(F60=\"\",\"\",N60)","v":""},10,"HOSTIVAŘ II.",null,null,null,null,null,null,{"$f":"SUM(F60:J60)","v":0},{"$f":"MAX(F60:J60)","v":0},{"$f":"SUM(K60*1000)+L60+0.04","v":0.04},{"$f":"IF(F60=\"\",\"\",RANK(M60,M6:M65,0))","v":""},null,null,null,{"$f":"IF(F60=\"\",\"\",RANK(Q65,Q11:Q65,0))","v":""},null,null,{"$f":"IF(R60=\"\",\"\",R60)","v":""},{"$f":"IF(D60=\"\",\"\",D60)","v":"HOSTIVAŘ II."},{"$f":"IF(O65=\"\",\"\",O65)","v":0}]
[null,{"$f":"IF(F61=\"\",\"\",N61)","v":""},null,null,null,null,null,null,null,null,{"$f":"SUM(F61:J61)","v":0},{"$f":"MAX(F61:J61)","v":0},{"$f":"SUM(K61*1000)+L61+0.03","v":0.03},{"$f":"IF(F61=\"\",\"\",RANK(M61,M6:M65,0))","v":""}]
[null,{"$f":"IF(F62=\"\",\"\",N62)","v":""},null,null,null,null,null,null,null,null,{"$f":"SUM(F62:J62)","v":0},{"$f":"MAX(F62:J62)","v":0},{"$f":"SUM(K62*1000)+L62+0.02","v":0.02},{"$f":"IF(F62=\"\",\"\",RANK(M62,M6:M65,0))","v":""}]
[null,{"$f":"IF(F63=\"\",\"\",N63)","v":""},null,null,null,null,null,null,null,null,{"$f":"SUM(F63:J63)","v":0},{"$f":"MAX(F63:J63)","v":0},{"$f":"SUM(K63*1000)+L63+0.01","v":0.01},{"$f":"IF(F63=\"\",\"\",RANK(M63,M6:M65,0))","v":""}]
[null,{"$f":"IF(F64=\"\",\"\",N64)","v":""},null,null,null,null,null,null,null,null,{"$f":"SUM(F64:J64)","v":0},{"$f":"MAX(F64:J64)","v":0},{"$f":"SUM(K64*1000)+L64","v":0},{"$f":"IF(F64=\"\",\"\",RANK(M64,M6:M65,0))","v":""}]
[null,null,null,null,null,{"$f":"SUM(F60:F64)","v":0},{"$f":"SUM(G60:G64)","v":0},{"$f":"SUM(H60:H64)","v":0},{"$f":"SUM(I60:I64)","v":0},{"$f":"SUM(J60:J64)","v":0},null,{"$f":"MAX(L12:L64,L6:L10)","v":0},null,null,{"$f":"SUM(F65:J65)","v":0},{"$f":"MAX(F65:J65)+0.001","v":1E-3},{"$f":"IF(F60=\"\",\"\",SUM(O65*1000)+P65)","v":""},null,null,null,null,null,null,null,null,null,null,null,{"$f":"SUM(O59,O65)","v":0}]

{"sheet":"KAČEROV","index":8,"n_rows":65,"n_cols":53,"rows_kept":65,"cut":false,"hidden":false,"merged":[[64,28,64,29],[52,28,52,29],[53,2,57,2],[53,3,57,3],[53,17,57,17],[53,29,63,29],[59,2,63,2],[59,3,63,3],[59,17,63,17],[35,3,39,3],[35,17,39,17],[40,28,40,29],[41,2,45,2],[41,3,45,3],[41,17,45,17],[41,29,51,29],[47,2,51,2],[47,3,51,3],[47,17,51,17],[17,37,17,39],[23,2,27,2],[23,3,27,3],[23,17,27,17],[28,28,28,29],[29,2,33,2],[29,3,33,3],[29,17,33,17],[29,29,39,29],[35,2,39,2],[11,2,15,2],[11,3,15,3],[11,17,15,17],[16,28,16,29],[17,2,21,2],[17,3,21,3],[17,17,21,17],[17,29,27,29],[2,3,2,39],[0,0,3,0],[4,2,4,3],[4,13,4,14],[4,32,4,34],[5,2,9,2],[5,3,9,3],[5,17,9,17],[5,29,15,29],[5,37,5,39]]}
["ZPĚT"]
[]
[null,null,null,"Sportovní turnaj v Bowlingu o pohár ZV-OS Kačerov dne _._. 2015"]
[]
[null,null,"Garáž",null,"Jméno","I.","II.","III.","IV.","V.","Body",null,null,"Jednotlivci.",null,null,null,"Družstva.",null,null,null,null,null,null,null,null,null,null,null,null,null,null,"pořadí jednotlivců"]
[null,{"$f":"IF(F6=\"\",\"\",N6)","v":""},1,"HOSTIVAŘ I.",null,null,null,null,null,null,{"$f":"SUM(F6:J6)","v":0},{"$f":"MAX(F6:J6)","v":0},{"$f":"SUM(K6*1000)+L6+0.5","v":0.5},{"$f":"IF(F6=\"\",\"\",RANK(M6,M6:M65,0))","v":""},null,null,null,{"$f":"IF(F6=\"\",\"\",RANK(Q11,Q11:Q65,0))","v":""},null,{"$f":"IF(F6=\"\",\"\",RANK(AA6,AA6:AA64,0))","v":""},{"$f":"IF(R6=\"\",\"\",R6)","v":""},{"$f":"IF(D6=\"\",\"\",D6)","v":"HOSTIVAŘ I."},{"$f":"IF(O11=\"\",\"\",O11)","v":0},{"$f":"IF(V6=\"HOSTIVAŘ I.\",\"GARÁŽ HOSTIVAŘ\",IF(V6=\"VRŠOVICE I.\",\"GARÁŽ VRŠOVICE\",IF(V6=\"KLÍČOV I.\",\"GARÁŽ KLÍČOV\",IF(V6=\"ŘEPY I.\",\"GARÁŽ ŘEPY\",IF(V6=\"KAČEROV I.\",\"GARÁŽ KAČEROV\",\"\")))))","v":"GARÁŽ HOSTIVAŘ"},{"$f":"MAX(F11:J11,F17:J17)+0.05","v":0.05},{"$f":"SUM(O11,O17)*1000","v":0},{"$f":"SUM(Y6:Z6)","v":0.05},{"$f":"IF(AC17=\"\",\"\",AC17)","v":0},null,{"$f":"IF(T6=\"\",\"\",T6)","v":""},null,{"$f":"COUNT(F6:F10,F12:F16,F18:F22,F24:F28,F30:F34,F36:F40,F42:F46,F48:F52,F54:F58,F60:F64)","v":0},1,{"$f":"IF(AF6<1,\"\",VLOOKUP(1,B6:N65,4,FALSE))","v":""},{"$f":"IF(AF6<1,\"\",VLOOKUP(1,B6:N65,10,FALSE))","v":""},null,{"$f":"COUNT(U6:U16,U18:U28,U30:U40,U42:U52,U54:U64)","v":0},"POŘADÍ DRUŽSTEV",null,null,null,null,null,null,null,null,null,null,null,null,null,null,"HOSTIVAŘ I."]
[null,{"$f":"IF(F7=\"\",\"\",N7)","v":""},null,null,null,null,null,null,null,null,{"$f":"SUM(F7:J7)","v":0},0,{"$f":"SUM(K7*1000)+L7+0.49","v":0.49},{"$f":"IF(F7=\"\",\"\",RANK(M7,M6:M65,0))","v":""},null,null,null,null,null,null,null,null,null,null,null,null,null,null,null,null,null,null,{"$f":"SUM(AG6+1)","v":2},{"$f":"IF(AF6<2,\"\",VLOOKUP(2,B6:N65,4,FALSE))","v":""},{"$f":"IF(AF6<2,\"\",VLOOKUP(2,B6:N65,10,FALSE))","v":""},null,null,1,{"$f":"IF(AK6<1,\"\",VLOOKUP(1,U6:W64,2,FALSE))","v":""},{"$f":"IF(AK6<1,\"\",VLOOKUP(1,U6:W64,3,FALSE))","v":""},null,null,null,null,null,null,null,null,null,null,null,null,"VRŠOVICE I."]
[null,{"$f":"IF(F8=\"\",\"\",N8)","v":""},null,null,null,null,null,null,null,null,{"$f":"SUM(F8:J8)","v":0},0,{"$f":"SUM(K8*1000)+L8+0.48","v":0.48},{"$f":"IF(F8=\"\",\"\",RANK(M8,M6:M65,0))","v":""},null,null,null,null,null,null,null,null,null,null,null,null,null,null,null,null,null,null,{"$f":"SUM(AG7+1)","v":3},{"$f":"IF(AF6<3,\"\",VLOOKUP(3,B6:N65,4,FALSE))","v":""},{"$f":"IF(AF6<3,\"\",VLOOKUP(3,B6:N65,10,FALSE))","v":""},null,null,2,{"$f":"IF(AK6<2,\"\",VLOOKUP(2,U6:W64,2,FALSE))","v":""},{"$f":"IF(AK6<2,\"\",VLOOKUP(2,U6:W64,3,FALSE))","v":""},null,null,null,null,null,null,null,null,null,null,null,null,"KLÍČOV I."]
[null,{"$f":"IF(F9=\"\",\"\",N9)","v":""},null,null,null,null,null,null,null,null,{"$f":"SUM(F9:J9)","v":0},0,{"$f":"SUM(K9*1000)+L9+0.47","v":0.47},{"$f":"IF(F9=\"\",\"\",RANK(M9,M6:M65,0))","v":""},null,null,null,null,null,null,null,null,null,null,null,null,null,null,null,null,null,null,4,{"$f":"IF(AF6<4,\"\",VLOOKUP(4,B6:N65,4,FALSE))","v":""},{"$f":"IF(AF6<4,\"\",VLOOKUP(4,B6:N65,10,FALSE))","v":""},null,null,3,{"$f":"IF(AK6<3,\"\",VLOOKUP(3,U6:W64,2,FALSE))","v":""},{"$f":"IF(AK6<3,\"\",VLOOKUP(3,U6:W64,3,FALSE))","v":""},null,null,null,null,null,null,null,null,null,null,null,null,"ŘEPY I."]
[null,{"$f":"IF(F10=\"\",\"\",N10)","v":""},null,null,null,null,null,null,null,null,{"$f":"SUM(F10:J10)","v":0},0,{"$f":"SUM(K10*1000)+L10+0.46","v":0.46},{"$f":"IF(F10=\"\",\"\",RANK(M10,M6:M65,0))","v":""},null,null,null,null,null,null,null,null,null,null,null,null,null,null,null,null,null,null,5,{"$f":"IF(AF6<5,\"\",VLOOKUP(5,B6:N65,4,FALSE))","v":""},{"$f":"IF(AF6<5,\"\",VLOOKUP(5,B6:N65,10,FALSE))","v":""},null,null,4,{"$f":"IF(AK6<4,\"\",VLOOKUP(4,U6:W64,2,FALSE))","v":""},{"$f":"IF(AK6<4,\"\",VLOOKUP(4,U6:W64,3,FALSE))","v":""},null,null,null,null,null,null,null,null,null,null,null,null,"KAČEROV I."]
[null,null,null,null,null,{"$f":"SUM(F6:F10)","v":0},{"$f":"SUM(G6:G10)","v":0},{"$f":"SUM(H6:H10)","v":0},{"$f":"SUM(I6:I10)","v":0},{"$f":"SUM(J6:J10)","v":0},null,0,null,null,{"$f":"SUM(F11:J11)","v":0},{"$f":"MAX(F11:J11)+0.01","v":0.01},{"$f":"IF(F6=\"\",\"\",SUM(O11*1000)+P11)","v":""},null,null,null,null,null,null,null,null,null,null,null,null,null,null,null,6,{"$f":"IF(AF6<6,\"\",VLOOKUP(6,B6:N65,4,FALSE))","v":""},{"$f":"IF(AF6<6,\"\",VLOOKUP(6,B6:N65,10,FALSE))","v":""},null,null,5,{"$f":"IF(AK6<5,\"\",VLOOKUP(5,U6:W64,2,FALSE))","v":""},{"$f":"IF(AK6<5,\"\",VLOOKUP(5,U6:W64,3,FALSE))","v":""}]
[null,{"$f":"IF(F12=\"\",\"\",N12)","v":""},2,"HOSTIVAŘ II.",null,null,null,null,null,null,{"$f":"SUM(F12:J12)","v":0},0,{"$f":"SUM(K12*1000)+L12+0.45","v":0.45},{"$f":"IF(F12=\"\",\"\",RANK(M12,M6:M65,0))","v":""},null,null,null,{"$f":"IF(F12=\"\",\"\",RANK(Q17,Q11:Q65,0))","v":""},null,null,{"$f":"IF(R12=\"\",\"\",R12)","v":""},{"$f":"IF(D12=\"\",\"\",D12)","v":"HOSTIVAŘ II."},{"$f":"IF(O17=\"\",\"\",O17)","v":0},null,null,null,null,null,null,null,null,null,7,{"$f":"IF(AF6<7,\"\",VLOOKUP(7,B6:N65,4,FALSE))","v":""},{"$f":"IF(AF6<7,\"\",VLOOKUP(7,B6:N65,10,FALSE))","v":""},null,null,6,{"$f":"IF(AK6<6,\"\",VLOOKUP(6,U6:W64,2,FALSE))","v":""},{"$f":"IF(AK6<6,\"\",VLOOKUP(6,U6:W64,3,FALSE))","v":""}]
[null,{"$f":"IF(F13=\"\",\"\",N13)","v":""},null,null,null,null,null,null,null,null,{"$f":"SUM(F13:J13)","v":0},0,{"$f":"SUM(K13*1000)+L13+0.44","v":0.44},{"$f":"IF(F13=\"\",\"\",RANK(M13,M6:M65,0))","v":""},null,null,null,null,null,null,null,null,null,null,null,null,null,null,null,null,null,null,8,{"$f":"IF(AF6<8,\"\",VLOOKUP(8,B6:N65,4,FALSE))","v":""},{"$f":"IF(AF6<8,\"\",VLOOKUP(8,B6:N65,10,FALSE))","v":""},null,null,7,{"$f":"IF(AK6<7,\"\",VLOOKUP(7,U6:W64,2,FALSE))","v":""},{"$f":"IF(AK6<7,\"\",VLOOKUP(7,U6:W64,3,FALSE))","v":""}]
[null,{"$f":"IF(F14=\"\",\"\",N14)","v":""},null,null,null,null,null,null,null,null,{"$f":"SUM(F14:J14)","v":0},0,{"$f":"SUM(K14*1000)+L14+0.43","v":0.43},{"$f":"IF(F14=\"\",\"\",RANK(M14,M6:M65,0))","v":""},null,null,null,null,null,null,null,null,null,null,null,null,null,null,null,null,null,null,9,{"$f":"IF(AF6<9,\"\",VLOOKUP(9,B6:N65,4,FALSE))","v":""},{"$f":"IF(AF6<9,\"\",VLOOKUP(9,B6:N65,10,FALSE))","v":""},null,null,8,{"$f":"IF(AK6<8,\"\",VLOOKUP(8,U6:W64,2,FALSE))","v":""},{"$f":"IF(AK6<8,\"\",VLOOKUP(8,U6:W64,3,FALSE))","v":""}]
[null,{"$f":"IF(F15=\"\",\"\",N15)","v":""},null,null,null,null,null,null,null,null,{"$f":"SUM(F15:J15)","v":0},0,{"$f":"SUM(K15*1000)+L15+0.42","v":0.42},{"$f":"IF(F15=\"\",\"\",RANK(M15,M6:M65,0))","v":""},null,null,null,null,null,null,null,null,null,null,null,null,null,null,null,null,null,null,10,{"$f":"IF(AF6<10,\"\",VLOOKUP(10,B6:N65,4,FALSE))","v":""},{"$f":"IF(AF6<10,\"\",VLOOKUP(10,B6:N65,10,FALSE))","v":""},null,null,9,{"$f":"IF(AK6<9,\"\",VLOOKUP(9,U6:W64,2,FALSE))","v":""},{"$f":"IF(AK6<9,\"\",VLOOKUP(9,U6:W64,3,FALSE))","v":""}]
[null,{"$f":"IF(F16=\"\",\"\",N16)","v":""},null,null,null,null,null,null,null,null,{"$f":"SUM(F16:J16)","v":0},0,{"$f":"SUM(K16*1000)+L16+0.41","v":0.41},{"$f":"IF(F16=\"\",\"\",RANK(M16,M6:M65,0))","v":""},null,null,null,null,null,null,null,null,null,null,null,null,null,null,null,null,null,null,11,{"$f":"IF(AF6<11,\"\",VLOOKUP(11,B6:N65,4,FALSE))","v":""},{"$f":"IF(AF6<11,\"\",VLOOKUP(11,B6:N65,10,FALSE))","v":""},null,null,10,{"$f":"IF(AK6<10,\"\",VLOOKUP(10,U6:W64,2,FALSE))","v":""},{"$f":"IF(AK6<10,\"\",VLOOKUP(10,U6:W64,3,FALSE))","v":""}]
[null,null,null,null,null,{"$f":"SUM(F12:F16)","v":0},{"$f":"SUM(G12:G16)","v":0},{"$f":"SUM(H12:H16)","v":0},{"$f":"SUM(I12:I16)","v":0},{"$f":"SUM(J12:J16)","v":0},null,null,null,null,{"$f":"SUM(F17:J17)","v":0},{"$f":"MAX(F17:J17)+0.009","v":8.9999999999999993E-3},{"$f":"IF(F12=\"\",\"\",SUM(O17*1000)+P17)","v":""},null,null,null,null,null,null,null,null,null,null,null,{"$f":"SUM(O11,O17)","v":0},null,null,null,12,{"$f":"IF(AF6<12,\"\",VLOOKUP(12,B6:N65,4,FALSE))","v":""},{"$f":"IF(AF6<12,\"\",VLOOKUP(12,B6:N65,10,FALSE))","v":""}]
[null,{"$f":"IF(F18=\"\",\"\",N18)","v":""},3,"VRŠOVICE I.",null,null,null,null,null,null,{"$f":"SUM(F18:J18)","v":0},{"$f":"MAX(F18:J18)","v":0},{"$f":"SUM(K18*1000)+L18+0.4","v":0.4},{"$f":"IF(F18=\"\",\"\",RANK(M18,M6:M65,0))","v":""},null,null,null,{"$f":"IF(F18=\"\",\"\",RANK(Q23,Q11:Q65,0))","v":""},null,{"$f":"IF(F18=\"\",\"\",RANK(AA18,AA6:AA64,0))","v":""},{"$f":"IF(R18=\"\",\"\",R18)","v":""},{"$f":"IF(D18=\"\",\"\",D18)","v":"VRŠOVICE I."},{"$f":"IF(O23=\"\",\"\",O23)","v":0},{"$f":"IF(V18=\"HOSTIVAŘ I.\",\"GARÁŽ HOSTIVAŘ\",IF(V18=\"VRŠOVICE I.\",\"GARÁŽ VRŠOVICE\",IF(V18=\"KLÍČOV I.\",\"GARÁŽ KLÍČOV\",IF(V18=\"ŘEPY I.\",\"GARÁŽ ŘEPY\",IF(V18=\"KAČEROV I.\",\"GARÁŽ KAČEROV\",\"\")))))","v":"GARÁŽ VRŠOVICE"},{"$f":"MAX(F23:J23,F29:J29)+0.04","v":0.04},{"$f":"SUM(O23,O29)*1000","v":0},{"$f":"SUM(Y18:Z18)","v":0.04},{"$f":"IF(AC29=\"\",\"\",AC29)","v":0},null,{"$f":"IF(T18=\"\",\"\",T18)","v":""},null,null,13,{"$f":"IF(AF6<13,\"\",VLOOKUP(13,B6:N65,4,FALSE))","v":""},{"$f":"IF(AF6<13,\"\",VLOOKUP(13,B6:N65,10,FALSE))","v":""},null,{"$f":"COUNT(T6:T64)","v":0},"POŘEDÍ GARÁŽÍ"]
[null,{"$f":"IF(F19=\"\",\"\",N19)","v":""},null,null,null,null,null,null,null,null,{"$f":"SUM(F19:J19)","v":0},{"$f":"MAX(F19:J19)","v":0},{"$f":"SUM(K19*1000)+L19+0.39","v":0.39},{"$f":"IF(F19=\"\",\"\",RANK(M19,M6:M65,0))","v":""},null,null,null,null,null,null,null,null,null,null,null,null,null,null,null,null,null,null,14,{"$f":"IF(AF6<14,\"\",VLOOKUP(14,B6:N65,4,FALSE))","v":""},{"$f":"IF(AF6<14,\"\",VLOOKUP(14,B6:N65,10,FALSE))","v":""},null,null,1,{"$f":"IF(AK18<1,\"\",VLOOKUP(1,T6:AB64,5,FALSE))","v":""},{"$f":"IF(AK18<1,\"\",VLOOKUP(1,T6:AB64,9,FALSE))","v":""}]
[null,{"$f":"IF(F20=\"\",\"\",N20)","v":""},null,null,null,null,null,null,null,null,{"$f":"SUM(F20:J20)","v":0},{"$f":"MAX(F20:J20)","v":0},{"$f":"SUM(K20*1000)+L20+0.38","v":0.38},{"$f":"IF(F20=\"\",\"\",RANK(M20,M6:M65,0))","v":""},null,null,null,null,null,null,null,null,null,null,null,null,null,null,null,null,null,null,15,{"$f":"IF(AF6<15,\"\",VLOOKUP(15,B6:N65,4,FALSE))","v":""},{"$f":"IF(AF6<15,\"\",VLOOKUP(15,B6:N65,10,FALSE))","v":""},null,null,2,{"$f":"IF(AK18<2,\"\",VLOOKUP(2,T6:AB64,5,FALSE))","v":""},{"$f":"IF(AK18<2,\"\",VLOOKUP(2,T6:AB64,9,FALSE))","v":""}]
[null,{"$f":"IF(F21=\"\",\"\",N21)","v":""},null,null,null,null,null,null,null,null,{"$f":"SUM(F21:J21)","v":0},{"$f":"MAX(F21:J21)","v":0},{"$f":"SUM(K21*1000)+L21+0.37","v":0.37},{"$f":"IF(F21=\"\",\"\",RANK(M21,M6:M65,0))","v":""},null,null,null,null,null,null,null,null,null,null,null,null,null,null,null,null,null,null,16,{"$f":"IF(AF6<16,\"\",VLOOKUP(16,B6:N65,4,FALSE))","v":""},{"$f":"IF(AF6<16,\"\",VLOOKUP(16,B6:N65,10,FALSE))","v":""},null,null,3,{"$f":"IF(AK18<3,\"\",VLOOKUP(3,T6:AB64,5,FALSE))","v":""},{"$f":"IF(AK18<3,\"\",VLOOKUP(3,T6:AB64,9,FALSE))","v":""}]
[null,{"$f":"IF(F22=\"\",\"\",N22)","v":""},null,null,null,null,null,null,null,null,{"$f":"SUM(F22:J22)","v":0},{"$f":"MAX(F22:J22)","v":0},{"$f":"SUM(K22*1000)+L22+0.36","v":0.36},{"$f":"IF(F22=\"\",\"\",RANK(M22,M6:M65,0))","v":""},null,null,null,null,null,null,null,null,null,null,null,null,null,null,null,null,null,null,17,{"$f":"IF(AF6<17,\"\",VLOOKUP(17,B6:N65,4,FALSE))","v":""},{"$f":"IF(AF6<17,\"\",VLOOKUP(17,B6:N65,10,FALSE))","v":""},null,null,4,{"$f":"IF(AK18<4,\"\",VLOOKUP(4,T6:AB64,5,FALSE))","v":""},{"$f":"IF(AK18<4,\"\",VLOOKUP(4,T6:AB64,9,FALSE))","v":""}]
[null,null,null,null,null,{"$f":"SUM(F18:F22)","v":0},{"$f":"SUM(G18:G22)","v":0},{"$f":"SUM(H18:H22)","v":0},{"$f":"SUM(I18:I22)","v":0},{"$f":"SUM(J18:J22)","v":0},null,null,null,null,{"$f":"SUM(F23:J23)","v":0},{"$f":"MAX(F23:J23)+0.008","v":8.0000000000000002E-3},{"$f":"IF(F18=\"\",\"\",SUM(O23*1000)+P23)","v":""},null,null,null,null,null,null,null,null,null,null,null,null,null,null,null,18,{"$f":"IF(AF6<18,\"\",VLOOKUP(18,B6:N65,4,FALSE))","v":""},{"$f":"IF(AF6<18,\"\",VLOOKUP(18,B6:N65,10,FALSE))","v":""},null,null,5,{"$f":"IF(AK18<5,\"\",VLOOKUP(5,T6:AB64,5,FALSE))","v":""},{"$f":"IF(AK18<5,\"\",VLOOKUP(5,T6:AB64,9,FALSE))","v":""}]
[null,{"$f":"IF(F24=\"\",\"\",N24)","v":""},4,"VRŠOVICE II.",null,null,null,null,null,null,{"$f":"SUM(F24:J24)","v":0},{"$f":"MAX(F24:J24)","v":0},{"$f":"SUM(K24*1000)+L24+0.35","v":0.35},{"$f":"IF(F24=\"\",\"\",RANK(M24,M6:M65,0))","v":""},null,null,null,{"$f":"IF(F24=\"\",\"\",RANK(Q29,Q11:Q65,0))","v":""},null,null,{"$f":"IF(R24=\"\",\"\",R24)","v":""},{"$f":"IF(D24=\"\",\"\",D24)","v":"VRŠOVICE II."},{"$f":"IF(O29=\"\",\"\",O29)","v":0},null,null,null,null,null,null,null,null,null,19,{"$f":"IF(AF6<19,\"\",VLOOKUP(19,B6:N65,4,FALSE))","v":""},{"$f":"IF(AF6<19,\"\",VLOOKUP(19,B6:N65,10,FALSE))","v":""}]
[null,{"$f":"IF(F25=\"\",\"\",N25)","v":""},null,null,null,null,null,null,null,null,{"$f":"SUM(F25:J25)","v":0},{"$f":"MAX(F25:J25)","v":0},{"$f":"SUM(K25*1000)+L25+0.34","v":0.34},{"$f":"IF(F25=\"\",\"\",RANK(M25,M6:M65,0))","v":""},null,null,null,null,null,null,null,null,null,null,null,null,null,null,null,null,null,null,20,{"$f":"IF(AF6<20,\"\",VLOOKUP(20,B6:N65,4,FALSE))","v":""},{"$f":"IF(AF6<20,\"\",VLOOKUP(20,B6:N65,10,FALSE))","v":""}]
[null,{"$f":"IF(F26=\"\",\"\",N26)","v":""},null,null,null,null,null,null,null,null,{"$f":"SUM(F26:J26)","v":0},{"$f":"MAX(F26:J26)","v":0},{"$f":"SUM(K26*1000)+L26+0.33","v":0.33},{"$f":"IF(F26=\"\",\"\",RANK(M26,M6:M65,0))","v":""},null,null,null,null,null,null,null,null,null,null,null,null,null,null,null,null,null,null,21,{"$f":"IF(AF6<21,\"\",VLOOKUP(21,B6:N65,4,FALSE))","v":""},{"$f":"IF(AF6<21,\"\",VLOOKUP(21,B6:N65,10,FALSE))","v":""}]
[null,{"$f":"IF(F27=\"\",\"\",N27)","v":""},null,null,null,null,null,null,null,null,{"$f":"SUM(F27:J27)","v":0},{"$f":"MAX(F27:J27)","v":0},{"$f":"SUM(K27*1000)+L27+0.32","v":0.32},{"$f":"IF(F27=\"\",\"\",RANK(M27,M6:M65,0))","v":""},null,null,null,null,null,null,null,null,null,null,null,null,null,null,null,null,null,null,22,{"$f":"IF(AF6<22,\"\",VLOOKUP(22,B6:N65,4,FALSE))","v":""},{"$f":"IF(AF6<22,\"\",VLOOKUP(22,B6:N65,10,FALSE))","v":""}]
[null,{"$f":"IF(F28=\"\",\"\",N28)","v":""},null,null,null,null,null,null,null,null,{"$f":"SUM(F28:J28)","v":0},{"$f":"MAX(F28:J28)","v":0},{"$f":"SUM(K28*1000)+L28+0.31","v":0.31},{"$f":"IF(F28=\"\",\"\",RANK(M28,M6:M65,0))","v":""},null,null,null,null,null,null,null,null,null,null,null,null,null,null,null,null,null,null,23,{"$f":"IF(AF6<23,\"\",VLOOKUP(23,B6:N65,4,FALSE))","v":""},{"$f":"IF(AF6<23,\"\",VLOOKUP(23,B6:N65,10,FALSE))","v":""}]
[null,null,null,null,null,{"$f":"SUM(F24:F28)","v":0},{"$f":"SUM(G24:G28)","v":0},{"$f":"SUM(H24:H28)","v":0},{"$f":"SUM(I24:I28)","v":0},{"$f":"SUM(J24:J28)","v":0},null,null,null,null,{"$f":"SUM(F29:J29)","v":0},{"$f":"MAX(F29:J29)+0.007","v":7.0000000000000001E-3},{"$f":"IF(F24=\"\",\"\",SUM(O29*1000)+P29)","v":""},null,null,null,null,null,null,null,null,null,null,null,{"$f":"SUM(O23,O29)","v":0},null,null,null,24,{"$f":"IF(AF6<24,\"\",VLOOKUP(24,B6:N65,4,FALSE))","v":""},{"$f":"IF(AF6<24,\"\",VLOOKUP(24,B6:N65,10,FALSE))","v":""}]
[null,{"$f":"IF(F30=\"\",\"\",N30)","v":""},5,"KLÍČOV I.",null,null,null,null,null,null,{"$f":"SUM(F30:J30)","v":0},{"$f":"MAX(F30:J30)","v":0},{"$f":"SUM(K30*1000)+L30+0.3","v":0.3},{"$f":"IF(F30=\"\",\"\",RANK(M30,M6:M65,0))","v":""},null,null,null,{"$f":"IF(F30=\"\",\"\",RANK(Q35,Q11:Q65,0))","v":""},null,{"$f":"IF(F30=\"\",\"\",RANK(AA30,AA6:AA64,0))","v":""},{"$f":"IF(R30=\"\",\"\",R30)","v":""},{"$f":"IF(D30=\"\",\"\",D30)","v":"KLÍČOV I."},{"$f":"IF(O35=\"\",\"\",O35)","v":0},{"$f":"IF(V30=\"HOSTIVAŘ I.\",\"GARÁŽ HOSTIVAŘ\",IF(V30=\"VRŠOVICE I.\",\"GARÁŽ VRŠOVICE\",IF(V30=\"KLÍČOV I.\",\"GARÁŽ KLÍČOV\",IF(V30=\"ŘEPY I.\",\"GARÁŽ ŘEPY\",IF(V30=\"KAČEROV I.\",\"GARÁŽ KAČEROV\",\"\")))))","v":"GARÁŽ KLÍČOV"},{"$f":"MAX(F35:J35,F41:J41)+0.03","v":0.03},{"$f":"SUM(O35,O41)*1000","v":0},{"$f":"SUM(Y30:Z30)","v":0.03},{"$f":"IF(AC41=\"\",\"\",AC41)","v":0},null,{"$f":"IF(T30=\"\",\"\",T30)","v":""},null,null,25,{"$f":"IF(AF6<25,\"\",VLOOKUP(25,B6:N65,4,FALSE))","v":""},{"$f":"IF(AF6<25,\"\",VLOOKUP(25,B6:N65,10,FALSE))","v":""}]
[null,{"$f":"IF(F31=\"\",\"\",N31)","v":""},null,null,null,null,null,null,null,null,{"$f":"SUM(F31:J31)","v":0},{"$f":"MAX(F31:J31)","v":0},{"$f":"SUM(K31*1000)+L31+0.29","v":0.28999999999999998},{"$f":"IF(F31=\"\",\"\",RANK(M31,M6:M65,0))","v":""},null,null,null,null,null,null,null,null,null,null,null,null,null,null,null,null,null,null,26,{"$f":"IF(AF6<26,\"\",VLOOKUP(26,B6:N65,4,FALSE))","v":""},{"$f":"IF(AF6<26,\"\",VLOOKUP(26,B6:N65,10,FALSE))","v":""}]
[null,{"$f":"IF(F32=\"\",\"\",N32)","v":""},null,null,null,null,null,null,null,null,{"$f":"SUM(F32:J32)","v":0},{"$f":"MAX(F32:J32)","v":0},{"$f":"SUM(K32*1000)+L32+0.28","v":0.28000000000000003},{"$f":"IF(F32=\"\",\"\",RANK(M32,M6:M65,0))","v":""},null,null,null,null,null,null,null,null,null,null,null,null,null,null,null,null,null,null,27,{"$f":"IF(AF6<27,\"\",VLOOKUP(27,B6:N65,4,FALSE))","v":""},{"$f":"IF(AF6<27,\"\",VLOOKUP(27,B6:N65,10,FALSE))","v":""}]
[null,{"$f":"IF(F33=\"\",\"\",N33)","v":""},null,null,null,null,null,null,null,null,{"$f":"SUM(F33:J33)","v":0},{"$f":"MAX(F33:J33)","v":0},{"$f":"SUM(K33*1000)+L33+0.27","v":0.27},{"$f":"IF(F33=\"\",\"\",RANK(M33,M6:M65,0))","v":""},null,null,null,null,null,null,null,null,null,null,null,null,null,null,null,null,null,null,28,{"$f":"IF(AF6<28,\"\",VLOOKUP(28,B6:N65,4,FALSE))","v":""},{"$f":"IF(AF6<28,\"\",VLOOKUP(28,B6:N65,10,FALSE))","v":""}]
[null,{"$f":"IF(F34=\"\",\"\",N34)","v":""},null,null,null,null,null,null,null,null,{"$f":"SUM(F34:J34)","v":0},{"$f":"MAX(F34:J34)","v":0},{"$f":"SUM(K34*1000)+L34+0.26","v":0.26},{"$f":"IF(F34=\"\",\"\",RANK(M34,M6:M65,0))","v":""},null,null,null,null,null,null,null,null,null,null,null,null,null,null,null,null,null,null,29,{"$f":"IF(AF6<29,\"\",VLOOKUP(29,B6:N65,4,FALSE))","v":""},{"$f":"IF(AF6<29,\"\",VLOOKUP(29,B6:N65,10,FALSE))","v":""}]
[null,null,null,null,null,{"$f":"SUM(F30:F34)","v":0},{"$f":"SUM(G30:G34)","v":0},{"$f":"SUM(H30:H34)","v":0},{"$f":"SUM(I30:I34)","v":0},{"$f":"SUM(J30:J34)","v":0},null,null,null,null,{"$f":"SUM(F35:J35)","v":0},{"$f":"MAX(F35:J35)+0.006","v":6.0000000000000001E-3},{"$f":"IF(F30=\"\",\"\",SUM(O35*1000)+P35)","v":""},null,null,null,null,null,null,null,null,null,null,null,null,null,null,null,30,{"$f":"IF(AF6<30,\"\",VLOOKUP(30,B6:N65,4,FALSE))","v":""},{"$f":"IF(AF6<30,\"\",VLOOKUP(30,B6:N65,10,FALSE))","v":""}]
[null,{"$f":"IF(F36=\"\",\"\",N36)","v":""},6,"KLÍČOV II.",null,null,null,null,null,null,{"$f":"SUM(F36:J36)","v":0},{"$f":"MAX(F36:J36)","v":0},{"$f":"SUM(K36*1000)+L36+0.25","v":0.25},{"$f":"IF(F36=\"\",\"\",RANK(M36,M6:M65,0))","v":""},null,null,null,{"$f":"IF(F36=\"\",\"\",RANK(Q41,Q11:Q65,0))","v":""},null,null,{"$f":"IF(R36=\"\",\"\",R36)","v":""},{"$f":"IF(D36=\"\",\"\",D36)","v":"KLÍČOV II."},{"$f":"IF(O41=\"\",\"\",O41)","v":0},null,null,null,null,null,null,null,null,null,31,{"$f":"IF(AF6<31,\"\",VLOOKUP(31,B6:N65,4,FALSE))","v":""},{"$f":"IF(AF6<31,\"\",VLOOKUP(31,B6:N65,10,FALSE))","v":""}]
[null,{"$f":"IF(F37=\"\",\"\",N37)","v":""},null,null,null,null,null,null,null,null,{"$f":"SUM(F37:J37)","v":0},{"$f":"MAX(F37:J37)","v":0},{"$f":"SUM(K37*1000)+L37+0.24","v":0.24},{"$f":"IF(F37=\"\",\"\",RANK(M37,M6:M65,0))","v":""},null,null,null,null,null,null,null,null,null,null,null,null,null,null,null,null,null,null,32,{"$f":"IF(AF6<32,\"\",VLOOKUP(32,B6:N65,4,FALSE))","v":""},{"$f":"IF(AF6<32,\"\",VLOOKUP(32,B6:N65,10,FALSE))","v":""}]
[null,{"$f":"IF(F38=\"\",\"\",N38)","v":""},null,null,null,null,null,null,null,null,{"$f":"SUM(F38:J38)","v":0},{"$f":"MAX(F38:J38)","v":0},{"$f":"SUM(K38*1000)+L38+0.23","v":0.23},{"$f":"IF(F38=\"\",\"\",RANK(M38,M6:M65,0))","v":""},null,null,null,null,null,null,null,null,null,null,null,null,null,null,null,null,null,null,33,{"$f":"IF(AF6<33,\"\",VLOOKUP(33,B6:N65,4,FALSE))","v":""},{"$f":"IF(AF6<33,\"\",VLOOKUP(33,B6:N65,10,FALSE))","v":""}]
[null,{"$f":"IF(F39=\"\",\"\",N39)","v":""},null,null,null,null,null,null,null,null,{"$f":"SUM(F39:J39)","v":0},{"$f":"MAX(F39:J39)","v":0},{"$f":"SUM(K39*1000)+L39+0.21","v":0.21},{"$f":"IF(F39=\"\",\"\",RANK(M39,M6:M65,0))","v":""},null,null,null,null,null,null,null,null,null,null,null,null,null,null,null,null,null,null,34,{"$f":"IF(AF6<34,\"\",VLOOKUP(34,B6:N65,4,FALSE))","v":""},{"$f":"IF(AF6<34,\"\",VLOOKUP(34,B6:N65,10,FALSE))","v":""}]
[null,{"$f":"IF(F40=\"\",\"\",N40)","v":""},null,null,null,null,null,null,null,null,{"$f":"SUM(F40:J40)","v":0},{"$f":"MAX(F40:J40)","v":0},{"$f":"SUM(K40*1000)+L40+0.2","v":0.2},{"$f":"IF(F40=\"\",\"\",RANK(M40,M6:M65,0))","v":""},null,null,null,null,null,null,null,null,null,null,null,null,null,null,null,null,null,null,35,{"$f":"IF(AF6<35,\"\",VLOOKUP(35,B6:N65,4,FALSE))","v":""},{"$f":"IF(AF6<35,\"\",VLOOKUP(35,B6:N65,10,FALSE))","v":""}]
[null,null,null,null,null,{"$f":"SUM(F36:F40)","v":0},{"$f":"SUM(G36:G40)","v":0},{"$f":"SUM(H36:H40)","v":0},{"$f":"SUM(I36:I40)","v":0},{"$f":"SUM(J36:J40)","v":0},null,null,null,null,{"$f":"SUM(F41:J41)","v":0},{"$f":"MAX(F41:J41)+0.005","v":5.0000000000000001E-3},{"$f":"IF(F36=\"\",\"\",SUM(O41*1000)+P41)","v":""},null,null,null,null,null,null,null,null,null,null,null,{"$f":"SUM(O35,O41)","v":0},null,null,null,36,{"$f":"IF(AF6<36,\"\",VLOOKUP(36,B6:N65,4,FALSE))","v":""},{"$f":"IF(AF6<36,\"\",VLOOKUP(36,B6:N65,10,FALSE))","v":""}]
[null,{"$f":"IF(F42=\"\",\"\",N42)","v":""},7,"ŘEPY I.",null,null,null,null,null,null,{"$f":"SUM(F42:J42)","v":0},{"$f":"MAX(F42:J42)","v":0},{"$f":"SUM(K42*1000)+L42+0.19","v":0.19},{"$f":"IF(F42=\"\",\"\",RANK(M42,M6:M65,0))","v":""},null,null,null,{"$f":"IF(F42=\"\",\"\",RANK(Q47,Q11:Q65,0))","v":""},null,{"$f":"IF(F42=\"\",\"\",RANK(AA42,AA6:AA64,0))","v":""},{"$f":"IF(R42=\"\",\"\",R42)","v":""},{"$f":"IF(D42=\"\",\"\",D42)","v":"ŘEPY I."},{"$f":"IF(O47=\"\",\"\",O47)","v":0},{"$f":"IF(V42=\"HOSTIVAŘ I.\",\"GARÁŽ HOSTIVAŘ\",IF(V42=\"VRŠOVICE I.\",\"GARÁŽ VRŠOVICE\",IF(V42=\"KLÍČOV I.\",\"GARÁŽ KLÍČOV\",IF(V42=\"ŘEPY I.\",\"GARÁŽ ŘEPY\",IF(V42=\"KAČEROV I.\",\"GARÁŽ KAČEROV\",\"\")))))","v":"GARÁŽ ŘEPY"},{"$f":"MAX(F47:J47,F53:J53)+0.02","v":0.02},{"$f":"SUM(O47,O53)*1000","v":0},{"$f":"SUM(Y42:Z42)","v":0.02},{"$f":"IF(AC53=\"\",\"\",AC53)","v":0},null,{"$f":"IF(T42=\"\",\"\",T42)","v":""},null,null,37,{"$f":"IF(AF6<37,\"\",VLOOKUP(37,B6:N65,4,FALSE))","v":""},{"$f":"IF(AF6<37,\"\",VLOOKUP(37,B6:N65,10,FALSE))","v":""}]
[null,{"$f":"IF(F43=\"\",\"\",N43)","v":""},null,null,null,null,null,null,null,null,{"$f":"SUM(F43:J43)","v":0},{"$f":"MAX(F43:J43)","v":0},{"$f":"SUM(K43*1000)+L43+0.18","v":0.18},{"$f":"IF(F43=\"\",\"\",RANK(M43,M6:M65,0))","v":""},null,null,null,null,null,null,null,null,null,null,null,null,null,null,null,null,null,null,38,{"$f":"IF(AF6<38,\"\",VLOOKUP(38,B6:N65,4,FALSE))","v":""},{"$f":"IF(AF6<38,\"\",VLOOKUP(38,B6:N65,10,FALSE))","v":""}]
[null,{"$f":"IF(F44=\"\",\"\",N44)","v":""},null,null,null,null,null,null,null,null,{"$f":"SUM(F44:J44)","v":0},{"$f":"MAX(F44:J44)","v":0},{"$f":"SUM(K44*1000)+L44+0.17","v":0.17},{"$f":"IF(F44=\"\",\"\",RANK(M44,M6:M65,0))","v":""},null,null,null,null,null,null,null,null,null,null,null,null,null,null,null,null,null,null,39,{"$f":"IF(AF6<39,\"\",VLOOKUP(39,B6:N65,4,FALSE))","v":""},{"$f":"IF(AF6<39,\"\",VLOOKUP(39,B6:N65,10,FALSE))","v":""}]
[null,{"$f":"IF(F45=\"\",\"\",N45)","v":""},null,null,null,null,null,null,null,null,{"$f":"SUM(F45:J45)","v":0},{"$f":"MAX(F45:J45)","v":0},{"$f":"SUM(K45*1000)+L45+0.16","v":0.16},{"$f":"IF(F45=\"\",\"\",RANK(M45,M6:M65,0))","v":""},null,null,null,null,null,null,null,null,null,null,null,null,null,null,null,null,null,null,40,{"$f":"IF(AF6<40,\"\",VLOOKUP(40,B6:N65,4,FALSE))","v":""},{"$f":"IF(AF6<40,\"\",VLOOKUP(40,B6:N65,10,FALSE))","v":""}]
[null,{"$f":"IF(F46=\"\",\"\",N46)","v":""},null,null,null,null,null,null,null,null,{"$f":"SUM(F46:J46)","v":0},{"$f":"MAX(F46:J46)","v":0},{"$f":"SUM(K46*1000)+L46+0.15","v":0.15},{"$f":"IF(F46=\"\",\"\",RANK(M46,M6:M65,0))","v":""},null,null,null,null,null,null,null,null,null,null,null,null,null,null,null,null,null,null,41,{"$f":"IF(AF6<41,\"\",VLOOKUP(41,B6:N65,4,FALSE))","v":""},{"$f":"IF(AF6<41,\"\",VLOOKUP(41,B6:N65,10,FALSE))","v":""}]
[null,null,null,null,null,{"$f":"SUM(F42:F46)","v":0},{"$f":"SUM(G42:G46)","v":0},{"$f":"SUM(H42:H46)","v":0},{"$f":"SUM(I42:I46)","v":0},{"$f":"SUM(J42:J46)","v":0},null,null,null,null,{"$f":"SUM(F47:J47)","v":0},{"$f":"MAX(F47:J47)+0.004","v":4.0000000000000001E-3},{"$f":"IF(F42=\"\",\"\",SUM(O47*1000)+P47)","v":""},null,null,null,null,null,null,null,null,null,null,null,null,null,null,null,42,{"$f":"IF(AF6<42,\"\",VLOOKUP(42,B6:N65,4,FALSE))","v":""},{"$f":"IF(AF6<42,\"\",VLOOKUP(42,B6:N65,10,FALSE))","v":""}]
[null,{"$f":"IF(F48=\"\",\"\",N48)","v":""},8,"ŘEPY II.",null,null,null,null,null,null,{"$f":"SUM(F48:J48)","v":0},{"$f":"MAX(F48:J48)","v":0},{"$f":"SUM(K48*1000)+L48+0.14","v":0.14000000000000001},{"$f":"IF(F48=\"\",\"\",RANK(M48,M6:M65,0))","v":""},null,null,null,{"$f":"IF(F48=\"\",\"\",RANK(Q53,Q11:Q65,0))","v":""},null,null,{"$f":"IF(R48=\"\",\"\",R48)","v":""},{"$f":"IF(D48=\"\",\"\",D48)","v":"ŘEPY II."},{"$f":"IF(O53=\"\",\"\",O53)","v":0},null,null,null,null,null,null,null,null,null,43,{"$f":"IF(AF6<43,\"\",VLOOKUP(43,B6:N65,4,FALSE))","v":""},{"$f":"IF(AF6<43,\"\",VLOOKUP(43,B6:N65,10,FALSE))","v":""}]
[null,{"$f":"IF(F49=\"\",\"\",N49)","v":""},null,null,null,null,null,null,null,null,{"$f":"SUM(F49:J49)","v":0},{"$f":"MAX(F49:J49)","v":0},{"$f":"SUM(K49*1000)+L49+0.13","v":0.13},{"$f":"IF(F49=\"\",\"\",RANK(M49,M6:M65,0))","v":""},null,null,null,null,null,null,null,null,null,null,null,null,null,null,null,null,null,null,44,{"$f":"IF(AF6<44,\"\",VLOOKUP(44,B6:N65,4,FALSE))","v":""},{"$f":"IF(AF6<44,\"\",VLOOKUP(44,B6:N65,10,FALSE))","v":""}]
[null,{"$f":"IF(F50=\"\",\"\",N50)","v":""},null,null,null,null,null,null,null,null,{"$f":"SUM(F50:J50)","v":0},{"$f":"MAX(F50:J50)","v":0},{"$f":"SUM(K50*1000)+L50+0.12","v":0.12},{"$f":"IF(F50=\"\",\"\",RANK(M50,M6:M65,0))","v":""},null,null,null,null,null,null,null,null,null,null,null,null,null,null,null,null,null,null,45,{"$f":"IF(AF6<45,\"\",VLOOKUP(45,B6:N65,4,FALSE))","v":""},{"$f":"IF(AF6<45,\"\",VLOOKUP(45,B6:N65,10,FALSE))","v":""}]
[null,{"$f":"IF(F51=\"\",\"\",N51)","v":""},null,null,null,null,null,null,null,null,{"$f":"SUM(F51:J51)","v":0},{"$f":"MAX(F51:J51)","v":0},{"$f":"SUM(K51*1000)+L51+0.11","v":0.11},{"$f":"IF(F51=\"\",\"\",RANK(M51,M6:M65,0))","v":""},null,null,null,null,null,null,null,null,null,null,null,null,null,null,null,null,null,null,46,{"$f":"IF(AF6<46,\"\",VLOOKUP(46,B6:N65,4,FALSE))","v":""},{"$f":"IF(AF6<46,\"\",VLOOKUP(46,B6:N65,10,FALSE))","v":""}]
[null,{"$f":"IF(F52=\"\",\"\",N52)","v":""},null,null,null,null,null,null,null,null,{"$f":"SUM(F52:J52)","v":0},{"$f":"MAX(F52:J52)","v":0},{"$f":"SUM(K52*1000)+L52+0.1","v":0.1},{"$f":"IF(F52=\"\",\"\",RANK(M52,M6:M65,0))","v":""},null,null,null,null,null,null,null,null,null,null,null,null,null,null,null,null,null,null,47,{"$f":"IF(AF6<47,\"\",VLOOKUP(47,B6:N65,4,FALSE))","v":""},{"$f":"IF(AF6<47,\"\",VLOOKUP(47,B6:N65,10,FALSE))","v":""}]
[null,null,null,null,null,{"$f":"SUM(F48:F52)","v":0},{"$f":"SUM(G48:G52)","v":0},{"$f":"SUM(H48:H52)","v":0},{"$f":"SUM(I48:I52)","v":0},{"$f":"SUM(J48:J52)","v":0},null,null,null,null,{"$f":"SUM(F53:J53)","v":0},{"$f":"MAX(F53:J53)+0.003","v":3.0000000000000001E-3},{"$f":"IF(F48=\"\",\"\",SUM(O53*1000)+P53)","v":""},null,null,null,null,null,null,null,null,null,null,null,{"$f":"SUM(O47,O53)","v":0},null,null,null,48,{"$f":"IF(AF6<48,\"\",VLOOKUP(48,B6:N65,4,FALSE))","v":""},{"$f":"IF(AF6<48,\"\",VLOOKUP(48,B6:N65,10,FALSE))","v":""}]
[null,{"$f":"IF(F54=\"\",\"\",N54)","v":""},9,"KAČEROV I.",null,null,null,null,null,null,{"$f":"SUM(F54:J54)","v":0},{"$f":"MAX(F54:J54)","v":0},{"$f":"SUM(K54*1000)+L54+0.09","v":0.09},{"$f":"IF(F54=\"\",\"\",RANK(M54,M6:M65,0))","v":""},null,null,null,{"$f":"IF(F54=\"\",\"\",RANK(Q59,Q11:Q65,0))","v":""},null,{"$f":"IF(F54=\"\",\"\",RANK(AA54,AA6:AA64,0))","v":""},{"$f":"IF(R54=\"\",\"\",R54)","v":""},{"$f":"IF(D54=\"\",\"\",D54)","v":"KAČEROV I."},{"$f":"IF(O59=\"\",\"\",O59)","v":0},{"$f":"IF(V54=\"HOSTIVAŘ I.\",\"GARÁŽ HOSTIVAŘ\",IF(V54=\"VRŠOVICE I.\",\"GARÁŽ VRŠOVICE\",IF(V54=\"KLÍČOV I.\",\"GARÁŽ KLÍČOV\",IF(V54=\"ŘEPY I.\",\"GARÁŽ ŘEPY\",IF(V54=\"KAČEROV I.\",\"GARÁŽ KAČEROV\",\"\")))))","v":"GARÁŽ KAČEROV"},{"$f":"MAX(F59:J59,F65:J65)+0.01","v":0.01},{"$f":"SUM(O59,O65)*1000","v":0},{"$f":"SUM(Y54:Z54)","v":0.01},{"$f":"IF(AC65=\"\",\"\",AC65)","v":0},null,{"$f":"IF(T54=\"\",\"\",T54)","v":""},null,null,49,{"$f":"IF(AF6<49,\"\",VLOOKUP(49,B6:N65,4,FALSE))","v":""},{"$f":"IF(AF6<49,\"\",VLOOKUP(49,B6:N65,10,FALSE))","v":""}]
[null,{"$f":"IF(F55=\"\",\"\",N55)","v":""},null,null,null,null,null,null,null,null,{"$f":"SUM(F55:J55)","v":0},{"$f":"MAX(F55:J55)","v":0},{"$f":"SUM(K55*1000)+L55+0.08","v":0.08},{"$f":"IF(F55=\"\",\"\",RANK(M55,M6:M65,0))","v":""},null,null,null,null,null,null,null,null,null,null,null,null,null,null,null,null,null,null,50,{"$f":"IF(AF6<50,\"\",VLOOKUP(50,B6:N65,4,FALSE))","v":""},{"$f":"IF(AF6<50,\"\",VLOOKUP(50,B6:N65,10,FALSE))","v":""}]
[null,{"$f":"IF(F56=\"\",\"\",N56)","v":""},null,null,null,null,null,null,null,null,{"$f":"SUM(F56:J56)","v":0},{"$f":"MAX(F56:J56)","v":0},{"$f":"SUM(K56*1000)+L56+0.07","v":7.0000000000000007E-2},{"$f":"IF(F56=\"\",\"\",RANK(M56,M6:M65,0))","v":""}]
[null,{"$f":"IF(F57=\"\",\"\",N57)","v":""},null,null,null,null,null,null,null,null,{"$f":"SUM(F57:J57)","v":0},{"$f":"MAX(F57:J57)","v":0},{"$f":"SUM(K57*1000)+L57+0.06","v":0.06},{"$f":"IF(F57=\"\",\"\",RANK(M57,M6:M65,0))","v":""}]
[null,{"$f":"IF(F58=\"\",\"\",N58)","v":""},null,null,null,null,null,null,null,null,{"$f":"SUM(F58:J58)","v":0},{"$f":"MAX(F58:J58)","v":0},{"$f":"SUM(K58*1000)+L58+0.05","v":0.05},{"$f":"IF(F58=\"\",\"\",RANK(M58,M6:M65,0))","v":""}]
[null,null,null,null,null,{"$f":"SUM(F54:F58)","v":0},{"$f":"SUM(G54:G58)","v":0},{"$f":"SUM(H54:H58)","v":0},{"$f":"SUM(I54:I58)","v":0},{"$f":"SUM(J54:J58)","v":0},null,null,null,null,{"$f":"SUM(F59:J59)","v":0},{"$f":"MAX(F59:J59)+0.002","v":2E-3},{"$f":"IF(F54=\"\",\"\",SUM(O59*1000)+P59)","v":""}]
[null,{"$f":"IF(F60=\"\",\"\",N60)","v":""},10,"KAČEROV II.",null,null,null,null,null,null,{"$f":"SUM(F60:J60)","v":0},{"$f":"MAX(F60:J60)","v":0},{"$f":"SUM(K60*1000)+L60+0.04","v":0.04},{"$f":"IF(F60=\"\",\"\",RANK(M60,M6:M65,0))","v":""},null,null,null,{"$f":"IF(F60=\"\",\"\",RANK(Q65,Q11:Q65,0))","v":""},null,null,{"$f":"IF(R60=\"\",\"\",R60)","v":""},{"$f":"IF(D60=\"\",\"\",D60)","v":"KAČEROV II."},{"$f":"IF(O65=\"\",\"\",O65)","v":0}]
[null,{"$f":"IF(F61=\"\",\"\",N61)","v":""},null,null,null,null,null,null,null,null,{"$f":"SUM(F61:J61)","v":0},{"$f":"MAX(F61:J61)","v":0},{"$f":"SUM(K61*1000)+L61+0.03","v":0.03},{"$f":"IF(F61=\"\",\"\",RANK(M61,M6:M65,0))","v":""}]
[null,{"$f":"IF(F62=\"\",\"\",N62)","v":""},null,null,null,null,null,null,null,null,{"$f":"SUM(F62:J62)","v":0},{"$f":"MAX(F62:J62)","v":0},{"$f":"SUM(K62*1000)+L62+0.02","v":0.02},{"$f":"IF(F62=\"\",\"\",RANK(M62,M6:M65,0))","v":""}]
[null,{"$f":"IF(F63=\"\",\"\",N63)","v":""},null,null,null,null,null,null,null,null,{"$f":"SUM(F63:J63)","v":0},{"$f":"MAX(F63:J63)","v":0},{"$f":"SUM(K63*1000)+L63+0.01","v":0.01},{"$f":"IF(F63=\"\",\"\",RANK(M63,M6:M65,0))","v":""}]
[null,{"$f":"IF(F64=\"\",\"\",N64)","v":""},null,null,null,null,null,null,null,null,{"$f":"SUM(F64:J64)","v":0},{"$f":"MAX(F64:J64)","v":0},{"$f":"SUM(K64*1000)+L64","v":0},{"$f":"IF(F64=\"\",\"\",RANK(M64,M6:M65,0))","v":""}]
[null,null,null,null,null,{"$f":"SUM(F60:F64)","v":0},{"$f":"SUM(G60:G64)","v":0},{"$f":"SUM(H60:H64)","v":0},{"$f":"SUM(I60:I64)","v":0},{"$f":"SUM(J60:J64)","v":0},null,{"$f":"MAX(L12:L64,L6:L10)","v":0},null,null,{"$f":"SUM(F65:J65)","v":0},{"$f":"MAX(F65:J65)+0.001","v":1E-3},{"$f":"IF(F60=\"\",\"\",SUM(O65*1000)+P65)","v":""},null,null,null,null,null,null,null,null,null,null,null,{"$f":"SUM(O59,O65)","v":0}]

{"sheet":"VRŠOVICE","index":9,"n_rows":65,"n_cols":53,"rows_kept":65,"cut":false,"hidden":false,"merged":[[64,28,64,29],[52,28,52,29],[53,2,57,2],[53,3,57,3],[53,17,57,17],[53,29,63,29],[59,2,63,2],[59,3,63,3],[59,17,63,17],[35,3,39,3],[35,17,39,17],[40,28,40,29],[41,2,45,2],[41,3,45,3],[41,17,45,17],[41,29,51,29],[47,2,51,2],[47,3,51,3],[47,17,51,17],[17,37,17,39],[23,2,27,2],[23,3,27,3],[23,17,27,17],[28,28,28,29],[29,2,33,2],[29,3,33,3],[29,17,33,17],[29,29,39,29],[35,2,39,2],[11,2,15,2],[11,3,15,3],[11,17,15,17],[16,28,16,29],[17,2,21,2],[17,3,21,3],[17,17,21,17],[17,29,27,29],[2,3,2,39],[0,0,3,0],[4,2,4,3],[4,13,4,14],[4,32,4,34],[5,2,9,2],[5,3,9,3],[5,17,9,17],[5,29,15,29],[5,37,5,39]]}
["ZPĚT"]
[]
[null,null,null,"Sportovní turnaj v Bowlingu o pohár ZV-OS Vršovice dne _._. 2015"]
[]
[null,null,"Garáž",null,"Jméno","I.","II.","III.","IV.","V.","Body",null,null,"Jednotlivci.",null,null,null,"Družstva.",null,null,null,null,null,null,null,null,null,null,null,null,null,null,"pořadí jednotlivců"]
[null,{"$f":"IF(F6=\"\",\"\",N6)","v":""},1,"KAČEROV I.",null,null,null,null,null,null,{"$f":"SUM(F6:J6)","v":0},{"$f":"MAX(F6:J6)","v":0},{"$f":"SUM(K6*1000)+L6+0.5","v":0.5},{"$f":"IF(F6=\"\",\"\",RANK(M6,M6:M65,0))","v":""},null,null,null,{"$f":"IF(F6=\"\",\"\",RANK(Q11,Q11:Q65,0))","v":""},null,{"$f":"IF(F6=\"\",\"\",RANK(AA6,AA6:AA64,0))","v":""},{"$f":"IF(R6=\"\",\"\",R6)","v":""},{"$f":"IF(D6=\"\",\"\",D6)","v":"KAČEROV I."},{"$f":"IF(O11=\"\",\"\",O11)","v":0},{"$f":"IF(V6=\"HOSTIVAŘ I.\",\"GARÁŽ HOSTIVAŘ\",IF(V6=\"VRŠOVICE I.\",\"GARÁŽ VRŠOVICE\",IF(V6=\"KLÍČOV I.\",\"GARÁŽ KLÍČOV\",IF(V6=\"ŘEPY I.\",\"GARÁŽ ŘEPY\",IF(V6=\"KAČEROV I.\",\"GARÁŽ KAČEROV\",\"\")))))","v":"GARÁŽ KAČEROV"},{"$f":"MAX(F11:J11,F17:J17)+0.05","v":0.05},{"$f":"SUM(O11,O17)*1000","v":0},{"$f":"SUM(Y6:Z6)","v":0.05},{"$f":"IF(AC17=\"\",\"\",AC17)","v":0},null,{"$f":"IF(T6=\"\",\"\",T6)","v":""},null,{"$f":"COUNT(F6:F10,F12:F16,F18:F22,F24:F28,F30:F34,F36:F40,F42:F46,F48:F52,F54:F58,F60:F64)","v":0},1,{"$f":"IF(AF6<1,\"\",VLOOKUP(1,B6:N65,4,FALSE))","v":""},{"$f":"IF(AF6<1,\"\",VLOOKUP(1,B6:N65,10,FALSE))","v":""},null,{"$f":"COUNT(U6:U16,U18:U28,U30:U40,U42:U52,U54:U64)","v":0},"POŘADÍ DRUŽSTEV",null,null,null,null,null,null,null,null,null,null,null,null,null,null,"HOSTIVAŘ I."]
[null,{"$f":"IF(F7=\"\",\"\",N7)","v":""},null,null,null,null,null,null,null,null,{"$f":"SUM(F7:J7)","v":0},0,{"$f":"SUM(K7*1000)+L7+0.49","v":0.49},{"$f":"IF(F7=\"\",\"\",RANK(M7,M6:M65,0))","v":""},null,null,null,null,null,null,null,null,null,null,null,null,null,null,null,null,null,null,{"$f":"SUM(AG6+1)","v":2},{"$f":"IF(AF6<2,\"\",VLOOKUP(2,B6:N65,4,FALSE))","v":""},{"$f":"IF(AF6<2,\"\",VLOOKUP(2,B6:N65,10,FALSE))","v":""},null,null,1,{"$f":"IF(AK6<1,\"\",VLOOKUP(1,U6:W64,2,FALSE))","v":""},{"$f":"IF(AK6<1,\"\",VLOOKUP(1,U6:W64,3,FALSE))","v":""},null,null,null,null,null,null,null,null,null,null,null,null,"VRŠOVICE I."]
[null,{"$f":"IF(F8=\"\",\"\",N8)","v":""},null,null,null,null,null,null,null,null,{"$f":"SUM(F8:J8)","v":0},0,{"$f":"SUM(K8*1000)+L8+0.48","v":0.48},{"$f":"IF(F8=\"\",\"\",RANK(M8,M6:M65,0))","v":""},null,null,null,null,null,null,null,null,null,null,null,null,null,null,null,null,null,null,{"$f":"SUM(AG7+1)","v":3},{"$f":"IF(AF6<3,\"\",VLOOKUP(3,B6:N65,4,FALSE))","v":""},{"$f":"IF(AF6<3,\"\",VLOOKUP(3,B6:N65,10,FALSE))","v":""},null,null,2,{"$f":"IF(AK6<2,\"\",VLOOKUP(2,U6:W64,2,FALSE))","v":""},{"$f":"IF(AK6<2,\"\",VLOOKUP(2,U6:W64,3,FALSE))","v":""},null,null,null,null,null,null,null,null,null,null,null,null,"KLÍČOV I."]
[null,{"$f":"IF(F9=\"\",\"\",N9)","v":""},null,null,null,null,null,null,null,null,{"$f":"SUM(F9:J9)","v":0},0,{"$f":"SUM(K9*1000)+L9+0.47","v":0.47},{"$f":"IF(F9=\"\",\"\",RANK(M9,M6:M65,0))","v":""},null,null,null,null,null,null,null,null,null,null,null,null,null,null,null,null,null,null,4,{"$f":"IF(AF6<4,\"\",VLOOKUP(4,B6:N65,4,FALSE))","v":""},{"$f":"IF(AF6<4,\"\",VLOOKUP(4,B6:N65,10,FALSE))","v":""},null,null,3,{"$f":"IF(AK6<3,\"\",VLOOKUP(3,U6:W64,2,FALSE))","v":""},{"$f":"IF(AK6<3,\"\",VLOOKUP(3,U6:W64,3,FALSE))","v":""},null,null,null,null,null,null,null,null,null,null,null,null,"ŘEPY I."]
[null,{"$f":"IF(F10=\"\",\"\",N10)","v":""},null,null,null,null,null,null,null,null,{"$f":"SUM(F10:J10)","v":0},0,{"$f":"SUM(K10*1000)+L10+0.46","v":0.46},{"$f":"IF(F10=\"\",\"\",RANK(M10,M6:M65,0))","v":""},null,null,null,null,null,null,null,null,null,null,null,null,null,null,null,null,null,null,5,{"$f":"IF(AF6<5,\"\",VLOOKUP(5,B6:N65,4,FALSE))","v":""},{"$f":"IF(AF6<5,\"\",VLOOKUP(5,B6:N65,10,FALSE))","v":""},null,null,4,{"$f":"IF(AK6<4,\"\",VLOOKUP(4,U6:W64,2,FALSE))","v":""},{"$f":"IF(AK6<4,\"\",VLOOKUP(4,U6:W64,3,FALSE))","v":""},null,null,null,null,null,null,null,null,null,null,null,null,"KAČEROV I."]
[null,null,null,null,null,{"$f":"SUM(F6:F10)","v":0},{"$f":"SUM(G6:G10)","v":0},{"$f":"SUM(H6:H10)","v":0},{"$f":"SUM(I6:I10)","v":0},{"$f":"SUM(J6:J10)","v":0},null,0,null,null,{"$f":"SUM(F11:J11)","v":0},{"$f":"MAX(F11:J11)+0.01","v":0.01},{"$f":"IF(F6=\"\",\"\",SUM(O11*1000)+P11)","v":""},null,null,null,null,null,null,null,null,null,null,null,null,null,null,null,6,{"$f":"IF(AF6<6,\"\",VLOOKUP(6,B6:N65,4,FALSE))","v":""},{"$f":"IF(AF6<6,\"\",VLOOKUP(6,B6:N65,10,FALSE))","v":""},null,null,5,{"$f":"IF(AK6<5,\"\",VLOOKUP(5,U6:W64,2,FALSE))","v":""},{"$f":"IF(AK6<5,\"\",VLOOKUP(5,U6:W64,3,FALSE))","v":""}]
[null,{"$f":"IF(F12=\"\",\"\",N12)","v":""},2,"KAČEROV II.",null,null,null,null,null,null,{"$f":"SUM(F12:J12)","v":0},0,{"$f":"SUM(K12*1000)+L12+0.45","v":0.45},{"$f":"IF(F12=\"\",\"\",RANK(M12,M6:M65,0))","v":""},null,null,null,{"$f":"IF(F12=\"\",\"\",RANK(Q17,Q11:Q65,0))","v":""},null,null,{"$f":"IF(R12=\"\",\"\",R12)","v":""},{"$f":"IF(D12=\"\",\"\",D12)","v":"KAČEROV II."},{"$f":"IF(O17=\"\",\"\",O17)","v":0},null,null,null,null,null,null,null,null,null,7,{"$f":"IF(AF6<7,\"\",VLOOKUP(7,B6:N65,4,FALSE))","v":""},{"$f":"IF(AF6<7,\"\",VLOOKUP(7,B6:N65,10,FALSE))","v":""},null,null,6,{"$f":"IF(AK6<6,\"\",VLOOKUP(6,U6:W64,2,FALSE))","v":""},{"$f":"IF(AK6<6,\"\",VLOOKUP(6,U6:W64,3,FALSE))","v":""}]
[null,{"$f":"IF(F13=\"\",\"\",N13)","v":""},null,null,null,null,null,null,null,null,{"$f":"SUM(F13:J13)","v":0},0,{"$f":"SUM(K13*1000)+L13+0.44","v":0.44},{"$f":"IF(F13=\"\",\"\",RANK(M13,M6:M65,0))","v":""},null,null,null,null,null,null,null,null,null,null,null,null,null,null,null,null,null,null,8,{"$f":"IF(AF6<8,\"\",VLOOKUP(8,B6:N65,4,FALSE))","v":""},{"$f":"IF(AF6<8,\"\",VLOOKUP(8,B6:N65,10,FALSE))","v":""},null,null,7,{"$f":"IF(AK6<7,\"\",VLOOKUP(7,U6:W64,2,FALSE))","v":""},{"$f":"IF(AK6<7,\"\",VLOOKUP(7,U6:W64,3,FALSE))","v":""}]
[null,{"$f":"IF(F14=\"\",\"\",N14)","v":""},null,null,null,null,null,null,null,null,{"$f":"SUM(F14:J14)","v":0},0,{"$f":"SUM(K14*1000)+L14+0.43","v":0.43},{"$f":"IF(F14=\"\",\"\",RANK(M14,M6:M65,0))","v":""},null,null,null,null,null,null,null,null,null,null,null,null,null,null,null,null,null,null,9,{"$f":"IF(AF6<9,\"\",VLOOKUP(9,B6:N65,4,FALSE))","v":""},{"$f":"IF(AF6<9,\"\",VLOOKUP(9,B6:N65,10,FALSE))","v":""},null,null,8,{"$f":"IF(AK6<8,\"\",VLOOKUP(8,U6:W64,2,FALSE))","v":""},{"$f":"IF(AK6<8,\"\",VLOOKUP(8,U6:W64,3,FALSE))","v":""}]
[null,{"$f":"IF(F15=\"\",\"\",N15)","v":""},null,null,null,null,null,null,null,null,{"$f":"SUM(F15:J15)","v":0},0,{"$f":"SUM(K15*1000)+L15+0.42","v":0.42},{"$f":"IF(F15=\"\",\"\",RANK(M15,M6:M65,0))","v":""},null,null,null,null,null,null,null,null,null,null,null,null,null,null,null,null,null,null,10,{"$f":"IF(AF6<10,\"\",VLOOKUP(10,B6:N65,4,FALSE))","v":""},{"$f":"IF(AF6<10,\"\",VLOOKUP(10,B6:N65,10,FALSE))","v":""},null,null,9,{"$f":"IF(AK6<9,\"\",VLOOKUP(9,U6:W64,2,FALSE))","v":""},{"$f":"IF(AK6<9,\"\",VLOOKUP(9,U6:W64,3,FALSE))","v":""}]
[null,{"$f":"IF(F16=\"\",\"\",N16)","v":""},null,null,null,null,null,null,null,null,{"$f":"SUM(F16:J16)","v":0},0,{"$f":"SUM(K16*1000)+L16+0.41","v":0.41},{"$f":"IF(F16=\"\",\"\",RANK(M16,M6:M65,0))","v":""},null,null,null,null,null,null,null,null,null,null,null,null,null,null,null,null,null,null,11,{"$f":"IF(AF6<11,\"\",VLOOKUP(11,B6:N65,4,FALSE))","v":""},{"$f":"IF(AF6<11,\"\",VLOOKUP(11,B6:N65,10,FALSE))","v":""},null,null,10,{"$f":"IF(AK6<10,\"\",VLOOKUP(10,U6:W64,2,FALSE))","v":""},{"$f":"IF(AK6<10,\"\",VLOOKUP(10,U6:W64,3,FALSE))","v":""}]
[null,null,null,null,null,{"$f":"SUM(F12:F16)","v":0},{"$f":"SUM(G12:G16)","v":0},{"$f":"SUM(H12:H16)","v":0},{"$f":"SUM(I12:I16)","v":0},{"$f":"SUM(J12:J16)","v":0},null,null,null,null,{"$f":"SUM(F17:J17)","v":0},{"$f":"MAX(F17:J17)+0.009","v":8.9999999999999993E-3},{"$f":"IF(F12=\"\",\"\",SUM(O17*1000)+P17)","v":""},null,null,null,null,null,null,null,null,null,null,null,{"$f":"SUM(O11,O17)","v":0},null,null,null,12,{"$f":"IF(AF6<12,\"\",VLOOKUP(12,B6:N65,4,FALSE))","v":""},{"$f":"IF(AF6<12,\"\",VLOOKUP(12,B6:N65,10,FALSE))","v":""}]
[null,{"$f":"IF(F18=\"\",\"\",N18)","v":""},3,"HOSTIVAŘ I.",null,null,null,null,null,null,{"$f":"SUM(F18:J18)","v":0},{"$f":"MAX(F18:J18)","v":0},{"$f":"SUM(K18*1000)+L18+0.4","v":0.4},{"$f":"IF(F18=\"\",\"\",RANK(M18,M6:M65,0))","v":""},null,null,null,{"$f":"IF(F18=\"\",\"\",RANK(Q23,Q11:Q65,0))","v":""},null,{"$f":"IF(F18=\"\",\"\",RANK(AA18,AA6:AA64,0))","v":""},{"$f":"IF(R18=\"\",\"\",R18)","v":""},{"$f":"IF(D18=\"\",\"\",D18)","v":"HOSTIVAŘ I."},{"$f":"IF(O23=\"\",\"\",O23)","v":0},{"$f":"IF(V18=\"HOSTIVAŘ I.\",\"GARÁŽ HOSTIVAŘ\",IF(V18=\"VRŠOVICE I.\",\"GARÁŽ VRŠOVICE\",IF(V18=\"KLÍČOV I.\",\"GARÁŽ KLÍČOV\",IF(V18=\"ŘEPY I.\",\"GARÁŽ ŘEPY\",IF(V18=\"KAČEROV I.\",\"GARÁŽ KAČEROV\",\"\")))))","v":"GARÁŽ HOSTIVAŘ"},{"$f":"MAX(F23:J23,F29:J29)+0.04","v":0.04},{"$f":"SUM(O23,O29)*1000","v":0},{"$f":"SUM(Y18:Z18)","v":0.04},{"$f":"IF(AC29=\"\",\"\",AC29)","v":0},null,{"$f":"IF(T18=\"\",\"\",T18)","v":""},null,null,13,{"$f":"IF(AF6<13,\"\",VLOOKUP(13,B6:N65,4,FALSE))","v":""},{"$f":"IF(AF6<13,\"\",VLOOKUP(13,B6:N65,10,FALSE))","v":""},null,{"$f":"COUNT(T6:T64)","v":0},"POŘEDÍ GARÁŽÍ"]
[null,{"$f":"IF(F19=\"\",\"\",N19)","v":""},null,null,null,null,null,null,null,null,{"$f":"SUM(F19:J19)","v":0},{"$f":"MAX(F19:J19)","v":0},{"$f":"SUM(K19*1000)+L19+0.39","v":0.39},{"$f":"IF(F19=\"\",\"\",RANK(M19,M6:M65,0))","v":""},null,null,null,null,null,null,null,null,null,null,null,null,null,null,null,null,null,null,14,{"$f":"IF(AF6<14,\"\",VLOOKUP(14,B6:N65,4,FALSE))","v":""},{"$f":"IF(AF6<14,\"\",VLOOKUP(14,B6:N65,10,FALSE))","v":""},null,null,1,{"$f":"IF(AK18<1,\"\",VLOOKUP(1,T6:AB64,5,FALSE))","v":""},{"$f":"IF(AK18<1,\"\",VLOOKUP(1,T6:AB64,9,FALSE))","v":""}]
[null,{"$f":"IF(F20=\"\",\"\",N20)","v":""},null,null,null,null,null,null,null,null,{"$f":"SUM(F20:J20)","v":0},{"$f":"MAX(F20:J20)","v":0},{"$f":"SUM(K20*1000)+L20+0.38","v":0.38},{"$f":"IF(F20=\"\",\"\",RANK(M20,M6:M65,0))","v":""},null,null,null,null,null,null,null,null,null,null,null,null,null,null,null,null,null,null,15,{"$f":"IF(AF6<15,\"\",VLOOKUP(15,B6:N65,4,FALSE))","v":""},{"$f":"IF(AF6<15,\"\",VLOOKUP(15,B6:N65,10,FALSE))","v":""},null,null,2,{"$f":"IF(AK18<2,\"\",VLOOKUP(2,T6:AB64,5,FALSE))","v":""},{"$f":"IF(AK18<2,\"\",VLOOKUP(2,T6:AB64,9,FALSE))","v":""}]
[null,{"$f":"IF(F21=\"\",\"\",N21)","v":""},null,null,null,null,null,null,null,null,{"$f":"SUM(F21:J21)","v":0},{"$f":"MAX(F21:J21)","v":0},{"$f":"SUM(K21*1000)+L21+0.37","v":0.37},{"$f":"IF(F21=\"\",\"\",RANK(M21,M6:M65,0))","v":""},null,null,null,null,null,null,null,null,null,null,null,null,null,null,null,null,null,null,16,{"$f":"IF(AF6<16,\"\",VLOOKUP(16,B6:N65,4,FALSE))","v":""},{"$f":"IF(AF6<16,\"\",VLOOKUP(16,B6:N65,10,FALSE))","v":""},null,null,3,{"$f":"IF(AK18<3,\"\",VLOOKUP(3,T6:AB64,5,FALSE))","v":""},{"$f":"IF(AK18<3,\"\",VLOOKUP(3,T6:AB64,9,FALSE))","v":""}]
[null,{"$f":"IF(F22=\"\",\"\",N22)","v":""},null,null,null,null,null,null,null,null,{"$f":"SUM(F22:J22)","v":0},{"$f":"MAX(F22:J22)","v":0},{"$f":"SUM(K22*1000)+L22+0.36","v":0.36},{"$f":"IF(F22=\"\",\"\",RANK(M22,M6:M65,0))","v":""},null,null,null,null,null,null,null,null,null,null,null,null,null,null,null,null,null,null,17,{"$f":"IF(AF6<17,\"\",VLOOKUP(17,B6:N65,4,FALSE))","v":""},{"$f":"IF(AF6<17,\"\",VLOOKUP(17,B6:N65,10,FALSE))","v":""},null,null,4,{"$f":"IF(AK18<4,\"\",VLOOKUP(4,T6:AB64,5,FALSE))","v":""},{"$f":"IF(AK18<4,\"\",VLOOKUP(4,T6:AB64,9,FALSE))","v":""}]
[null,null,null,null,null,{"$f":"SUM(F18:F22)","v":0},{"$f":"SUM(G18:G22)","v":0},{"$f":"SUM(H18:H22)","v":0},{"$f":"SUM(I18:I22)","v":0},{"$f":"SUM(J18:J22)","v":0},null,null,null,null,{"$f":"SUM(F23:J23)","v":0},{"$f":"MAX(F23:J23)+0.008","v":8.0000000000000002E-3},{"$f":"IF(F18=\"\",\"\",SUM(O23*1000)+P23)","v":""},null,null,null,null,null,null,null,null,null,null,null,null,null,null,null,18,{"$f":"IF(AF6<18,\"\",VLOOKUP(18,B6:N65,4,FALSE))","v":""},{"$f":"IF(AF6<18,\"\",VLOOKUP(18,B6:N65,10,FALSE))","v":""},null,null,5,{"$f":"IF(AK18<5,\"\",VLOOKUP(5,T6:AB64,5,FALSE))","v":""},{"$f":"IF(AK18<5,\"\",VLOOKUP(5,T6:AB64,9,FALSE))","v":""}]
[null,{"$f":"IF(F24=\"\",\"\",N24)","v":""},4,"HOSTIVAŘ II.",null,null,null,null,null,null,{"$f":"SUM(F24:J24)","v":0},{"$f":"MAX(F24:J24)","v":0},{"$f":"SUM(K24*1000)+L24+0.35","v":0.35},{"$f":"IF(F24=\"\",\"\",RANK(M24,M6:M65,0))","v":""},null,null,null,{"$f":"IF(F24=\"\",\"\",RANK(Q29,Q11:Q65,0))","v":""},null,null,{"$f":"IF(R24=\"\",\"\",R24)","v":""},{"$f":"IF(D24=\"\",\"\",D24)","v":"HOSTIVAŘ II."},{"$f":"IF(O29=\"\",\"\",O29)","v":0},null,null,null,null,null,null,null,null,null,19,{"$f":"IF(AF6<19,\"\",VLOOKUP(19,B6:N65,4,FALSE))","v":""},{"$f":"IF(AF6<19,\"\",VLOOKUP(19,B6:N65,10,FALSE))","v":""}]
[null,{"$f":"IF(F25=\"\",\"\",N25)","v":""},null,null,null,null,null,null,null,null,{"$f":"SUM(F25:J25)","v":0},{"$f":"MAX(F25:J25)","v":0},{"$f":"SUM(K25*1000)+L25+0.34","v":0.34},{"$f":"IF(F25=\"\",\"\",RANK(M25,M6:M65,0))","v":""},null,null,null,null,null,null,null,null,null,null,null,null,null,null,null,null,null,null,20,{"$f":"IF(AF6<20,\"\",VLOOKUP(20,B6:N65,4,FALSE))","v":""},{"$f":"IF(AF6<20,\"\",VLOOKUP(20,B6:N65,10,FALSE))","v":""}]
[null,{"$f":"IF(F26=\"\",\"\",N26)","v":""},null,null,null,null,null,null,null,null,{"$f":"SUM(F26:J26)","v":0},{"$f":"MAX(F26:J26)","v":0},{"$f":"SUM(K26*1000)+L26+0.33","v":0.33},{"$f":"IF(F26=\"\",\"\",RANK(M26,M6:M65,0))","v":""},null,null,null,null,null,null,null,null,null,null,null,null,null,null,null,null,null,null,21,{"$f":"IF(AF6<21,\"\",VLOOKUP(21,B6:N65,4,FALSE))","v":""},{"$f":"IF(AF6<21,\"\",VLOOKUP(21,B6:N65,10,FALSE))","v":""}]
[null,{"$f":"IF(F27=\"\",\"\",N27)","v":""},null,null,null,null,null,null,null,null,{"$f":"SUM(F27:J27)","v":0},{"$f":"MAX(F27:J27)","v":0},{"$f":"SUM(K27*1000)+L27+0.32","v":0.32},{"$f":"IF(F27=\"\",\"\",RANK(M27,M6:M65,0))","v":""},null,null,null,null,null,null,null,null,null,null,null,null,null,null,null,null,null,null,22,{"$f":"IF(AF6<22,\"\",VLOOKUP(22,B6:N65,4,FALSE))","v":""},{"$f":"IF(AF6<22,\"\",VLOOKUP(22,B6:N65,10,FALSE))","v":""}]
[null,{"$f":"IF(F28=\"\",\"\",N28)","v":""},null,null,null,null,null,null,null,null,{"$f":"SUM(F28:J28)","v":0},{"$f":"MAX(F28:J28)","v":0},{"$f":"SUM(K28*1000)+L28+0.31","v":0.31},{"$f":"IF(F28=\"\",\"\",RANK(M28,M6:M65,0))","v":""},null,null,null,null,null,null,null,null,null,null,null,null,null,null,null,null,null,null,23,{"$f":"IF(AF6<23,\"\",VLOOKUP(23,B6:N65,4,FALSE))","v":""},{"$f":"IF(AF6<23,\"\",VLOOKUP(23,B6:N65,10,FALSE))","v":""}]
[null,null,null,null,null,{"$f":"SUM(F24:F28)","v":0},{"$f":"SUM(G24:G28)","v":0},{"$f":"SUM(H24:H28)","v":0},{"$f":"SUM(I24:I28)","v":0},{"$f":"SUM(J24:J28)","v":0},null,null,null,null,{"$f":"SUM(F29:J29)","v":0},{"$f":"MAX(F29:J29)+0.007","v":7.0000000000000001E-3},{"$f":"IF(F24=\"\",\"\",SUM(O29*1000)+P29)","v":""},null,null,null,null,null,null,null,null,null,null,null,{"$f":"SUM(O23,O29)","v":0},null,null,null,24,{"$f":"IF(AF6<24,\"\",VLOOKUP(24,B6:N65,4,FALSE))","v":""},{"$f":"IF(AF6<24,\"\",VLOOKUP(24,B6:N65,10,FALSE))","v":""}]
[null,{"$f":"IF(F30=\"\",\"\",N30)","v":""},5,"VRŠOVICE I.",null,null,null,null,null,null,{"$f":"SUM(F30:J30)","v":0},{"$f":"MAX(F30:J30)","v":0},{"$f":"SUM(K30*1000)+L30+0.3","v":0.3},{"$f":"IF(F30=\"\",\"\",RANK(M30,M6:M65,0))","v":""},null,null,null,{"$f":"IF(F30=\"\",\"\",RANK(Q35,Q11:Q65,0))","v":""},null,{"$f":"IF(F30=\"\",\"\",RANK(AA30,AA6:AA64,0))","v":""},{"$f":"IF(R30=\"\",\"\",R30)","v":""},{"$f":"IF(D30=\"\",\"\",D30)","v":"VRŠOVICE I."},{"$f":"IF(O35=\"\",\"\",O35)","v":0},{"$f":"IF(V30=\"HOSTIVAŘ I.\",\"GARÁŽ HOSTIVAŘ\",IF(V30=\"VRŠOVICE I.\",\"GARÁŽ VRŠOVICE\",IF(V30=\"KLÍČOV I.\",\"GARÁŽ KLÍČOV\",IF(V30=\"ŘEPY I.\",\"GARÁŽ ŘEPY\",IF(V30=\"KAČEROV I.\",\"GARÁŽ KAČEROV\",\"\")))))","v":"GARÁŽ VRŠOVICE"},{"$f":"MAX(F35:J35,F41:J41)+0.03","v":0.03},{"$f":"SUM(O35,O41)*1000","v":0},{"$f":"SUM(Y30:Z30)","v":0.03},{"$f":"IF(AC41=\"\",\"\",AC41)","v":0},null,{"$f":"IF(T30=\"\",\"\",T30)","v":""},null,null,25,{"$f":"IF(AF6<25,\"\",VLOOKUP(25,B6:N65,4,FALSE))","v":""},{"$f":"IF(AF6<25,\"\",VLOOKUP(25,B6:N65,10,FALSE))","v":""}]
[null,{"$f":"IF(F31=\"\",\"\",N31)","v":""},null,null,null,null,null,null,null,null,{"$f":"SUM(F31:J31)","v":0},{"$f":"MAX(F31:J31)","v":0},{"$f":"SUM(K31*1000)+L31+0.29","v":0.28999999999999998},{"$f":"IF(F31=\"\",\"\",RANK(M31,M6:M65,0))","v":""},null,null,null,null,null,null,null,null,null,null,null,null,null,null,null,null,null,null,26,{"$f":"IF(AF6<26,\"\",VLOOKUP(26,B6:N65,4,FALSE))","v":""},{"$f":"IF(AF6<26,\"\",VLOOKUP(26,B6:N65,10,FALSE))","v":""}]
[null,{"$f":"IF(F32=\"\",\"\",N32)","v":""},null,null,null,null,null,null,null,null,{"$f":"SUM(F32:J32)","v":0},{"$f":"MAX(F32:J32)","v":0},{"$f":"SUM(K32*1000)+L32+0.28","v":0.28000000000000003},{"$f":"IF(F32=\"\",\"\",RANK(M32,M6:M65,0))","v":""},null,null,null,null,null,null,null,null,null,null,null,null,null,null,null,null,null,null,27,{"$f":"IF(AF6<27,\"\",VLOOKUP(27,B6:N65,4,FALSE))","v":""},{"$f":"IF(AF6<27,\"\",VLOOKUP(27,B6:N65,10,FALSE))","v":""}]
[null,{"$f":"IF(F33=\"\",\"\",N33)","v":""},null,null,null,null,null,null,null,null,{"$f":"SUM(F33:J33)","v":0},{"$f":"MAX(F33:J33)","v":0},{"$f":"SUM(K33*1000)+L33+0.27","v":0.27},{"$f":"IF(F33=\"\",\"\",RANK(M33,M6:M65,0))","v":""},null,null,null,null,null,null,null,null,null,null,null,null,null,null,null,null,null,null,28,{"$f":"IF(AF6<28,\"\",VLOOKUP(28,B6:N65,4,FALSE))","v":""},{"$f":"IF(AF6<28,\"\",VLOOKUP(28,B6:N65,10,FALSE))","v":""}]
[null,{"$f":"IF(F34=\"\",\"\",N34)","v":""},null,null,null,null,null,null,null,null,{"$f":"SUM(F34:J34)","v":0},{"$f":"MAX(F34:J34)","v":0},{"$f":"SUM(K34*1000)+L34+0.26","v":0.26},{"$f":"IF(F34=\"\",\"\",RANK(M34,M6:M65,0))","v":""},null,null,null,null,null,null,null,null,null,null,null,null,null,null,null,null,null,null,29,{"$f":"IF(AF6<29,\"\",VLOOKUP(29,B6:N65,4,FALSE))","v":""},{"$f":"IF(AF6<29,\"\",VLOOKUP(29,B6:N65,10,FALSE))","v":""}]
[null,null,null,null,null,{"$f":"SUM(F30:F34)","v":0},{"$f":"SUM(G30:G34)","v":0},{"$f":"SUM(H30:H34)","v":0},{"$f":"SUM(I30:I34)","v":0},{"$f":"SUM(J30:J34)","v":0},null,null,null,null,{"$f":"SUM(F35:J35)","v":0},{"$f":"MAX(F35:J35)+0.006","v":6.0000000000000001E-3},{"$f":"IF(F30=\"\",\"\",SUM(O35*1000)+P35)","v":""},null,null,null,null,null,null,null,null,null,null,null,null,null,null,null,30,{"$f":"IF(AF6<30,\"\",VLOOKUP(30,B6:N65,4,FALSE))","v":""},{"$f":"IF(AF6<30,\"\",VLOOKUP(30,B6:N65,10,FALSE))","v":""}]
[null,{"$f":"IF(F36=\"\",\"\",N36)","v":""},6,"VRŠOVICE II.",null,null,null,null,null,null,{"$f":"SUM(F36:J36)","v":0},{"$f":"MAX(F36:J36)","v":0},{"$f":"SUM(K36*1000)+L36+0.25","v":0.25},{"$f":"IF(F36=\"\",\"\",RANK(M36,M6:M65,0))","v":""},null,null,null,{"$f":"IF(F36=\"\",\"\",RANK(Q41,Q11:Q65,0))","v":""},null,null,{"$f":"IF(R36=\"\",\"\",R36)","v":""},{"$f":"IF(D36=\"\",\"\",D36)","v":"VRŠOVICE II."},{"$f":"IF(O41=\"\",\"\",O41)","v":0},null,null,null,null,null,null,null,null,null,31,{"$f":"IF(AF6<31,\"\",VLOOKUP(31,B6:N65,4,FALSE))","v":""},{"$f":"IF(AF6<31,\"\",VLOOKUP(31,B6:N65,10,FALSE))","v":""}]
[null,{"$f":"IF(F37=\"\",\"\",N37)","v":""},null,null,null,null,null,null,null,null,{"$f":"SUM(F37:J37)","v":0},{"$f":"MAX(F37:J37)","v":0},{"$f":"SUM(K37*1000)+L37+0.24","v":0.24},{"$f":"IF(F37=\"\",\"\",RANK(M37,M6:M65,0))","v":""},null,null,null,null,null,null,null,null,null,null,null,null,null,null,null,null,null,null,32,{"$f":"IF(AF6<32,\"\",VLOOKUP(32,B6:N65,4,FALSE))","v":""},{"$f":"IF(AF6<32,\"\",VLOOKUP(32,B6:N65,10,FALSE))","v":""}]
[null,{"$f":"IF(F38=\"\",\"\",N38)","v":""},null,null,null,null,null,null,null,null,{"$f":"SUM(F38:J38)","v":0},{"$f":"MAX(F38:J38)","v":0},{"$f":"SUM(K38*1000)+L38+0.23","v":0.23},{"$f":"IF(F38=\"\",\"\",RANK(M38,M6:M65,0))","v":""},null,null,null,null,null,null,null,null,null,null,null,null,null,null,null,null,null,null,33,{"$f":"IF(AF6<33,\"\",VLOOKUP(33,B6:N65,4,FALSE))","v":""},{"$f":"IF(AF6<33,\"\",VLOOKUP(33,B6:N65,10,FALSE))","v":""}]
[null,{"$f":"IF(F39=\"\",\"\",N39)","v":""},null,null,null,null,null,null,null,null,{"$f":"SUM(F39:J39)","v":0},{"$f":"MAX(F39:J39)","v":0},{"$f":"SUM(K39*1000)+L39+0.21","v":0.21},{"$f":"IF(F39=\"\",\"\",RANK(M39,M6:M65,0))","v":""},null,null,null,null,null,null,null,null,null,null,null,null,null,null,null,null,null,null,34,{"$f":"IF(AF6<34,\"\",VLOOKUP(34,B6:N65,4,FALSE))","v":""},{"$f":"IF(AF6<34,\"\",VLOOKUP(34,B6:N65,10,FALSE))","v":""}]
[null,{"$f":"IF(F40=\"\",\"\",N40)","v":""},null,null,null,null,null,null,null,null,{"$f":"SUM(F40:J40)","v":0},{"$f":"MAX(F40:J40)","v":0},{"$f":"SUM(K40*1000)+L40+0.2","v":0.2},{"$f":"IF(F40=\"\",\"\",RANK(M40,M6:M65,0))","v":""},null,null,null,null,null,null,null,null,null,null,null,null,null,null,null,null,null,null,35,{"$f":"IF(AF6<35,\"\",VLOOKUP(35,B6:N65,4,FALSE))","v":""},{"$f":"IF(AF6<35,\"\",VLOOKUP(35,B6:N65,10,FALSE))","v":""}]
[null,null,null,null,null,{"$f":"SUM(F36:F40)","v":0},{"$f":"SUM(G36:G40)","v":0},{"$f":"SUM(H36:H40)","v":0},{"$f":"SUM(I36:I40)","v":0},{"$f":"SUM(J36:J40)","v":0},null,null,null,null,{"$f":"SUM(F41:J41)","v":0},{"$f":"MAX(F41:J41)+0.005","v":5.0000000000000001E-3},{"$f":"IF(F36=\"\",\"\",SUM(O41*1000)+P41)","v":""},null,null,null,null,null,null,null,null,null,null,null,{"$f":"SUM(O35,O41)","v":0},null,null,null,36,{"$f":"IF(AF6<36,\"\",VLOOKUP(36,B6:N65,4,FALSE))","v":""},{"$f":"IF(AF6<36,\"\",VLOOKUP(36,B6:N65,10,FALSE))","v":""}]
[null,{"$f":"IF(F42=\"\",\"\",N42)","v":""},7,"KLÍČOV I.",null,null,null,null,null,null,{"$f":"SUM(F42:J42)","v":0},{"$f":"MAX(F42:J42)","v":0},{"$f":"SUM(K42*1000)+L42+0.19","v":0.19},{"$f":"IF(F42=\"\",\"\",RANK(M42,M6:M65,0))","v":""},null,null,null,{"$f":"IF(F42=\"\",\"\",RANK(Q47,Q11:Q65,0))","v":""},null,{"$f":"IF(F42=\"\",\"\",RANK(AA42,AA6:AA64,0))","v":""},{"$f":"IF(R42=\"\",\"\",R42)","v":""},{"$f":"IF(D42=\"\",\"\",D42)","v":"KLÍČOV I."},{"$f":"IF(O47=\"\",\"\",O47)","v":0},{"$f":"IF(V42=\"HOSTIVAŘ I.\",\"GARÁŽ HOSTIVAŘ\",IF(V42=\"VRŠOVICE I.\",\"GARÁŽ VRŠOVICE\",IF(V42=\"KLÍČOV I.\",\"GARÁŽ KLÍČOV\",IF(V42=\"ŘEPY I.\",\"GARÁŽ ŘEPY\",IF(V42=\"KAČEROV I.\",\"GARÁŽ KAČEROV\",\"\")))))","v":"GARÁŽ KLÍČOV"},{"$f":"MAX(F47:J47,F53:J53)+0.02","v":0.02},{"$f":"SUM(O47,O53)*1000","v":0},{"$f":"SUM(Y42:Z42)","v":0.02},{"$f":"IF(AC53=\"\",\"\",AC53)","v":0},null,{"$f":"IF(T42=\"\",\"\",T42)","v":""},null,null,37,{"$f":"IF(AF6<37,\"\",VLOOKUP(37,B6:N65,4,FALSE))","v":""},{"$f":"IF(AF6<37,\"\",VLOOKUP(37,B6:N65,10,FALSE))","v":""}]
[null,{"$f":"IF(F43=\"\",\"\",N43)","v":""},null,null,null,null,null,null,null,null,{"$f":"SUM(F43:J43)","v":0},{"$f":"MAX(F43:J43)","v":0},{"$f":"SUM(K43*1000)+L43+0.18","v":0.18},{"$f":"IF(F43=\"\",\"\",RANK(M43,M6:M65,0))","v":""},null,null,null,null,null,null,null,null,null,null,null,null,null,null,null,null,null,null,38,{"$f":"IF(AF6<38,\"\",VLOOKUP(38,B6:N65,4,FALSE))","v":""},{"$f":"IF(AF6<38,\"\",VLOOKUP(38,B6:N65,10,FALSE))","v":""}]
[null,{"$f":"IF(F44=\"\",\"\",N44)","v":""},null,null,null,null,null,null,null,null,{"$f":"SUM(F44:J44)","v":0},{"$f":"MAX(F44:J44)","v":0},{"$f":"SUM(K44*1000)+L44+0.17","v":0.17},{"$f":"IF(F44=\"\",\"\",RANK(M44,M6:M65,0))","v":""},null,null,null,null,null,null,null,null,null,null,null,null,null,null,null,null,null,null,39,{"$f":"IF(AF6<39,\"\",VLOOKUP(39,B6:N65,4,FALSE))","v":""},{"$f":"IF(AF6<39,\"\",VLOOKUP(39,B6:N65,10,FALSE))","v":""}]
[null,{"$f":"IF(F45=\"\",\"\",N45)","v":""},null,null,null,null,null,null,null,null,{"$f":"SUM(F45:J45)","v":0},{"$f":"MAX(F45:J45)","v":0},{"$f":"SUM(K45*1000)+L45+0.16","v":0.16},{"$f":"IF(F45=\"\",\"\",RANK(M45,M6:M65,0))","v":""},null,null,null,null,null,null,null,null,null,null,null,null,null,null,null,null,null,null,40,{"$f":"IF(AF6<40,\"\",VLOOKUP(40,B6:N65,4,FALSE))","v":""},{"$f":"IF(AF6<40,\"\",VLOOKUP(40,B6:N65,10,FALSE))","v":""}]
[null,{"$f":"IF(F46=\"\",\"\",N46)","v":""},null,null,null,null,null,null,null,null,{"$f":"SUM(F46:J46)","v":0},{"$f":"MAX(F46:J46)","v":0},{"$f":"SUM(K46*1000)+L46+0.15","v":0.15},{"$f":"IF(F46=\"\",\"\",RANK(M46,M6:M65,0))","v":""},null,null,null,null,null,null,null,null,null,null,null,null,null,null,null,null,null,null,41,{"$f":"IF(AF6<41,\"\",VLOOKUP(41,B6:N65,4,FALSE))","v":""},{"$f":"IF(AF6<41,\"\",VLOOKUP(41,B6:N65,10,FALSE))","v":""}]
[null,null,null,null,null,{"$f":"SUM(F42:F46)","v":0},{"$f":"SUM(G42:G46)","v":0},{"$f":"SUM(H42:H46)","v":0},{"$f":"SUM(I42:I46)","v":0},{"$f":"SUM(J42:J46)","v":0},null,null,null,null,{"$f":"SUM(F47:J47)","v":0},{"$f":"MAX(F47:J47)+0.004","v":4.0000000000000001E-3},{"$f":"IF(F42=\"\",\"\",SUM(O47*1000)+P47)","v":""},null,null,null,null,null,null,null,null,null,null,null,null,null,null,null,42,{"$f":"IF(AF6<42,\"\",VLOOKUP(42,B6:N65,4,FALSE))","v":""},{"$f":"IF(AF6<42,\"\",VLOOKUP(42,B6:N65,10,FALSE))","v":""}]
[null,{"$f":"IF(F48=\"\",\"\",N48)","v":""},8,"KLÍČOV II.",null,null,null,null,null,null,{"$f":"SUM(F48:J48)","v":0},{"$f":"MAX(F48:J48)","v":0},{"$f":"SUM(K48*1000)+L48+0.14","v":0.14000000000000001},{"$f":"IF(F48=\"\",\"\",RANK(M48,M6:M65,0))","v":""},null,null,null,{"$f":"IF(F48=\"\",\"\",RANK(Q53,Q11:Q65,0))","v":""},null,null,{"$f":"IF(R48=\"\",\"\",R48)","v":""},{"$f":"IF(D48=\"\",\"\",D48)","v":"KLÍČOV II."},{"$f":"IF(O53=\"\",\"\",O53)","v":0},null,null,null,null,null,null,null,null,null,43,{"$f":"IF(AF6<43,\"\",VLOOKUP(43,B6:N65,4,FALSE))","v":""},{"$f":"IF(AF6<43,\"\",VLOOKUP(43,B6:N65,10,FALSE))","v":""}]
[null,{"$f":"IF(F49=\"\",\"\",N49)","v":""},null,null,null,null,null,null,null,null,{"$f":"SUM(F49:J49)","v":0},{"$f":"MAX(F49:J49)","v":0},{"$f":"SUM(K49*1000)+L49+0.13","v":0.13},{"$f":"IF(F49=\"\",\"\",RANK(M49,M6:M65,0))","v":""},null,null,null,null,null,null,null,null,null,null,null,null,null,null,null,null,null,null,44,{"$f":"IF(AF6<44,\"\",VLOOKUP(44,B6:N65,4,FALSE))","v":""},{"$f":"IF(AF6<44,\"\",VLOOKUP(44,B6:N65,10,FALSE))","v":""}]
[null,{"$f":"IF(F50=\"\",\"\",N50)","v":""},null,null,null,null,null,null,null,null,{"$f":"SUM(F50:J50)","v":0},{"$f":"MAX(F50:J50)","v":0},{"$f":"SUM(K50*1000)+L50+0.12","v":0.12},{"$f":"IF(F50=\"\",\"\",RANK(M50,M6:M65,0))","v":""},null,null,null,null,null,null,null,null,null,null,null,null,null,null,null,null,null,null,45,{"$f":"IF(AF6<45,\"\",VLOOKUP(45,B6:N65,4,FALSE))","v":""},{"$f":"IF(AF6<45,\"\",VLOOKUP(45,B6:N65,10,FALSE))","v":""}]
[null,{"$f":"IF(F51=\"\",\"\",N51)","v":""},null,null,null,null,null,null,null,null,{"$f":"SUM(F51:J51)","v":0},{"$f":"MAX(F51:J51)","v":0},{"$f":"SUM(K51*1000)+L51+0.11","v":0.11},{"$f":"IF(F51=\"\",\"\",RANK(M51,M6:M65,0))","v":""},null,null,null,null,null,null,null,null,null,null,null,null,null,null,null,null,null,null,46,{"$f":"IF(AF6<46,\"\",VLOOKUP(46,B6:N65,4,FALSE))","v":""},{"$f":"IF(AF6<46,\"\",VLOOKUP(46,B6:N65,10,FALSE))","v":""}]
[null,{"$f":"IF(F52=\"\",\"\",N52)","v":""},null,null,null,null,null,null,null,null,{"$f":"SUM(F52:J52)","v":0},{"$f":"MAX(F52:J52)","v":0},{"$f":"SUM(K52*1000)+L52+0.1","v":0.1},{"$f":"IF(F52=\"\",\"\",RANK(M52,M6:M65,0))","v":""},null,null,null,null,null,null,null,null,null,null,null,null,null,null,null,null,null,null,47,{"$f":"IF(AF6<47,\"\",VLOOKUP(47,B6:N65,4,FALSE))","v":""},{"$f":"IF(AF6<47,\"\",VLOOKUP(47,B6:N65,10,FALSE))","v":""}]
[null,null,null,null,null,{"$f":"SUM(F48:F52)","v":0},{"$f":"SUM(G48:G52)","v":0},{"$f":"SUM(H48:H52)","v":0},{"$f":"SUM(I48:I52)","v":0},{"$f":"SUM(J48:J52)","v":0},null,null,null,null,{"$f":"SUM(F53:J53)","v":0},{"$f":"MAX(F53:J53)+0.003","v":3.0000000000000001E-3},{"$f":"IF(F48=\"\",\"\",SUM(O53*1000)+P53)","v":""},null,null,null,null,null,null,null,null,null,null,null,{"$f":"SUM(O47,O53)","v":0},null,null,null,48,{"$f":"IF(AF6<48,\"\",VLOOKUP(48,B6:N65,4,FALSE))","v":""},{"$f":"IF(AF6<48,\"\",VLOOKUP(48,B6:N65,10,FALSE))","v":""}]
[null,{"$f":"IF(F54=\"\",\"\",N54)","v":""},9,"ŘEPY I.",null,null,null,null,null,null,{"$f":"SUM(F54:J54)","v":0},{"$f":"MAX(F54:J54)","v":0},{"$f":"SUM(K54*1000)+L54+0.09","v":0.09},{"$f":"IF(F54=\"\",\"\",RANK(M54,M6:M65,0))","v":""},null,null,null,{"$f":"IF(F54=\"\",\"\",RANK(Q59,Q11:Q65,0))","v":""},null,{"$f":"IF(F54=\"\",\"\",RANK(AA54,AA6:AA64,0))","v":""},{"$f":"IF(R54=\"\",\"\",R54)","v":""},{"$f":"IF(D54=\"\",\"\",D54)","v":"ŘEPY I."},{"$f":"IF(O59=\"\",\"\",O59)","v":0},{"$f":"IF(V54=\"HOSTIVAŘ I.\",\"GARÁŽ HOSTIVAŘ\",IF(V54=\"VRŠOVICE I.\",\"GARÁŽ VRŠOVICE\",IF(V54=\"KLÍČOV I.\",\"GARÁŽ KLÍČOV\",IF(V54=\"ŘEPY I.\",\"GARÁŽ ŘEPY\",IF(V54=\"KAČEROV I.\",\"GARÁŽ KAČEROV\",\"\")))))","v":"GARÁŽ ŘEPY"},{"$f":"MAX(F59:J59,F65:J65)+0.01","v":0.01},{"$f":"SUM(O59,O65)*1000","v":0},{"$f":"SUM(Y54:Z54)","v":0.01},{"$f":"IF(AC65=\"\",\"\",AC65)","v":0},null,{"$f":"IF(T54=\"\",\"\",T54)","v":""},null,null,49,{"$f":"IF(AF6<49,\"\",VLOOKUP(49,B6:N65,4,FALSE))","v":""},{"$f":"IF(AF6<49,\"\",VLOOKUP(49,B6:N65,10,FALSE))","v":""}]
[null,{"$f":"IF(F55=\"\",\"\",N55)","v":""},null,null,null,null,null,null,null,null,{"$f":"SUM(F55:J55)","v":0},{"$f":"MAX(F55:J55)","v":0},{"$f":"SUM(K55*1000)+L55+0.08","v":0.08},{"$f":"IF(F55=\"\",\"\",RANK(M55,M6:M65,0))","v":""},null,null,null,null,null,null,null,null,null,null,null,null,null,null,null,null,null,null,50,{"$f":"IF(AF6<50,\"\",VLOOKUP(50,B6:N65,4,FALSE))","v":""},{"$f":"IF(AF6<50,\"\",VLOOKUP(50,B6:N65,10,FALSE))","v":""}]
[null,{"$f":"IF(F56=\"\",\"\",N56)","v":""},null,null,null,null,null,null,null,null,{"$f":"SUM(F56:J56)","v":0},{"$f":"MAX(F56:J56)","v":0},{"$f":"SUM(K56*1000)+L56+0.07","v":7.0000000000000007E-2},{"$f":"IF(F56=\"\",\"\",RANK(M56,M6:M65,0))","v":""}]
[null,{"$f":"IF(F57=\"\",\"\",N57)","v":""},null,null,null,null,null,null,null,null,{"$f":"SUM(F57:J57)","v":0},{"$f":"MAX(F57:J57)","v":0},{"$f":"SUM(K57*1000)+L57+0.06","v":0.06},{"$f":"IF(F57=\"\",\"\",RANK(M57,M6:M65,0))","v":""}]
[null,{"$f":"IF(F58=\"\",\"\",N58)","v":""},null,null,null,null,null,null,null,null,{"$f":"SUM(F58:J58)","v":0},{"$f":"MAX(F58:J58)","v":0},{"$f":"SUM(K58*1000)+L58+0.05","v":0.05},{"$f":"IF(F58=\"\",\"\",RANK(M58,M6:M65,0))","v":""}]
[null,null,null,null,null,{"$f":"SUM(F54:F58)","v":0},{"$f":"SUM(G54:G58)","v":0},{"$f":"SUM(H54:H58)","v":0},{"$f":"SUM(I54:I58)","v":0},{"$f":"SUM(J54:J58)","v":0},null,null,null,null,{"$f":"SUM(F59:J59)","v":0},{"$f":"MAX(F59:J59)+0.002","v":2E-3},{"$f":"IF(F54=\"\",\"\",SUM(O59*1000)+P59)","v":""}]
[null,{"$f":"IF(F60=\"\",\"\",N60)","v":""},10,"ŘEPY II.",null,null,null,null,null,null,{"$f":"SUM(F60:J60)","v":0},{"$f":"MAX(F60:J60)","v":0},{"$f":"SUM(K60*1000)+L60+0.04","v":0.04},{"$f":"IF(F60=\"\",\"\",RANK(M60,M6:M65,0))","v":""},null,null,null,{"$f":"IF(F60=\"\",\"\",RANK(Q65,Q11:Q65,0))","v":""},null,null,{"$f":"IF(R60=\"\",\"\",R60)","v":""},{"$f":"IF(D60=\"\",\"\",D60)","v":"ŘEPY II."},{"$f":"IF(O65=\"\",\"\",O65)","v":0}]
[null,{"$f":"IF(F61=\"\",\"\",N61)","v":""},null,null,null,null,null,null,null,null,{"$f":"SUM(F61:J61)","v":0},{"$f":"MAX(F61:J61)","v":0},{"$f":"SUM(K61*1000)+L61+0.03","v":0.03},{"$f":"IF(F61=\"\",\"\",RANK(M61,M6:M65,0))","v":""}]
[null,{"$f":"IF(F62=\"\",\"\",N62)","v":""},null,null,null,null,null,null,null,null,{"$f":"SUM(F62:J62)","v":0},{"$f":"MAX(F62:J62)","v":0},{"$f":"SUM(K62*1000)+L62+0.02","v":0.02},{"$f":"IF(F62=\"\",\"\",RANK(M62,M6:M65,0))","v":""}]
[null,{"$f":"IF(F63=\"\",\"\",N63)","v":""},null,null,null,null,null,null,null,null,{"$f":"SUM(F63:J63)","v":0},{"$f":"MAX(F63:J63)","v":0},{"$f":"SUM(K63*1000)+L63+0.01","v":0.01},{"$f":"IF(F63=\"\",\"\",RANK(M63,M6:M65,0))","v":""}]
[null,{"$f":"IF(F64=\"\",\"\",N64)","v":""},null,null,null,null,null,null,null,null,{"$f":"SUM(F64:J64)","v":0},{"$f":"MAX(F64:J64)","v":0},{"$f":"SUM(K64*1000)+L64","v":0},{"$f":"IF(F64=\"\",\"\",RANK(M64,M6:M65,0))","v":""}]
[null,null,null,null,null,{"$f":"SUM(F60:F64)","v":0},{"$f":"SUM(G60:G64)","v":0},{"$f":"SUM(H60:H64)","v":0},{"$f":"SUM(I60:I64)","v":0},{"$f":"SUM(J60:J64)","v":0},null,{"$f":"MAX(L12:L64,L6:L10)","v":0},null,null,{"$f":"SUM(F65:J65)","v":0},{"$f":"MAX(F65:J65)+0.001","v":1E-3},{"$f":"IF(F60=\"\",\"\",SUM(O65*1000)+P65)","v":""},null,null,null,null,null,null,null,null,null,null,null,{"$f":"SUM(O59,O65)","v":0}]

{"sheet":"POHÁR GŘ","index":10,"n_rows":65,"n_cols":53,"rows_kept":65,"cut":false,"hidden":false,"merged":[[64,28,64,29],[52,28,52,29],[53,2,57,2],[53,3,57,3],[53,17,57,17],[53,29,63,29],[59,2,63,2],[59,3,63,3],[59,17,63,17],[35,3,39,3],[35,17,39,17],[40,28,40,29],[41,2,45,2],[41,3,45,3],[41,17,45,17],[41,29,51,29],[47,2,51,2],[47,3,51,3],[47,17,51,17],[17,37,17,39],[23,2,27,2],[23,3,27,3],[23,17,27,17],[28,28,28,29],[29,2,33,2],[29,3,33,3],[29,17,33,17],[29,29,39,29],[35,2,39,2],[11,2,15,2],[11,3,15,3],[11,17,15,17],[16,28,16,29],[17,2,21,2],[17,3,21,3],[17,17,21,17],[17,29,27,29],[2,3,2,39],[0,0,3,0],[4,2,4,3],[4,13,4,14],[4,32,4,34],[5,2,9,2],[5,3,9,3],[5,17,9,17],[5,29,15,29],[5,37,5,39]]}
["ZPĚT"]
[]
[null,null,null,"3. ročník turnaje v bowlingu o \"Putovní pohár GŘ DP - Praha, ing. J. Ďuriše\", dne _._. 2015"]
[]
[null,null,"Garáž",null,"Jméno","I.","II.","III.","IV.","V.","Body",null,null,"Jednotlivci.",null,null,null,"Družstva.",null,null,null,null,null,null,null,null,null,null,null,null,null,null,"pořadí jednotlivců"]
[null,{"$f":"IF(F6=\"\",\"\",N6)","v":""},1,"ŘEPY I.",null,null,null,null,null,null,{"$f":"SUM(F6:J6)","v":0},{"$f":"MAX(F6:J6)","v":0},{"$f":"SUM(K6*1000)+L6+0.5","v":0.5},{"$f":"IF(F6=\"\",\"\",RANK(M6,M6:M65,0))","v":""},null,null,null,{"$f":"IF(F6=\"\",\"\",RANK(Q11,Q11:Q65,0))","v":""},null,{"$f":"IF(F6=\"\",\"\",RANK(AA6,AA6:AA64,0))","v":""},{"$f":"IF(R6=\"\",\"\",R6)","v":""},{"$f":"IF(D6=\"\",\"\",D6)","v":"ŘEPY I."},{"$f":"IF(O11=\"\",\"\",O11)","v":0},{"$f":"IF(V6=\"HOSTIVAŘ I.\",\"GARÁŽ HOSTIVAŘ\",IF(V6=\"VRŠOVICE I.\",\"GARÁŽ VRŠOVICE\",IF(V6=\"KLÍČOV I.\",\"GARÁŽ KLÍČOV\",IF(V6=\"ŘEPY I.\",\"GARÁŽ ŘEPY\",IF(V6=\"KAČEROV I.\",\"GARÁŽ KAČEROV\",\"\")))))","v":"GARÁŽ ŘEPY"},{"$f":"MAX(F11:J11,F17:J17)+0.05","v":0.05},{"$f":"SUM(O11,O17)*1000","v":0},{"$f":"SUM(Y6:Z6)","v":0.05},{"$f":"IF(AC17=\"\",\"\",AC17)","v":0},null,{"$f":"IF(T6=\"\",\"\",T6)","v":""},null,{"$f":"COUNT(F6:F10,F12:F16,F18:F22,F24:F28,F30:F34,F36:F40,F42:F46,F48:F52,F54:F58,F60:F64)","v":0},1,{"$f":"IF(AF6<1,\"\",VLOOKUP(1,B6:N65,4,FALSE))","v":""},{"$f":"IF(AF6<1,\"\",VLOOKUP(1,B6:N65,10,FALSE))","v":""},null,{"$f":"COUNT(U6:U16,U18:U28,U30:U40,U42:U52,U54:U64)","v":0},"POŘADÍ DRUŽSTEV",null,null,null,null,null,null,null,null,null,null,null,null,null,null,"HOSTIVAŘ I."]
[null,{"$f":"IF(F7=\"\",\"\",N7)","v":""},null,null,null,null,null,null,null,null,{"$f":"SUM(F7:J7)","v":0},0,{"$f":"SUM(K7*1000)+L7+0.49","v":0.49},{"$f":"IF(F7=\"\",\"\",RANK(M7,M6:M65,0))","v":""},null,null,null,null,null,null,null,null,null,null,null,null,null,null,null,null,null,null,{"$f":"SUM(AG6+1)","v":2},{"$f":"IF(AF6<2,\"\",VLOOKUP(2,B6:N65,4,FALSE))","v":""},{"$f":"IF(AF6<2,\"\",VLOOKUP(2,B6:N65,10,FALSE))","v":""},null,null,1,{"$f":"IF(AK6<1,\"\",VLOOKUP(1,U6:W64,2,FALSE))","v":""},{"$f":"IF(AK6<1,\"\",VLOOKUP(1,U6:W64,3,FALSE))","v":""},null,null,null,null,null,null,null,null,null,null,null,null,"VRŠOVICE I."]
[null,{"$f":"IF(F8=\"\",\"\",N8)","v":""},null,null,null,null,null,null,null,null,{"$f":"SUM(F8:J8)","v":0},0,{"$f":"SUM(K8*1000)+L8+0.48","v":0.48},{"$f":"IF(F8=\"\",\"\",RANK(M8,M6:M65,0))","v":""},null,null,null,null,null,null,null,null,null,null,null,null,null,null,null,null,null,null,{"$f":"SUM(AG7+1)","v":3},{"$f":"IF(AF6<3,\"\",VLOOKUP(3,B6:N65,4,FALSE))","v":""},{"$f":"IF(AF6<3,\"\",VLOOKUP(3,B6:N65,10,FALSE))","v":""},null,null,2,{"$f":"IF(AK6<2,\"\",VLOOKUP(2,U6:W64,2,FALSE))","v":""},{"$f":"IF(AK6<2,\"\",VLOOKUP(2,U6:W64,3,FALSE))","v":""},null,null,null,null,null,null,null,null,null,null,null,null,"KLÍČOV I."]
[null,{"$f":"IF(F9=\"\",\"\",N9)","v":""},null,null,null,null,null,null,null,null,{"$f":"SUM(F9:J9)","v":0},0,{"$f":"SUM(K9*1000)+L9+0.47","v":0.47},{"$f":"IF(F9=\"\",\"\",RANK(M9,M6:M65,0))","v":""},null,null,null,null,null,null,null,null,null,null,null,null,null,null,null,null,null,null,4,{"$f":"IF(AF6<4,\"\",VLOOKUP(4,B6:N65,4,FALSE))","v":""},{"$f":"IF(AF6<4,\"\",VLOOKUP(4,B6:N65,10,FALSE))","v":""},null,null,3,{"$f":"IF(AK6<3,\"\",VLOOKUP(3,U6:W64,2,FALSE))","v":""},{"$f":"IF(AK6<3,\"\",VLOOKUP(3,U6:W64,3,FALSE))","v":""},null,null,null,null,null,null,null,null,null,null,null,null,"ŘEPY I."]
[null,{"$f":"IF(F10=\"\",\"\",N10)","v":""},null,null,null,null,null,null,null,null,{"$f":"SUM(F10:J10)","v":0},0,{"$f":"SUM(K10*1000)+L10+0.46","v":0.46},{"$f":"IF(F10=\"\",\"\",RANK(M10,M6:M65,0))","v":""},null,null,null,null,null,null,null,null,null,null,null,null,null,null,null,null,null,null,5,{"$f":"IF(AF6<5,\"\",VLOOKUP(5,B6:N65,4,FALSE))","v":""},{"$f":"IF(AF6<5,\"\",VLOOKUP(5,B6:N65,10,FALSE))","v":""},null,null,4,{"$f":"IF(AK6<4,\"\",VLOOKUP(4,U6:W64,2,FALSE))","v":""},{"$f":"IF(AK6<4,\"\",VLOOKUP(4,U6:W64,3,FALSE))","v":""},null,null,null,null,null,null,null,null,null,null,null,null,"KAČEROV I."]
[null,null,null,null,null,{"$f":"SUM(F6:F10)","v":0},{"$f":"SUM(G6:G10)","v":0},{"$f":"SUM(H6:H10)","v":0},{"$f":"SUM(I6:I10)","v":0},{"$f":"SUM(J6:J10)","v":0},null,{"$f":"MAX(F11:J11)","v":0},null,null,{"$f":"SUM(F11:J11)","v":0},{"$f":"MAX(F11:J11)+0.01","v":0.01},{"$f":"IF(F6=\"\",\"\",SUM(O11*1000)+P11)","v":""},null,null,null,null,null,null,null,null,null,null,null,null,null,null,null,6,{"$f":"IF(AF6<6,\"\",VLOOKUP(6,B6:N65,4,FALSE))","v":""},{"$f":"IF(AF6<6,\"\",VLOOKUP(6,B6:N65,10,FALSE))","v":""},null,null,5,{"$f":"IF(AK6<5,\"\",VLOOKUP(5,U6:W64,2,FALSE))","v":""},{"$f":"IF(AK6<5,\"\",VLOOKUP(5,U6:W64,3,FALSE))","v":""}]
[null,{"$f":"IF(F12=\"\",\"\",N12)","v":""},2,"ŘEPY II.",null,null,null,null,null,null,{"$f":"SUM(F12:J12)","v":0},0,{"$f":"SUM(K12*1000)+L12+0.45","v":0.45},{"$f":"IF(F12=\"\",\"\",RANK(M12,M6:M65,0))","v":""},null,null,null,{"$f":"IF(F12=\"\",\"\",RANK(Q17,Q11:Q65,0))","v":""},null,null,{"$f":"IF(R12=\"\",\"\",R12)","v":""},{"$f":"IF(D12=\"\",\"\",D12)","v":"ŘEPY II."},{"$f":"IF(O17=\"\",\"\",O17)","v":0},null,null,null,null,null,null,null,null,null,7,{"$f":"IF(AF6<7,\"\",VLOOKUP(7,B6:N65,4,FALSE))","v":""},{"$f":"IF(AF6<7,\"\",VLOOKUP(7,B6:N65,10,FALSE))","v":""},null,null,6,{"$f":"IF(AK6<6,\"\",VLOOKUP(6,U6:W64,2,FALSE))","v":""},{"$f":"IF(AK6<6,\"\",VLOOKUP(6,U6:W64,3,FALSE))","v":""}]
[null,{"$f":"IF(F13=\"\",\"\",N13)","v":""},null,null,null,null,null,null,null,null,{"$f":"SUM(F13:J13)","v":0},0,{"$f":"SUM(K13*1000)+L13+0.44","v":0.44},{"$f":"IF(F13=\"\",\"\",RANK(M13,M6:M65,0))","v":""},null,null,null,null,null,null,null,null,null,null,null,null,null,null,null,null,null,null,8,{"$f":"IF(AF6<8,\"\",VLOOKUP(8,B6:N65,4,FALSE))","v":""},{"$f":"IF(AF6<8,\"\",VLOOKUP(8,B6:N65,10,FALSE))","v":""},null,null,7,{"$f":"IF(AK6<7,\"\",VLOOKUP(7,U6:W64,2,FALSE))","v":""},{"$f":"IF(AK6<7,\"\",VLOOKUP(7,U6:W64,3,FALSE))","v":""}]
[null,{"$f":"IF(F14=\"\",\"\",N14)","v":""},null,null,null,null,null,null,null,null,{"$f":"SUM(F14:J14)","v":0},0,{"$f":"SUM(K14*1000)+L14+0.43","v":0.43},{"$f":"IF(F14=\"\",\"\",RANK(M14,M6:M65,0))","v":""},null,null,null,null,null,null,null,null,null,null,null,null,null,null,null,null,null,null,9,{"$f":"IF(AF6<9,\"\",VLOOKUP(9,B6:N65,4,FALSE))","v":""},{"$f":"IF(AF6<9,\"\",VLOOKUP(9,B6:N65,10,FALSE))","v":""},null,null,8,{"$f":"IF(AK6<8,\"\",VLOOKUP(8,U6:W64,2,FALSE))","v":""},{"$f":"IF(AK6<8,\"\",VLOOKUP(8,U6:W64,3,FALSE))","v":""}]
[null,{"$f":"IF(F15=\"\",\"\",N15)","v":""},null,null,null,null,null,null,null,null,{"$f":"SUM(F15:J15)","v":0},0,{"$f":"SUM(K15*1000)+L15+0.42","v":0.42},{"$f":"IF(F15=\"\",\"\",RANK(M15,M6:M65,0))","v":""},null,null,null,null,null,null,null,null,null,null,null,null,null,null,null,null,null,null,10,{"$f":"IF(AF6<10,\"\",VLOOKUP(10,B6:N65,4,FALSE))","v":""},{"$f":"IF(AF6<10,\"\",VLOOKUP(10,B6:N65,10,FALSE))","v":""},null,null,9,{"$f":"IF(AK6<9,\"\",VLOOKUP(9,U6:W64,2,FALSE))","v":""},{"$f":"IF(AK6<9,\"\",VLOOKUP(9,U6:W64,3,FALSE))","v":""}]
[null,{"$f":"IF(F16=\"\",\"\",N16)","v":""},null,null,null,null,null,null,null,null,{"$f":"SUM(F16:J16)","v":0},0,{"$f":"SUM(K16*1000)+L16+0.41","v":0.41},{"$f":"IF(F16=\"\",\"\",RANK(M16,M6:M65,0))","v":""},null,null,null,null,null,null,null,null,null,null,null,null,null,null,null,null,null,null,11,{"$f":"IF(AF6<11,\"\",VLOOKUP(11,B6:N65,4,FALSE))","v":""},{"$f":"IF(AF6<11,\"\",VLOOKUP(11,B6:N65,10,FALSE))","v":""},null,null,10,{"$f":"IF(AK6<10,\"\",VLOOKUP(10,U6:W64,2,FALSE))","v":""},{"$f":"IF(AK6<10,\"\",VLOOKUP(10,U6:W64,3,FALSE))","v":""}]
[null,null,null,null,null,{"$f":"SUM(F12:F16)","v":0},{"$f":"SUM(G12:G16)","v":0},{"$f":"SUM(H12:H16)","v":0},{"$f":"SUM(I12:I16)","v":0},{"$f":"SUM(J12:J16)","v":0},null,null,null,null,{"$f":"SUM(F17:J17)","v":0},{"$f":"MAX(F17:J17)+0.009","v":8.9999999999999993E-3},{"$f":"IF(F12=\"\",\"\",SUM(O17*1000)+P17)","v":""},null,null,null,null,null,null,null,null,null,null,null,{"$f":"SUM(O11,O17)","v":0},null,null,null,12,{"$f":"IF(AF6<12,\"\",VLOOKUP(12,B6:N65,4,FALSE))","v":""},{"$f":"IF(AF6<12,\"\",VLOOKUP(12,B6:N65,10,FALSE))","v":""}]
[null,{"$f":"IF(F18=\"\",\"\",N18)","v":""},3,"KAČEROV I.",null,null,null,null,null,null,{"$f":"SUM(F18:J18)","v":0},{"$f":"MAX(F18:J18)","v":0},{"$f":"SUM(K18*1000)+L18+0.4","v":0.4},{"$f":"IF(F18=\"\",\"\",RANK(M18,M6:M65,0))","v":""},null,null,null,{"$f":"IF(F18=\"\",\"\",RANK(Q23,Q11:Q65,0))","v":""},null,{"$f":"IF(F18=\"\",\"\",RANK(AA18,AA6:AA64,0))","v":""},{"$f":"IF(R18=\"\",\"\",R18)","v":""},{"$f":"IF(D18=\"\",\"\",D18)","v":"KAČEROV I."},{"$f":"IF(O23=\"\",\"\",O23)","v":0},{"$f":"IF(V18=\"HOSTIVAŘ I.\",\"GARÁŽ HOSTIVAŘ\",IF(V18=\"VRŠOVICE I.\",\"GARÁŽ VRŠOVICE\",IF(V18=\"KLÍČOV I.\",\"GARÁŽ KLÍČOV\",IF(V18=\"ŘEPY I.\",\"GARÁŽ ŘEPY\",IF(V18=\"KAČEROV I.\",\"GARÁŽ KAČEROV\",\"\")))))","v":"GARÁŽ KAČEROV"},{"$f":"MAX(F23:J23,F29:J29)+0.04","v":0.04},{"$f":"SUM(O23,O29)*1000","v":0},{"$f":"SUM(Y18:Z18)","v":0.04},{"$f":"IF(AC29=\"\",\"\",AC29)","v":0},null,{"$f":"IF(T18=\"\",\"\",T18)","v":""},null,null,13,{"$f":"IF(AF6<13,\"\",VLOOKUP(13,B6:N65,4,FALSE))","v":""},{"$f":"IF(AF6<13,\"\",VLOOKUP(13,B6:N65,10,FALSE))","v":""},null,{"$f":"COUNT(T6:T64)","v":0},"POŘEDÍ GARÁŽÍ"]
[null,{"$f":"IF(F19=\"\",\"\",N19)","v":""},null,null,null,null,null,null,null,null,{"$f":"SUM(F19:J19)","v":0},{"$f":"MAX(F19:J19)","v":0},{"$f":"SUM(K19*1000)+L19+0.39","v":0.39},{"$f":"IF(F19=\"\",\"\",RANK(M19,M6:M65,0))","v":""},null,null,null,null,null,null,null,null,null,null,null,null,null,null,null,null,null,null,14,{"$f":"IF(AF6<14,\"\",VLOOKUP(14,B6:N65,4,FALSE))","v":""},{"$f":"IF(AF6<14,\"\",VLOOKUP(14,B6:N65,10,FALSE))","v":""},null,null,1,{"$f":"IF(AK18<1,\"\",VLOOKUP(1,T6:AB64,5,FALSE))","v":""},{"$f":"IF(AK18<1,\"\",VLOOKUP(1,T6:AB64,9,FALSE))","v":""}]
[null,{"$f":"IF(F20=\"\",\"\",N20)","v":""},null,null,null,null,null,null,null,null,{"$f":"SUM(F20:J20)","v":0},{"$f":"MAX(F20:J20)","v":0},{"$f":"SUM(K20*1000)+L20+0.38","v":0.38},{"$f":"IF(F20=\"\",\"\",RANK(M20,M6:M65,0))","v":""},null,null,null,null,null,null,null,null,null,null,null,null,null,null,null,null,null,null,15,{"$f":"IF(AF6<15,\"\",VLOOKUP(15,B6:N65,4,FALSE))","v":""},{"$f":"IF(AF6<15,\"\",VLOOKUP(15,B6:N65,10,FALSE))","v":""},null,null,2,{"$f":"IF(AK18<2,\"\",VLOOKUP(2,T6:AB64,5,FALSE))","v":""},{"$f":"IF(AK18<2,\"\",VLOOKUP(2,T6:AB64,9,FALSE))","v":""}]
[null,{"$f":"IF(F21=\"\",\"\",N21)","v":""},null,null,null,null,null,null,null,null,{"$f":"SUM(F21:J21)","v":0},{"$f":"MAX(F21:J21)","v":0},{"$f":"SUM(K21*1000)+L21+0.37","v":0.37},{"$f":"IF(F21=\"\",\"\",RANK(M21,M6:M65,0))","v":""},null,null,null,null,null,null,null,null,null,null,null,null,null,null,null,null,null,null,16,{"$f":"IF(AF6<16,\"\",VLOOKUP(16,B6:N65,4,FALSE))","v":""},{"$f":"IF(AF6<16,\"\",VLOOKUP(16,B6:N65,10,FALSE))","v":""},null,null,3,{"$f":"IF(AK18<3,\"\",VLOOKUP(3,T6:AB64,5,FALSE))","v":""},{"$f":"IF(AK18<3,\"\",VLOOKUP(3,T6:AB64,9,FALSE))","v":""}]
[null,{"$f":"IF(F22=\"\",\"\",N22)","v":""},null,null,null,null,null,null,null,null,{"$f":"SUM(F22:J22)","v":0},{"$f":"MAX(F22:J22)","v":0},{"$f":"SUM(K22*1000)+L22+0.36","v":0.36},{"$f":"IF(F22=\"\",\"\",RANK(M22,M6:M65,0))","v":""},null,null,null,null,null,null,null,null,null,null,null,null,null,null,null,null,null,null,17,{"$f":"IF(AF6<17,\"\",VLOOKUP(17,B6:N65,4,FALSE))","v":""},{"$f":"IF(AF6<17,\"\",VLOOKUP(17,B6:N65,10,FALSE))","v":""},null,null,4,{"$f":"IF(AK18<4,\"\",VLOOKUP(4,T6:AB64,5,FALSE))","v":""},{"$f":"IF(AK18<4,\"\",VLOOKUP(4,T6:AB64,9,FALSE))","v":""}]
[null,null,null,null,null,{"$f":"SUM(F18:F22)","v":0},{"$f":"SUM(G18:G22)","v":0},{"$f":"SUM(H18:H22)","v":0},{"$f":"SUM(I18:I22)","v":0},{"$f":"SUM(J18:J22)","v":0},null,null,null,null,{"$f":"SUM(F23:J23)","v":0},{"$f":"MAX(F23:J23)+0.008","v":8.0000000000000002E-3},{"$f":"IF(F18=\"\",\"\",SUM(O23*1000)+P23)","v":""},null,null,null,null,null,null,null,null,null,null,null,null,null,null,null,18,{"$f":"IF(AF6<18,\"\",VLOOKUP(18,B6:N65,4,FALSE))","v":""},{"$f":"IF(AF6<18,\"\",VLOOKUP(18,B6:N65,10,FALSE))","v":""},null,null,5,{"$f":"IF(AK18<5,\"\",VLOOKUP(5,T6:AB64,5,FALSE))","v":""},{"$f":"IF(AK18<5,\"\",VLOOKUP(5,T6:AB64,9,FALSE))","v":""}]
[null,{"$f":"IF(F24=\"\",\"\",N24)","v":""},4,"KAČEROV II.",null,null,null,null,null,null,{"$f":"SUM(F24:J24)","v":0},{"$f":"MAX(F24:J24)","v":0},{"$f":"SUM(K24*1000)+L24+0.35","v":0.35},{"$f":"IF(F24=\"\",\"\",RANK(M24,M6:M65,0))","v":""},null,null,null,{"$f":"IF(F24=\"\",\"\",RANK(Q29,Q11:Q65,0))","v":""},null,null,{"$f":"IF(R24=\"\",\"\",R24)","v":""},{"$f":"IF(D24=\"\",\"\",D24)","v":"KAČEROV II."},{"$f":"IF(O29=\"\",\"\",O29)","v":0},null,null,null,null,null,null,null,null,null,19,{"$f":"IF(AF6<19,\"\",VLOOKUP(19,B6:N65,4,FALSE))","v":""},{"$f":"IF(AF6<19,\"\",VLOOKUP(19,B6:N65,10,FALSE))","v":""}]
[null,{"$f":"IF(F25=\"\",\"\",N25)","v":""},null,null,null,null,null,null,null,null,{"$f":"SUM(F25:J25)","v":0},{"$f":"MAX(F25:J25)","v":0},{"$f":"SUM(K25*1000)+L25+0.34","v":0.34},{"$f":"IF(F25=\"\",\"\",RANK(M25,M6:M65,0))","v":""},null,null,null,null,null,null,null,null,null,null,null,null,null,null,null,null,null,null,20,{"$f":"IF(AF6<20,\"\",VLOOKUP(20,B6:N65,4,FALSE))","v":""},{"$f":"IF(AF6<20,\"\",VLOOKUP(20,B6:N65,10,FALSE))","v":""}]
[null,{"$f":"IF(F26=\"\",\"\",N26)","v":""},null,null,null,null,null,null,null,null,{"$f":"SUM(F26:J26)","v":0},{"$f":"MAX(F26:J26)","v":0},{"$f":"SUM(K26*1000)+L26+0.33","v":0.33},{"$f":"IF(F26=\"\",\"\",RANK(M26,M6:M65,0))","v":""},null,null,null,null,null,null,null,null,null,null,null,null,null,null,null,null,null,null,21,{"$f":"IF(AF6<21,\"\",VLOOKUP(21,B6:N65,4,FALSE))","v":""},{"$f":"IF(AF6<21,\"\",VLOOKUP(21,B6:N65,10,FALSE))","v":""}]
[null,{"$f":"IF(F27=\"\",\"\",N27)","v":""},null,null,null,null,null,null,null,null,{"$f":"SUM(F27:J27)","v":0},{"$f":"MAX(F27:J27)","v":0},{"$f":"SUM(K27*1000)+L27+0.32","v":0.32},{"$f":"IF(F27=\"\",\"\",RANK(M27,M6:M65,0))","v":""},null,null,null,null,null,null,null,null,null,null,null,null,null,null,null,null,null,null,22,{"$f":"IF(AF6<22,\"\",VLOOKUP(22,B6:N65,4,FALSE))","v":""},{"$f":"IF(AF6<22,\"\",VLOOKUP(22,B6:N65,10,FALSE))","v":""}]
[null,{"$f":"IF(F28=\"\",\"\",N28)","v":""},null,null,null,null,null,null,null,null,{"$f":"SUM(F28:J28)","v":0},{"$f":"MAX(F28:J28)","v":0},{"$f":"SUM(K28*1000)+L28+0.31","v":0.31},{"$f":"IF(F28=\"\",\"\",RANK(M28,M6:M65,0))","v":""},null,null,null,null,null,null,null,null,null,null,null,null,null,null,null,null,null,null,23,{"$f":"IF(AF6<23,\"\",VLOOKUP(23,B6:N65,4,FALSE))","v":""},{"$f":"IF(AF6<23,\"\",VLOOKUP(23,B6:N65,10,FALSE))","v":""}]
[null,null,null,null,null,{"$f":"SUM(F24:F28)","v":0},{"$f":"SUM(G24:G28)","v":0},{"$f":"SUM(H24:H28)","v":0},{"$f":"SUM(I24:I28)","v":0},{"$f":"SUM(J24:J28)","v":0},null,null,null,null,{"$f":"SUM(F29:J29)","v":0},{"$f":"MAX(F29:J29)+0.007","v":7.0000000000000001E-3},{"$f":"IF(F24=\"\",\"\",SUM(O29*1000)+P29)","v":""},null,null,null,null,null,null,null,null,null,null,null,{"$f":"SUM(O23,O29)","v":0},null,null,null,24,{"$f":"IF(AF6<24,\"\",VLOOKUP(24,B6:N65,4,FALSE))","v":""},{"$f":"IF(AF6<24,\"\",VLOOKUP(24,B6:N65,10,FALSE))","v":""}]
[null,{"$f":"IF(F30=\"\",\"\",N30)","v":""},5,"HOSTIVAŘ I.",null,null,null,null,null,null,{"$f":"SUM(F30:J30)","v":0},{"$f":"MAX(F30:J30)","v":0},{"$f":"SUM(K30*1000)+L30+0.3","v":0.3},{"$f":"IF(F30=\"\",\"\",RANK(M30,M6:M65,0))","v":""},null,null,null,{"$f":"IF(F30=\"\",\"\",RANK(Q35,Q11:Q65,0))","v":""},null,{"$f":"IF(F30=\"\",\"\",RANK(AA30,AA6:AA64,0))","v":""},{"$f":"IF(R30=\"\",\"\",R30)","v":""},{"$f":"IF(D30=\"\",\"\",D30)","v":"HOSTIVAŘ I."},{"$f":"IF(O35=\"\",\"\",O35)","v":0},{"$f":"IF(V30=\"HOSTIVAŘ I.\",\"GARÁŽ HOSTIVAŘ\",IF(V30=\"VRŠOVICE I.\",\"GARÁŽ VRŠOVICE\",IF(V30=\"KLÍČOV I.\",\"GARÁŽ KLÍČOV\",IF(V30=\"ŘEPY I.\",\"GARÁŽ ŘEPY\",IF(V30=\"KAČEROV I.\",\"GARÁŽ KAČEROV\",\"\")))))","v":"GARÁŽ HOSTIVAŘ"},{"$f":"MAX(F35:J35,F41:J41)+0.03","v":0.03},{"$f":"SUM(O35,O41)*1000","v":0},{"$f":"SUM(Y30:Z30)","v":0.03},{"$f":"IF(AC41=\"\",\"\",AC41)","v":0},null,{"$f":"IF(T30=\"\",\"\",T30)","v":""},null,null,25,{"$f":"IF(AF6<25,\"\",VLOOKUP(25,B6:N65,4,FALSE))","v":""},{"$f":"IF(AF6<25,\"\",VLOOKUP(25,B6:N65,10,FALSE))","v":""}]
[null,{"$f":"IF(F31=\"\",\"\",N31)","v":""},null,null,null,null,null,null,null,null,{"$f":"SUM(F31:J31)","v":0},{"$f":"MAX(F31:J31)","v":0},{"$f":"SUM(K31*1000)+L31+0.29","v":0.28999999999999998},{"$f":"IF(F31=\"\",\"\",RANK(M31,M6:M65,0))","v":""},null,null,null,null,null,null,null,null,null,null,null,null,null,null,null,null,null,null,26,{"$f":"IF(AF6<26,\"\",VLOOKUP(26,B6:N65,4,FALSE))","v":""},{"$f":"IF(AF6<26,\"\",VLOOKUP(26,B6:N65,10,FALSE))","v":""}]
[null,{"$f":"IF(F32=\"\",\"\",N32)","v":""},null,null,null,null,null,null,null,null,{"$f":"SUM(F32:J32)","v":0},{"$f":"MAX(F32:J32)","v":0},{"$f":"SUM(K32*1000)+L32+0.28","v":0.28000000000000003},{"$f":"IF(F32=\"\",\"\",RANK(M32,M6:M65,0))","v":""},null,null,null,null,null,null,null,null,null,null,null,null,null,null,null,null,null,null,27,{"$f":"IF(AF6<27,\"\",VLOOKUP(27,B6:N65,4,FALSE))","v":""},{"$f":"IF(AF6<27,\"\",VLOOKUP(27,B6:N65,10,FALSE))","v":""}]
[null,{"$f":"IF(F33=\"\",\"\",N33)","v":""},null,null,null,null,null,null,null,null,{"$f":"SUM(F33:J33)","v":0},{"$f":"MAX(F33:J33)","v":0},{"$f":"SUM(K33*1000)+L33+0.27","v":0.27},{"$f":"IF(F33=\"\",\"\",RANK(M33,M6:M65,0))","v":""},null,null,null,null,null,null,null,null,null,null,null,null,null,null,null,null,null,null,28,{"$f":"IF(AF6<28,\"\",VLOOKUP(28,B6:N65,4,FALSE))","v":""},{"$f":"IF(AF6<28,\"\",VLOOKUP(28,B6:N65,10,FALSE))","v":""}]
[null,{"$f":"IF(F34=\"\",\"\",N34)","v":""},null,null,null,null,null,null,null,null,{"$f":"SUM(F34:J34)","v":0},{"$f":"MAX(F34:J34)","v":0},{"$f":"SUM(K34*1000)+L34+0.26","v":0.26},{"$f":"IF(F34=\"\",\"\",RANK(M34,M6:M65,0))","v":""},null,null,null,null,null,null,null,null,null,null,null,null,null,null,null,null,null,null,29,{"$f":"IF(AF6<29,\"\",VLOOKUP(29,B6:N65,4,FALSE))","v":""},{"$f":"IF(AF6<29,\"\",VLOOKUP(29,B6:N65,10,FALSE))","v":""}]
[null,null,null,null,null,{"$f":"SUM(F30:F34)","v":0},{"$f":"SUM(G30:G34)","v":0},{"$f":"SUM(H30:H34)","v":0},{"$f":"SUM(I30:I34)","v":0},{"$f":"SUM(J30:J34)","v":0},null,null,null,null,{"$f":"SUM(F35:J35)","v":0},{"$f":"MAX(F35:J35)+0.006","v":6.0000000000000001E-3},{"$f":"IF(F30=\"\",\"\",SUM(O35*1000)+P35)","v":""},null,null,null,null,null,null,null,null,null,null,null,null,null,null,null,30,{"$f":"IF(AF6<30,\"\",VLOOKUP(30,B6:N65,4,FALSE))","v":""},{"$f":"IF(AF6<30,\"\",VLOOKUP(30,B6:N65,10,FALSE))","v":""}]
[null,{"$f":"IF(F36=\"\",\"\",N36)","v":""},6,"HOSTIVAŘ II.",null,null,null,null,null,null,{"$f":"SUM(F36:J36)","v":0},{"$f":"MAX(F36:J36)","v":0},{"$f":"SUM(K36*1000)+L36+0.25","v":0.25},{"$f":"IF(F36=\"\",\"\",RANK(M36,M6:M65,0))","v":""},null,null,null,{"$f":"IF(F36=\"\",\"\",RANK(Q41,Q11:Q65,0))","v":""},null,null,{"$f":"IF(R36=\"\",\"\",R36)","v":""},{"$f":"IF(D36=\"\",\"\",D36)","v":"HOSTIVAŘ II."},{"$f":"IF(O41=\"\",\"\",O41)","v":0},null,null,null,null,null,null,null,null,null,31,{"$f":"IF(AF6<31,\"\",VLOOKUP(31,B6:N65,4,FALSE))","v":""},{"$f":"IF(AF6<31,\"\",VLOOKUP(31,B6:N65,10,FALSE))","v":""}]
[null,{"$f":"IF(F37=\"\",\"\",N37)","v":""},null,null,null,null,null,null,null,null,{"$f":"SUM(F37:J37)","v":0},{"$f":"MAX(F37:J37)","v":0},{"$f":"SUM(K37*1000)+L37+0.24","v":0.24},{"$f":"IF(F37=\"\",\"\",RANK(M37,M6:M65,0))","v":""},null,null,null,null,null,null,null,null,null,null,null,null,null,null,null,null,null,null,32,{"$f":"IF(AF6<32,\"\",VLOOKUP(32,B6:N65,4,FALSE))","v":""},{"$f":"IF(AF6<32,\"\",VLOOKUP(32,B6:N65,10,FALSE))","v":""}]
[null,{"$f":"IF(F38=\"\",\"\",N38)","v":""},null,null,null,null,null,null,null,null,{"$f":"SUM(F38:J38)","v":0},{"$f":"MAX(F38:J38)","v":0},{"$f":"SUM(K38*1000)+L38+0.23","v":0.23},{"$f":"IF(F38=\"\",\"\",RANK(M38,M6:M65,0))","v":""},null,null,null,null,null,null,null,null,null,null,null,null,null,null,null,null,null,null,33,{"$f":"IF(AF6<33,\"\",VLOOKUP(33,B6:N65,4,FALSE))","v":""},{"$f":"IF(AF6<33,\"\",VLOOKUP(33,B6:N65,10,FALSE))","v":""}]
[null,{"$f":"IF(F39=\"\",\"\",N39)","v":""},null,null,null,null,null,null,null,null,{"$f":"SUM(F39:J39)","v":0},{"$f":"MAX(F39:J39)","v":0},{"$f":"SUM(K39*1000)+L39+0.21","v":0.21},{"$f":"IF(F39=\"\",\"\",RANK(M39,M6:M65,0))","v":""},null,null,null,null,null,null,null,null,null,null,null,null,null,null,null,null,null,null,34,{"$f":"IF(AF6<34,\"\",VLOOKUP(34,B6:N65,4,FALSE))","v":""},{"$f":"IF(AF6<34,\"\",VLOOKUP(34,B6:N65,10,FALSE))","v":""}]
[null,{"$f":"IF(F40=\"\",\"\",N40)","v":""},null,null,null,null,null,null,null,null,{"$f":"SUM(F40:J40)","v":0},{"$f":"MAX(F40:J40)","v":0},{"$f":"SUM(K40*1000)+L40+0.2","v":0.2},{"$f":"IF(F40=\"\",\"\",RANK(M40,M6:M65,0))","v":""},null,null,null,null,null,null,null,null,null,null,null,null,null,null,null,null,null,null,35,{"$f":"IF(AF6<35,\"\",VLOOKUP(35,B6:N65,4,FALSE))","v":""},{"$f":"IF(AF6<35,\"\",VLOOKUP(35,B6:N65,10,FALSE))","v":""}]
[null,null,null,null,null,{"$f":"SUM(F36:F40)","v":0},{"$f":"SUM(G36:G40)","v":0},{"$f":"SUM(H36:H40)","v":0},{"$f":"SUM(I36:I40)","v":0},{"$f":"SUM(J36:J40)","v":0},null,null,null,null,{"$f":"SUM(F41:J41)","v":0},{"$f":"MAX(F41:J41)+0.005","v":5.0000000000000001E-3},{"$f":"IF(F36=\"\",\"\",SUM(O41*1000)+P41)","v":""},null,null,null,null,null,null,null,null,null,null,null,{"$f":"SUM(O35,O41)","v":0},null,null,null,36,{"$f":"IF(AF6<36,\"\",VLOOKUP(36,B6:N65,4,FALSE))","v":""},{"$f":"IF(AF6<36,\"\",VLOOKUP(36,B6:N65,10,FALSE))","v":""}]
[null,{"$f":"IF(F42=\"\",\"\",N42)","v":""},7,"VRŠOVICE I.",null,null,null,null,null,null,{"$f":"SUM(F42:J42)","v":0},{"$f":"MAX(F42:J42)","v":0},{"$f":"SUM(K42*1000)+L42+0.19","v":0.19},{"$f":"IF(F42=\"\",\"\",RANK(M42,M6:M65,0))","v":""},null,null,null,{"$f":"IF(F42=\"\",\"\",RANK(Q47,Q11:Q65,0))","v":""},null,{"$f":"IF(F42=\"\",\"\",RANK(AA42,AA6:AA64,0))","v":""},{"$f":"IF(R42=\"\",\"\",R42)","v":""},{"$f":"IF(D42=\"\",\"\",D42)","v":"VRŠOVICE I."},{"$f":"IF(O47=\"\",\"\",O47)","v":0},{"$f":"IF(V42=\"HOSTIVAŘ I.\",\"GARÁŽ HOSTIVAŘ\",IF(V42=\"VRŠOVICE I.\",\"GARÁŽ VRŠOVICE\",IF(V42=\"KLÍČOV I.\",\"GARÁŽ KLÍČOV\",IF(V42=\"ŘEPY I.\",\"GARÁŽ ŘEPY\",IF(V42=\"KAČEROV I.\",\"GARÁŽ KAČEROV\",\"\")))))","v":"GARÁŽ VRŠOVICE"},{"$f":"MAX(F47:J47,F53:J53)+0.02","v":0.02},{"$f":"SUM(O47,O53)*1000","v":0},{"$f":"SUM(Y42:Z42)","v":0.02},{"$f":"IF(AC53=\"\",\"\",AC53)","v":0},null,{"$f":"IF(T42=\"\",\"\",T42)","v":""},null,null,37,{"$f":"IF(AF6<37,\"\",VLOOKUP(37,B6:N65,4,FALSE))","v":""},{"$f":"IF(AF6<37,\"\",VLOOKUP(37,B6:N65,10,FALSE))","v":""},null,null,null,null,null,null,null,null,null,null,null,null,null,null,null,null,null,"HOSTIVAŘ I."]
[null,{"$f":"IF(F43=\"\",\"\",N43)","v":""},null,null,null,null,null,null,null,null,{"$f":"SUM(F43:J43)","v":0},{"$f":"MAX(F43:J43)","v":0},{"$f":"SUM(K43*1000)+L43+0.18","v":0.18},{"$f":"IF(F43=\"\",\"\",RANK(M43,M6:M65,0))","v":""},null,null,null,null,null,null,null,null,null,null,null,null,null,null,null,null,null,null,38,{"$f":"IF(AF6<38,\"\",VLOOKUP(38,B6:N65,4,FALSE))","v":""},{"$f":"IF(AF6<38,\"\",VLOOKUP(38,B6:N65,10,FALSE))","v":""},null,null,null,null,null,null,null,null,null,null,null,null,null,null,null,null,null,"VRŠOVICE I."]
[null,{"$f":"IF(F44=\"\",\"\",N44)","v":""},null,null,null,null,null,null,null,null,{"$f":"SUM(F44:J44)","v":0},{"$f":"MAX(F44:J44)","v":0},{"$f":"SUM(K44*1000)+L44+0.17","v":0.17},{"$f":"IF(F44=\"\",\"\",RANK(M44,M6:M65,0))","v":""},null,null,null,null,null,null,null,null,null,null,null,null,null,null,null,null,null,null,39,{"$f":"IF(AF6<39,\"\",VLOOKUP(39,B6:N65,4,FALSE))","v":""},{"$f":"IF(AF6<39,\"\",VLOOKUP(39,B6:N65,10,FALSE))","v":""},null,null,null,null,null,null,null,null,null,null,null,null,null,null,null,null,null,"KLÍČOV I."]
[null,{"$f":"IF(F45=\"\",\"\",N45)","v":""},null,null,null,null,null,null,null,null,{"$f":"SUM(F45:J45)","v":0},{"$f":"MAX(F45:J45)","v":0},{"$f":"SUM(K45*1000)+L45+0.16","v":0.16},{"$f":"IF(F45=\"\",\"\",RANK(M45,M6:M65,0))","v":""},null,null,null,null,null,null,null,null,null,null,null,null,null,null,null,null,null,null,40,{"$f":"IF(AF6<40,\"\",VLOOKUP(40,B6:N65,4,FALSE))","v":""},{"$f":"IF(AF6<40,\"\",VLOOKUP(40,B6:N65,10,FALSE))","v":""},null,null,null,null,null,null,null,null,null,null,null,null,null,null,null,null,null,"ŘEPY I."]
[null,{"$f":"IF(F46=\"\",\"\",N46)","v":""},null,null,null,null,null,null,null,null,{"$f":"SUM(F46:J46)","v":0},{"$f":"MAX(F46:J46)","v":0},{"$f":"SUM(K46*1000)+L46+0.15","v":0.15},{"$f":"IF(F46=\"\",\"\",RANK(M46,M6:M65,0))","v":""},null,null,null,null,null,null,null,null,null,null,null,null,null,null,null,null,null,null,41,{"$f":"IF(AF6<41,\"\",VLOOKUP(41,B6:N65,4,FALSE))","v":""},{"$f":"IF(AF6<41,\"\",VLOOKUP(41,B6:N65,10,FALSE))","v":""},null,null,null,null,null,null,null,null,null,null,null,null,null,null,null,null,null,"KAČEROV I."]
[null,null,null,null,null,{"$f":"SUM(F42:F46)","v":0},{"$f":"SUM(G42:G46)","v":0},{"$f":"SUM(H42:H46)","v":0},{"$f":"SUM(I42:I46)","v":0},{"$f":"SUM(J42:J46)","v":0},null,null,null,null,{"$f":"SUM(F47:J47)","v":0},{"$f":"MAX(F47:J47)+0.004","v":4.0000000000000001E-3},{"$f":"IF(F42=\"\",\"\",SUM(O47*1000)+P47)","v":""},null,null,null,null,null,null,null,null,null,null,null,null,null,null,null,42,{"$f":"IF(AF6<42,\"\",VLOOKUP(42,B6:N65,4,FALSE))","v":""},{"$f":"IF(AF6<42,\"\",VLOOKUP(42,B6:N65,10,FALSE))","v":""}]
[null,{"$f":"IF(F48=\"\",\"\",N48)","v":""},8,"VRŠOVICE II.",null,null,null,null,null,null,{"$f":"SUM(F48:J48)","v":0},{"$f":"MAX(F48:J48)","v":0},{"$f":"SUM(K48*1000)+L48+0.14","v":0.14000000000000001},{"$f":"IF(F48=\"\",\"\",RANK(M48,M6:M65,0))","v":""},null,null,null,{"$f":"IF(F48=\"\",\"\",RANK(Q53,Q11:Q65,0))","v":""},null,null,{"$f":"IF(R48=\"\",\"\",R48)","v":""},{"$f":"IF(D48=\"\",\"\",D48)","v":"VRŠOVICE II."},{"$f":"IF(O53=\"\",\"\",O53)","v":0},null,null,null,null,null,null,null,null,null,43,{"$f":"IF(AF6<43,\"\",VLOOKUP(43,B6:N65,4,FALSE))","v":""},{"$f":"IF(AF6<43,\"\",VLOOKUP(43,B6:N65,10,FALSE))","v":""}]
[null,{"$f":"IF(F49=\"\",\"\",N49)","v":""},null,null,null,null,null,null,null,null,{"$f":"SUM(F49:J49)","v":0},{"$f":"MAX(F49:J49)","v":0},{"$f":"SUM(K49*1000)+L49+0.13","v":0.13},{"$f":"IF(F49=\"\",\"\",RANK(M49,M6:M65,0))","v":""},null,null,null,null,null,null,null,null,null,null,null,null,null,null,null,null,null,null,44,{"$f":"IF(AF6<44,\"\",VLOOKUP(44,B6:N65,4,FALSE))","v":""},{"$f":"IF(AF6<44,\"\",VLOOKUP(44,B6:N65,10,FALSE))","v":""}]
[null,{"$f":"IF(F50=\"\",\"\",N50)","v":""},null,null,null,null,null,null,null,null,{"$f":"SUM(F50:J50)","v":0},{"$f":"MAX(F50:J50)","v":0},{"$f":"SUM(K50*1000)+L50+0.12","v":0.12},{"$f":"IF(F50=\"\",\"\",RANK(M50,M6:M65,0))","v":""},null,null,null,null,null,null,null,null,null,null,null,null,null,null,null,null,null,null,45,{"$f":"IF(AF6<45,\"\",VLOOKUP(45,B6:N65,4,FALSE))","v":""},{"$f":"IF(AF6<45,\"\",VLOOKUP(45,B6:N65,10,FALSE))","v":""}]
[null,{"$f":"IF(F51=\"\",\"\",N51)","v":""},null,null,null,null,null,null,null,null,{"$f":"SUM(F51:J51)","v":0},{"$f":"MAX(F51:J51)","v":0},{"$f":"SUM(K51*1000)+L51+0.11","v":0.11},{"$f":"IF(F51=\"\",\"\",RANK(M51,M6:M65,0))","v":""},null,null,null,null,null,null,null,null,null,null,null,null,null,null,null,null,null,null,46,{"$f":"IF(AF6<46,\"\",VLOOKUP(46,B6:N65,4,FALSE))","v":""},{"$f":"IF(AF6<46,\"\",VLOOKUP(46,B6:N65,10,FALSE))","v":""}]
[null,{"$f":"IF(F52=\"\",\"\",N52)","v":""},null,null,null,null,null,null,null,null,{"$f":"SUM(F52:J52)","v":0},{"$f":"MAX(F52:J52)","v":0},{"$f":"SUM(K52*1000)+L52+0.1","v":0.1},{"$f":"IF(F52=\"\",\"\",RANK(M52,M6:M65,0))","v":""},null,null,null,null,null,null,null,null,null,null,null,null,null,null,null,null,null,null,47,{"$f":"IF(AF6<47,\"\",VLOOKUP(47,B6:N65,4,FALSE))","v":""},{"$f":"IF(AF6<47,\"\",VLOOKUP(47,B6:N65,10,FALSE))","v":""}]
[null,null,null,null,null,{"$f":"SUM(F48:F52)","v":0},{"$f":"SUM(G48:G52)","v":0},{"$f":"SUM(H48:H52)","v":0},{"$f":"SUM(I48:I52)","v":0},{"$f":"SUM(J48:J52)","v":0},null,null,null,null,{"$f":"SUM(F53:J53)","v":0},{"$f":"MAX(F53:J53)+0.003","v":3.0000000000000001E-3},{"$f":"IF(F48=\"\",\"\",SUM(O53*1000)+P53)","v":""},null,null,null,null,null,null,null,null,null,null,null,{"$f":"SUM(O47,O53)","v":0},null,null,null,48,{"$f":"IF(AF6<48,\"\",VLOOKUP(48,B6:N65,4,FALSE))","v":""},{"$f":"IF(AF6<48,\"\",VLOOKUP(48,B6:N65,10,FALSE))","v":""}]
[null,{"$f":"IF(F54=\"\",\"\",N54)","v":""},9,"KLÍČOV I.",null,null,null,null,null,null,{"$f":"SUM(F54:J54)","v":0},{"$f":"MAX(F54:J54)","v":0},{"$f":"SUM(K54*1000)+L54+0.09","v":0.09},{"$f":"IF(F54=\"\",\"\",RANK(M54,M6:M65,0))","v":""},null,null,null,{"$f":"IF(F54=\"\",\"\",RANK(Q59,Q11:Q65,0))","v":""},null,{"$f":"IF(F54=\"\",\"\",RANK(AA54,AA6:AA64,0))","v":""},{"$f":"IF(R54=\"\",\"\",R54)","v":""},{"$f":"IF(D54=\"\",\"\",D54)","v":"KLÍČOV I."},{"$f":"IF(O59=\"\",\"\",O59)","v":0},{"$f":"IF(V54=\"HOSTIVAŘ I.\",\"GARÁŽ HOSTIVAŘ\",IF(V54=\"VRŠOVICE I.\",\"GARÁŽ VRŠOVICE\",IF(V54=\"KLÍČOV I.\",\"GARÁŽ KLÍČOV\",IF(V54=\"ŘEPY I.\",\"GARÁŽ ŘEPY\",IF(V54=\"KAČEROV I.\",\"GARÁŽ KAČEROV\",\"\")))))","v":"GARÁŽ KLÍČOV"},{"$f":"MAX(F59:J59,F65:J65)+0.01","v":0.01},{"$f":"SUM(O59,O65)*1000","v":0},{"$f":"SUM(Y54:Z54)","v":0.01},{"$f":"IF(AC65=\"\",\"\",AC65)","v":0},null,{"$f":"IF(T54=\"\",\"\",T54)","v":""},null,null,49,{"$f":"IF(AF6<49,\"\",VLOOKUP(49,B6:N65,4,FALSE))","v":""},{"$f":"IF(AF6<49,\"\",VLOOKUP(49,B6:N65,10,FALSE))","v":""}]
[null,{"$f":"IF(F55=\"\",\"\",N55)","v":""},null,null,null,null,null,null,null,null,{"$f":"SUM(F55:J55)","v":0},{"$f":"MAX(F55:J55)","v":0},{"$f":"SUM(K55*1000)+L55+0.08","v":0.08},{"$f":"IF(F55=\"\",\"\",RANK(M55,M6:M65,0))","v":""},null,null,null,null,null,null,null,null,null,null,null,null,null,null,null,null,null,null,50,{"$f":"IF(AF6<50,\"\",VLOOKUP(50,B6:N65,4,FALSE))","v":""},{"$f":"IF(AF6<50,\"\",VLOOKUP(50,B6:N65,10,FALSE))","v":""}]
[null,{"$f":"IF(F56=\"\",\"\",N56)","v":""},null,null,null,null,null,null,null,null,{"$f":"SUM(F56:J56)","v":0},{"$f":"MAX(F56:J56)","v":0},{"$f":"SUM(K56*1000)+L56+0.07","v":7.0000000000000007E-2},{"$f":"IF(F56=\"\",\"\",RANK(M56,M6:M65,0))","v":""}]
[null,{"$f":"IF(F57=\"\",\"\",N57)","v":""},null,null,null,null,null,null,null,null,{"$f":"SUM(F57:J57)","v":0},{"$f":"MAX(F57:J57)","v":0},{"$f":"SUM(K57*1000)+L57+0.06","v":0.06},{"$f":"IF(F57=\"\",\"\",RANK(M57,M6:M65,0))","v":""}]
[null,{"$f":"IF(F58=\"\",\"\",N58)","v":""},null,null,null,null,null,null,null,null,{"$f":"SUM(F58:J58)","v":0},{"$f":"MAX(F58:J58)","v":0},{"$f":"SUM(K58*1000)+L58+0.05","v":0.05},{"$f":"IF(F58=\"\",\"\",RANK(M58,M6:M65,0))","v":""}]
[null,null,null,null,null,{"$f":"SUM(F54:F58)","v":0},{"$f":"SUM(G54:G58)","v":0},{"$f":"SUM(H54:H58)","v":0},{"$f":"SUM(I54:I58)","v":0},{"$f":"SUM(J54:J58)","v":0},null,null,null,null,{"$f":"SUM(F59:J59)","v":0},{"$f":"MAX(F59:J59)+0.002","v":2E-3},{"$f":"IF(F54=\"\",\"\",SUM(O59*1000)+P59)","v":""}]
[null,{"$f":"IF(F60=\"\",\"\",N60)","v":""},10,"KLÍČOV II.",null,null,null,null,null,null,{"$f":"SUM(F60:J60)","v":0},{"$f":"MAX(F60:J60)","v":0},{"$f":"SUM(K60*1000)+L60+0.04","v":0.04},{"$f":"IF(F60=\"\",\"\",RANK(M60,M6:M65,0))","v":""},null,null,null,{"$f":"IF(F60=\"\",\"\",RANK(Q65,Q11:Q65,0))","v":""},null,null,{"$f":"IF(R60=\"\",\"\",R60)","v":""},{"$f":"IF(D60=\"\",\"\",D60)","v":"KLÍČOV II."},{"$f":"IF(O65=\"\",\"\",O65)","v":0}]
[null,{"$f":"IF(F61=\"\",\"\",N61)","v":""},null,null,null,null,null,null,null,null,{"$f":"SUM(F61:J61)","v":0},{"$f":"MAX(F61:J61)","v":0},{"$f":"SUM(K61*1000)+L61+0.03","v":0.03},{"$f":"IF(F61=\"\",\"\",RANK(M61,M6:M65,0))","v":""}]
[null,{"$f":"IF(F62=\"\",\"\",N62)","v":""},null,null,null,null,null,null,null,null,{"$f":"SUM(F62:J62)","v":0},{"$f":"MAX(F62:J62)","v":0},{"$f":"SUM(K62*1000)+L62+0.02","v":0.02},{"$f":"IF(F62=\"\",\"\",RANK(M62,M6:M65,0))","v":""}]
[null,{"$f":"IF(F63=\"\",\"\",N63)","v":""},null,null,null,null,null,null,null,null,{"$f":"SUM(F63:J63)","v":0},{"$f":"MAX(F63:J63)","v":0},{"$f":"SUM(K63*1000)+L63+0.01","v":0.01},{"$f":"IF(F63=\"\",\"\",RANK(M63,M6:M65,0))","v":""}]
[null,{"$f":"IF(F64=\"\",\"\",N64)","v":""},null,null,null,null,null,null,null,null,{"$f":"SUM(F64:J64)","v":0},{"$f":"MAX(F64:J64)","v":0},{"$f":"SUM(K64*1000)+L64","v":0},{"$f":"IF(F64=\"\",\"\",RANK(M64,M6:M65,0))","v":""}]
[null,null,null,null,null,{"$f":"SUM(F60:F64)","v":0},{"$f":"SUM(G60:G64)","v":0},{"$f":"SUM(H60:H64)","v":0},{"$f":"SUM(I60:I64)","v":0},{"$f":"SUM(J60:J64)","v":0},null,{"$f":"MAX(L12:L64,L6:L10)","v":0},null,null,{"$f":"SUM(F65:J65)","v":0},{"$f":"MAX(F65:J65)+0.001","v":1E-3},{"$f":"IF(F60=\"\",\"\",SUM(O65*1000)+P65)","v":""},null,null,null,null,null,null,null,null,null,null,null,{"$f":"SUM(O59,O65)","v":0}]

{"sheet":"11 DRUŽSTEV","index":11,"n_rows":71,"n_cols":53,"rows_kept":71,"cut":false,"hidden":false,"merged":[[59,17,63,17],[65,17,69,17],[59,3,63,3],[59,2,63,2],[41,3,45,3],[41,2,45,2],[35,3,39,3],[35,2,39,2],[53,3,57,3],[53,2,57,2],[47,3,51,3],[47,2,51,2],[0,0,3,0],[4,2,4,3],[4,13,4,14],[4,32,4,34],[5,29,15,29],[5,2,9,2],[16,28,16,29],[17,29,27,29],[28,28,28,29],[29,29,39,29],[40,28,40,29],[41,29,51,29],[52,28,52,29],[53,29,63,29],[64,28,64,29],[17,17,21,17],[23,17,27,17],[29,17,33,17],[35,17,39,17],[41,17,45,17],[47,17,51,17],[53,17,57,17],[17,3,21,3],[11,3,15,3],[11,2,15,2],[29,3,33,3],[23,3,27,3],[29,2,33,2],[23,2,27,2],[5,37,5,39],[18,37,18,39],[2,3,2,39],[65,2,69,2],[65,3,69,3],[5,17,9,17],[11,17,15,17],[65,29,69,29],[5,3,9,3],[17,2,21,2]]}
["ZPĚT"]
[]
[null,null,null,"Sportovní turnaj v Bowlingu o pohár  ZV-OS ___ dne _. _. 2014"]
[]
[null,null,"Garáž",null,"Jméno","I.","II.","III.","IV.","V.","Body",null,null,"Jednotlivci.",null,null,null,"Družstva.",null,null,null,null,null,null,null,null,null,null,null,null,null,null,"pořadí jednotlivců"]
[null,{"$f":"IF(F6=\"\",\"\",N6)","v":""},1,"KLÍČOV I.",null,null,null,null,null,null,{"$f":"SUM(F6:J6)","v":0},{"$f":"MAX(F6:J6)","v":0},{"$f":"SUM(K6*1000)+L6+0.055","v":5.5E-2},{"$f":"IF(F6=\"\",\"\",RANK(M6,M6:M70,0))","v":""},null,null,null,{"$f":"IF(F6=\"\",\"\",RANK(Q11,Q11:Q71,0))","v":""},null,{"$f":"IF(F6=\"\",\"\",RANK(AA6,AA6:AA64,0))","v":""},{"$f":"IF(R6=\"\",\"\",R6)","v":""},{"$f":"IF(D6=\"\",\"\",D6)","v":"KLÍČOV I."},{"$f":"IF(O11=\"\",\"\",O11)","v":0},{"$f":"IF(V6=\"HOSTIVAŘ I.\",\"GARÁŽ HOSTIVAŘ\",IF(V6=\"VRŠOVICE I.\",\"GARÁŽ VRŠOVICE\",IF(V6=\"KLÍČOV I.\",\"GARÁŽ KLÍČOV\",IF(V6=\"ŘEPY I.\",\"GARÁŽ ŘEPY\",IF(V6=\"KAČEROV I.\",\"GARÁŽ KAČEROV\",\"\")))))","v":"GARÁŽ KLÍČOV"},{"$f":"MAX(F11:J11,F17:J17)+0.05","v":0.05},{"$f":"SUM(O11,O17)*1000","v":0},{"$f":"SUM(Y6:Z6)","v":0.05},{"$f":"IF(AC17=\"\",\"\",AC17)","v":0},null,{"$f":"IF(T6=\"\",\"\",T6)","v":""},null,{"$f":"COUNT(F6:F10,F12:F16,F18:F22,F24:F28,F30:F34,F36:F40,F42:F46,F48:F52,F54:F58,F60:F64,F66:F70)","v":0},1,{"$f":"IF(AF6<1,\"\",VLOOKUP(1,B6:N70,4,FALSE))","v":""},{"$f":"IF(AF6<1,\"\",VLOOKUP(1,B6:N70,10,FALSE))","v":""},null,{"$f":"COUNT(U6:U16,U18:U28,U30:U40,U42:U52,U54:U64,U66)","v":0},"POŘADÍ DRUŽSTEV",null,null,null,null,null,null,null,null,null,null,null,null,null,null,"HOSTIVAŘ I."]
[null,{"$f":"IF(F7=\"\",\"\",N7)","v":""},null,null,null,null,null,null,null,null,{"$f":"SUM(F7:J7)","v":0},0,{"$f":"SUM(K7*1000)+L7+0.054","v":5.3999999999999999E-2},{"$f":"IF(F7=\"\",\"\",RANK(M7,M6:M70,0))","v":""},null,null,null,null,null,null,null,null,null,null,null,null,null,null,null,null,null,null,{"$f":"SUM(AG6+1)","v":2},{"$f":"IF(AF6<2,\"\",VLOOKUP(2,B6:N70,4,FALSE))","v":""},{"$f":"IF(AF6<2,\"\",VLOOKUP(2,B6:N70,10,FALSE))","v":""},null,null,1,{"$f":"IF(AK6<1,\"\",VLOOKUP(1,U6:W70,2,FALSE))","v":""},{"$f":"IF(AK6<1,\"\",VLOOKUP(1,U6:W70,3,FALSE))","v":""},null,null,null,null,null,null,null,null,null,null,null,null,"VRŠOVICE I."]
[null,{"$f":"IF(F8=\"\",\"\",N8)","v":""},null,null,null,null,null,null,null,null,{"$f":"SUM(F8:J8)","v":0},0,{"$f":"SUM(K8*1000)+L8+0.053","v":5.2999999999999999E-2},{"$f":"IF(F8=\"\",\"\",RANK(M8,M6:M71,0))","v":""},null,null,null,null,null,null,null,null,null,null,null,null,null,null,null,null,null,null,{"$f":"SUM(AG7+1)","v":3},{"$f":"IF(AF6<3,\"\",VLOOKUP(3,B6:N70,4,FALSE))","v":""},{"$f":"IF(AF6<3,\"\",VLOOKUP(3,B6:N70,10,FALSE))","v":""},null,null,2,{"$f":"IF(AK6<2,\"\",VLOOKUP(2,U6:W70,2,FALSE))","v":""},{"$f":"IF(AK6<2,\"\",VLOOKUP(2,U6:W70,3,FALSE))","v":""},null,null,null,null,null,null,null,null,null,null,null,null,"KLÍČOV I."]
[null,{"$f":"IF(F9=\"\",\"\",N9)","v":""},null,null,null,null,null,null,null,null,{"$f":"SUM(F9:J9)","v":0},0,{"$f":"SUM(K9*1000)+L9+0.052","v":5.1999999999999998E-2},{"$f":"IF(F9=\"\",\"\",RANK(M9,M6:M70,0))","v":""},null,null,null,null,null,null,null,null,null,null,null,null,null,null,null,null,null,null,4,{"$f":"IF(AF6<4,\"\",VLOOKUP(4,B6:N70,4,FALSE))","v":""},{"$f":"IF(AF6<4,\"\",VLOOKUP(4,B6:N70,10,FALSE))","v":""},null,null,3,{"$f":"IF(AK6<3,\"\",VLOOKUP(3,U6:W70,2,FALSE))","v":""},{"$f":"IF(AK6<3,\"\",VLOOKUP(3,U6:W70,3,FALSE))","v":""},null,null,null,null,null,null,null,null,null,null,null,null,"ŘEPY I."]
[null,{"$f":"IF(F10=\"\",\"\",N10)","v":""},null,null,null,null,null,null,null,null,{"$f":"SUM(F10:J10)","v":0},0,{"$f":"SUM(K10*1000)+L10+0.051","v":5.0999999999999997E-2},{"$f":"IF(F10=\"\",\"\",RANK(M10,M6:M70,0))","v":""},null,null,null,null,null,null,null,null,null,null,null,null,null,null,null,null,null,null,5,{"$f":"IF(AF6<5,\"\",VLOOKUP(5,B6:N70,4,FALSE))","v":""},{"$f":"IF(AF6<5,\"\",VLOOKUP(5,B6:N70,10,FALSE))","v":""},null,null,4,{"$f":"IF(AK6<4,\"\",VLOOKUP(4,U6:W70,2,FALSE))","v":""},{"$f":"IF(AK6<4,\"\",VLOOKUP(4,U6:W70,3,FALSE))","v":""},null,null,null,null,null,null,null,null,null,null,null,null,"KAČEROV I."]
[null,null,null,null,null,{"$f":"SUM(F6:F10)","v":0},{"$f":"SUM(G6:G10)","v":0},{"$f":"SUM(H6:H10)","v":0},{"$f":"SUM(I6:I10)","v":0},{"$f":"SUM(J6:J10)","v":0},null,0,null,null,{"$f":"SUM(F11:J11)","v":0},{"$f":"MAX(F11:J11)+0.01","v":0.01},{"$f":"IF(F6=\"\",\"\",SUM(O11*1000)+P11)","v":""},null,null,null,null,null,null,null,null,null,null,null,null,null,null,null,6,{"$f":"IF(AF6<6,\"\",VLOOKUP(6,B6:N70,4,FALSE))","v":""},{"$f":"IF(AF6<6,\"\",VLOOKUP(6,B6:N70,10,FALSE))","v":""},null,null,5,{"$f":"IF(AK6<5,\"\",VLOOKUP(5,U6:W70,2,FALSE))","v":""},{"$f":"IF(AK6<5,\"\",VLOOKUP(5,U6:W70,3,FALSE))","v":""}]
[null,{"$f":"IF(F12=\"\",\"\",N12)","v":""},2,"KLÍČOV II.",null,null,null,null,null,null,{"$f":"SUM(F12:J12)","v":0},0,{"$f":"SUM(K12*1000)+L12+0.05","v":0.05},{"$f":"IF(F12=\"\",\"\",RANK(M12,M6:M70,0))","v":""},null,null,null,{"$f":"IF(F12=\"\",\"\",RANK(Q17,Q11:Q71,0))","v":""},null,null,{"$f":"IF(R12=\"\",\"\",R12)","v":""},{"$f":"IF(D12=\"\",\"\",D12)","v":"KLÍČOV II."},{"$f":"IF(O17=\"\",\"\",O17)","v":0},null,null,null,null,null,null,null,null,null,7,{"$f":"IF(AF6<7,\"\",VLOOKUP(7,B6:N70,4,FALSE))","v":""},{"$f":"IF(AF6<7,\"\",VLOOKUP(7,B6:N70,10,FALSE))","v":""},null,null,6,{"$f":"IF(AK6<6,\"\",VLOOKUP(6,U6:W70,2,FALSE))","v":""},{"$f":"IF(AK6<6,\"\",VLOOKUP(6,U6:W70,3,FALSE))","v":""}]
[null,{"$f":"IF(F13=\"\",\"\",N13)","v":""},null,null,null,null,null,null,null,null,{"$f":"SUM(F13:J13)","v":0},0,{"$f":"SUM(K13*1000)+L13+0.049","v":4.9000000000000002E-2},{"$f":"IF(F13=\"\",\"\",RANK(M13,M6:M70,0))","v":""},null,null,null,null,null,null,null,null,null,null,null,null,null,null,null,null,null,null,8,{"$f":"IF(AF6<8,\"\",VLOOKUP(8,B6:N70,4,FALSE))","v":""},{"$f":"IF(AF6<8,\"\",VLOOKUP(8,B6:N70,10,FALSE))","v":""},null,null,7,{"$f":"IF(AK6<7,\"\",VLOOKUP(7,U6:W70,2,FALSE))","v":""},{"$f":"IF(AK6<7,\"\",VLOOKUP(7,U6:W70,3,FALSE))","v":""}]
[null,{"$f":"IF(F14=\"\",\"\",N14)","v":""},null,null,null,null,null,null,null,null,{"$f":"SUM(F14:J14)","v":0},0,{"$f":"SUM(K14*1000)+L14+0.048","v":4.8000000000000001E-2},{"$f":"IF(F14=\"\",\"\",RANK(M14,M6:M70,0))","v":""},null,null,null,null,null,null,null,null,null,null,null,null,null,null,null,null,null,null,9,{"$f":"IF(AF6<9,\"\",VLOOKUP(9,B6:N70,4,FALSE))","v":""},{"$f":"IF(AF6<9,\"\",VLOOKUP(9,B6:N70,10,FALSE))","v":""},null,null,8,{"$f":"IF(AK6<8,\"\",VLOOKUP(8,U6:W70,2,FALSE))","v":""},{"$f":"IF(AK6<8,\"\",VLOOKUP(8,U6:W70,3,FALSE))","v":""}]
[null,{"$f":"IF(F15=\"\",\"\",N15)","v":""},null,null,null,null,null,null,null,null,{"$f":"SUM(F15:J15)","v":0},0,{"$f":"SUM(K15*1000)+L15+0.047","v":4.7E-2},{"$f":"IF(F15=\"\",\"\",RANK(M15,M6:M700,0))","v":""},null,null,null,null,null,null,null,null,null,null,null,null,null,null,null,null,null,null,10,{"$f":"IF(AF6<10,\"\",VLOOKUP(10,B6:N70,4,FALSE))","v":""},{"$f":"IF(AF6<10,\"\",VLOOKUP(10,B6:N70,10,FALSE))","v":""},null,null,9,{"$f":"IF(AK6<9,\"\",VLOOKUP(9,U6:W70,2,FALSE))","v":""},{"$f":"IF(AK6<9,\"\",VLOOKUP(9,U6:W70,3,FALSE))","v":""}]
[null,{"$f":"IF(F16=\"\",\"\",N16)","v":""},null,null,null,null,null,null,null,null,{"$f":"SUM(F16:J16)","v":0},0,{"$f":"SUM(K16*1000)+L16+0.046","v":4.5999999999999999E-2},{"$f":"IF(F16=\"\",\"\",RANK(M16,M6:M70,0))","v":""},null,null,null,null,null,null,null,null,null,null,null,null,null,null,null,null,null,null,11,{"$f":"IF(AF6<11,\"\",VLOOKUP(11,B6:N70,4,FALSE))","v":""},{"$f":"IF(AF6<11,\"\",VLOOKUP(11,B6:N70,10,FALSE))","v":""},null,null,10,{"$f":"IF(AK6<10,\"\",VLOOKUP(10,U6:W70,2,FALSE))","v":""},{"$f":"IF(AK6<10,\"\",VLOOKUP(10,U6:W70,3,FALSE))","v":""}]
[null,null,null,null,null,{"$f":"SUM(F12:F16)","v":0},{"$f":"SUM(G12:G16)","v":0},{"$f":"SUM(H12:H16)","v":0},{"$f":"SUM(I12:I16)","v":0},{"$f":"SUM(J12:J16)","v":0},null,null,null,null,{"$f":"SUM(F17:J17)","v":0},{"$f":"MAX(F17:J17)+0.009","v":8.9999999999999993E-3},{"$f":"IF(F12=\"\",\"\",SUM(O17*1000)+P17)","v":""},null,null,null,null,null,null,null,null,null,null,null,{"$f":"SUM(O11,O17)","v":0},null,null,null,12,{"$f":"IF(AF6<12,\"\",VLOOKUP(12,B6:N70,4,FALSE))","v":""},{"$f":"IF(AF6<12,\"\",VLOOKUP(12,B6:N70,10,FALSE))","v":""},null,null,11,{"$f":"IF(AK6<11,\"\",VLOOKUP(11,U6:W70,2,FALSE))","v":""},{"$f":"IF(AK6<11,\"\",VLOOKUP(11,U6:W70,3,FALSE))","v":""}]
[null,{"$f":"IF(F18=\"\",\"\",N18)","v":""},3,"ŘEPY I.",null,null,null,null,null,null,{"$f":"SUM(F18:J18)","v":0},{"$f":"MAX(F18:J18)","v":0},{"$f":"SUM(K18*1000)+L18+0.045","v":4.4999999999999998E-2},{"$f":"IF(F18=\"\",\"\",RANK(M18,M6:M70,0))","v":""},null,null,null,{"$f":"IF(F18=\"\",\"\",RANK(Q23,Q11:Q71,0))","v":""},null,{"$f":"IF(F18=\"\",\"\",RANK(AA18,AA6:AA64,0))","v":""},{"$f":"IF(R18=\"\",\"\",R18)","v":""},{"$f":"IF(D18=\"\",\"\",D18)","v":"ŘEPY I."},{"$f":"IF(O23=\"\",\"\",O23)","v":0},{"$f":"IF(V18=\"HOSTIVAŘ I.\",\"GARÁŽ HOSTIVAŘ\",IF(V18=\"VRŠOVICE I.\",\"GARÁŽ VRŠOVICE\",IF(V18=\"KLÍČOV I.\",\"GARÁŽ KLÍČOV\",IF(V18=\"ŘEPY I.\",\"GARÁŽ ŘEPY\",IF(V18=\"KAČEROV I.\",\"GARÁŽ KAČEROV\",\"\")))))","v":"GARÁŽ ŘEPY"},{"$f":"MAX(F23:J23,F29:J29)+0.04","v":0.04},{"$f":"SUM(O23,O29)*1000","v":0},{"$f":"SUM(Y18:Z18)","v":0.04},{"$f":"IF(AC29=\"\",\"\",AC29)","v":0},null,{"$f":"IF(T18=\"\",\"\",T18)","v":""},null,null,13,{"$f":"IF(AF6<13,\"\",VLOOKUP(13,B6:N70,4,FALSE))","v":""},{"$f":"IF(AF6<13,\"\",VLOOKUP(13,B6:N70,10,FALSE))","v":""}]
[null,{"$f":"IF(F19=\"\",\"\",N19)","v":""},null,null,null,null,null,null,null,null,{"$f":"SUM(F19:J19)","v":0},{"$f":"MAX(F19:J19)","v":0},{"$f":"SUM(K19*1000)+L19+0.044","v":4.3999999999999997E-2},{"$f":"IF(F19=\"\",\"\",RANK(M19,M6:M70,0))","v":""},null,null,null,null,null,null,null,null,null,null,null,null,null,null,null,null,null,null,14,{"$f":"IF(AF6<14,\"\",VLOOKUP(14,B6:N70,4,FALSE))","v":""},{"$f":"IF(AF6<14,\"\",VLOOKUP(14,B6:N70,10,FALSE))","v":""},null,{"$f":"COUNT(T6:T64)","v":0},"POŘEDÍ GARÁŽÍ"]
[null,{"$f":"IF(F20=\"\",\"\",N20)","v":""},null,null,null,null,null,null,null,null,{"$f":"SUM(F20:J20)","v":0},{"$f":"MAX(F20:J20)","v":0},{"$f":"SUM(K20*1000)+L20+0.043","v":4.2999999999999997E-2},{"$f":"IF(F20=\"\",\"\",RANK(M20,M6:M70,0))","v":""},null,null,null,null,null,null,null,null,null,null,null,null,null,null,null,null,null,null,15,{"$f":"IF(AF6<15,\"\",VLOOKUP(15,B6:N70,4,FALSE))","v":""},{"$f":"IF(AF6<15,\"\",VLOOKUP(15,B6:N70,10,FALSE))","v":""},null,null,1,{"$f":"IF(AK19<1,\"\",VLOOKUP(1,T6:AB64,5,FALSE))","v":""},{"$f":"IF(AK19<1,\"\",VLOOKUP(1,T6:AB64,9,FALSE))","v":""}]
[null,{"$f":"IF(F21=\"\",\"\",N21)","v":""},null,null,null,null,null,null,null,null,{"$f":"SUM(F21:J21)","v":0},{"$f":"MAX(F21:J21)","v":0},{"$f":"SUM(K21*1000)+L21+0.042","v":4.2000000000000003E-2},{"$f":"IF(F21=\"\",\"\",RANK(M21,M6:M70,0))","v":""},null,null,null,null,null,null,null,null,null,null,null,null,null,null,null,null,null,null,16,{"$f":"IF(AF6<16,\"\",VLOOKUP(16,B6:N70,4,FALSE))","v":""},{"$f":"IF(AF6<16,\"\",VLOOKUP(16,B6:N70,10,FALSE))","v":""},null,null,2,{"$f":"IF(AK19<2,\"\",VLOOKUP(2,T6:AB64,5,FALSE))","v":""},{"$f":"IF(AK19<2,\"\",VLOOKUP(2,T6:AB64,9,FALSE))","v":""}]
[null,{"$f":"IF(F22=\"\",\"\",N22)","v":""},null,null,null,null,null,null,null,null,{"$f":"SUM(F22:J22)","v":0},{"$f":"MAX(F22:J22)","v":0},{"$f":"SUM(K22*1000)+L22+0.041","v":4.1000000000000002E-2},{"$f":"IF(F22=\"\",\"\",RANK(M22,M6:M70,0))","v":""},null,null,null,null,null,null,null,null,null,null,null,null,null,null,null,null,null,null,17,{"$f":"IF(AF6<17,\"\",VLOOKUP(17,B6:N70,4,FALSE))","v":""},{"$f":"IF(AF6<17,\"\",VLOOKUP(17,B6:N70,10,FALSE))","v":""},null,null,3,{"$f":"IF(AK19<3,\"\",VLOOKUP(3,T6:AB64,5,FALSE))","v":""},{"$f":"IF(AK19<3,\"\",VLOOKUP(3,T6:AB64,9,FALSE))","v":""}]
[null,null,null,null,null,{"$f":"SUM(F18:F22)","v":0},{"$f":"SUM(G18:G22)","v":0},{"$f":"SUM(H18:H22)","v":0},{"$f":"SUM(I18:I22)","v":0},{"$f":"SUM(J18:J22)","v":0},null,null,null,null,{"$f":"SUM(F23:J23)","v":0},{"$f":"MAX(F23:J23)+0.008","v":8.0000000000000002E-3},{"$f":"IF(F18=\"\",\"\",SUM(O23*1000)+P23)","v":""},null,null,null,null,null,null,null,null,null,null,null,null,null,null,null,18,{"$f":"IF(AF6<18,\"\",VLOOKUP(18,B6:N70,4,FALSE))","v":""},{"$f":"IF(AF6<18,\"\",VLOOKUP(18,B6:N70,10,FALSE))","v":""},null,null,4,{"$f":"IF(AK19<4,\"\",VLOOKUP(4,T6:AB64,5,FALSE))","v":""},{"$f":"IF(AK19<4,\"\",VLOOKUP(4,T6:AB64,9,FALSE))","v":""}]
[null,{"$f":"IF(F24=\"\",\"\",N24)","v":""},4,"ŘEPY II.",null,null,null,null,null,null,{"$f":"SUM(F24:J24)","v":0},{"$f":"MAX(F24:J24)","v":0},{"$f":"SUM(K24*1000)+L24+0.04","v":0.04},{"$f":"IF(F24=\"\",\"\",RANK(M24,M6:M70,0))","v":""},null,null,null,{"$f":"IF(F24=\"\",\"\",RANK(Q29,Q11:Q71,0))","v":""},null,null,{"$f":"IF(R24=\"\",\"\",R24)","v":""},{"$f":"IF(D24=\"\",\"\",D24)","v":"ŘEPY II."},{"$f":"IF(O29=\"\",\"\",O29)","v":0},null,null,null,null,null,null,null,null,null,19,{"$f":"IF(AF6<19,\"\",VLOOKUP(19,B6:N70,4,FALSE))","v":""},{"$f":"IF(AF6<19,\"\",VLOOKUP(19,B6:N70,10,FALSE))","v":""},null,null,5,{"$f":"IF(AK19<5,\"\",VLOOKUP(5,T6:AB64,5,FALSE))","v":""},{"$f":"IF(AK19<5,\"\",VLOOKUP(5,T6:AB64,9,FALSE))","v":""}]
[null,{"$f":"IF(F25=\"\",\"\",N25)","v":""},null,null,null,null,null,null,null,null,{"$f":"SUM(F25:J25)","v":0},{"$f":"MAX(F25:J25)","v":0},{"$f":"SUM(K25*1000)+L25+0.039","v":3.9E-2},{"$f":"IF(F25=\"\",\"\",RANK(M25,M6:M70,0))","v":""},null,null,null,null,null,null,null,null,null,null,null,null,null,null,null,null,null,null,20,{"$f":"IF(AF6<20,\"\",VLOOKUP(20,B6:N70,4,FALSE))","v":""},{"$f":"IF(AF6<20,\"\",VLOOKUP(20,B6:N70,10,FALSE))","v":""}]
[null,{"$f":"IF(F26=\"\",\"\",N26)","v":""},null,null,null,null,null,null,null,null,{"$f":"SUM(F26:J26)","v":0},{"$f":"MAX(F26:J26)","v":0},{"$f":"SUM(K26*1000)+L26+0.038","v":3.7999999999999999E-2},{"$f":"IF(F26=\"\",\"\",RANK(M26,M6:M70,0))","v":""},null,null,null,null,null,null,null,null,null,null,null,null,null,null,null,null,null,null,21,{"$f":"IF(AF6<21,\"\",VLOOKUP(21,B6:N70,4,FALSE))","v":""},{"$f":"IF(AF6<21,\"\",VLOOKUP(21,B6:N70,10,FALSE))","v":""}]
[null,{"$f":"IF(F27=\"\",\"\",N27)","v":""},null,null,null,null,null,null,null,null,{"$f":"SUM(F27:J27)","v":0},{"$f":"MAX(F27:J27)","v":0},{"$f":"SUM(K27*1000)+L27+0.037","v":3.6999999999999998E-2},{"$f":"IF(F27=\"\",\"\",RANK(M27,M6:M70,0))","v":""},null,null,null,null,null,null,null,null,null,null,null,null,null,null,null,null,null,null,22,{"$f":"IF(AF6<22,\"\",VLOOKUP(22,B6:N70,4,FALSE))","v":""},{"$f":"IF(AF6<22,\"\",VLOOKUP(22,B6:N70,10,FALSE))","v":""}]
[null,{"$f":"IF(F28=\"\",\"\",N28)","v":""},null,null,null,null,null,null,null,null,{"$f":"SUM(F28:J28)","v":0},{"$f":"MAX(F28:J28)","v":0},{"$f":"SUM(K28*1000)+L28+0.036","v":3.5999999999999997E-2},{"$f":"IF(F28=\"\",\"\",RANK(M28,M6:M70,0))","v":""},null,null,null,null,null,null,null,null,null,null,null,null,null,null,null,null,null,null,23,{"$f":"IF(AF6<23,\"\",VLOOKUP(23,B6:N70,4,FALSE))","v":""},{"$f":"IF(AF6<23,\"\",VLOOKUP(23,B6:N70,10,FALSE))","v":""}]
[null,null,null,null,null,{"$f":"SUM(F24:F28)","v":0},{"$f":"SUM(G24:G28)","v":0},{"$f":"SUM(H24:H28)","v":0},{"$f":"SUM(I24:I28)","v":0},{"$f":"SUM(J24:J28)","v":0},null,null,null,null,{"$f":"SUM(F29:J29)","v":0},{"$f":"MAX(F29:J29)+0.007","v":7.0000000000000001E-3},{"$f":"IF(F24=\"\",\"\",SUM(O29*1000)+P29)","v":""},null,null,null,null,null,null,null,null,null,null,null,{"$f":"SUM(O23,O29)","v":0},null,null,null,24,{"$f":"IF(AF6<24,\"\",VLOOKUP(24,B6:N70,4,FALSE))","v":""},{"$f":"IF(AF6<24,\"\",VLOOKUP(24,B6:N70,10,FALSE))","v":""}]
[null,{"$f":"IF(F30=\"\",\"\",N30)","v":""},5,"KAČEROV I.",null,null,null,null,null,null,{"$f":"SUM(F30:J30)","v":0},{"$f":"MAX(F30:J30)","v":0},{"$f":"SUM(K30*1000)+L30+0.035","v":3.5000000000000003E-2},{"$f":"IF(F30=\"\",\"\",RANK(M30,M6:M70,0))","v":""},null,null,null,{"$f":"IF(F30=\"\",\"\",RANK(Q35,Q11:Q71,0))","v":""},null,{"$f":"IF(F30=\"\",\"\",RANK(AA30,AA6:AA64,0))","v":""},{"$f":"IF(R30=\"\",\"\",R30)","v":""},{"$f":"IF(D30=\"\",\"\",D30)","v":"KAČEROV I."},{"$f":"IF(O35=\"\",\"\",O35)","v":0},{"$f":"IF(V30=\"HOSTIVAŘ I.\",\"GARÁŽ HOSTIVAŘ\",IF(V30=\"VRŠOVICE I.\",\"GARÁŽ VRŠOVICE\",IF(V30=\"KLÍČOV I.\",\"GARÁŽ KLÍČOV\",IF(V30=\"ŘEPY I.\",\"GARÁŽ ŘEPY\",IF(V30=\"KAČEROV I.\",\"GARÁŽ KAČEROV\",\"\")))))","v":"GARÁŽ KAČEROV"},{"$f":"MAX(F35:J35,F41:J41)+0.03","v":0.03},{"$f":"SUM(O35,O41)*1000","v":0},{"$f":"SUM(Y30:Z30)","v":0.03},{"$f":"IF(AC41=\"\",\"\",AC41)","v":0},null,{"$f":"IF(T30=\"\",\"\",T30)","v":""},null,null,25,{"$f":"IF(AF6<25,\"\",VLOOKUP(25,B6:N70,4,FALSE))","v":""},{"$f":"IF(AF6<25,\"\",VLOOKUP(25,B6:N70,10,FALSE))","v":""}]
[null,{"$f":"IF(F31=\"\",\"\",N31)","v":""},null,null,null,null,null,null,null,null,{"$f":"SUM(F31:J31)","v":0},{"$f":"MAX(F31:J31)","v":0},{"$f":"SUM(K31*1000)+L31+0.034","v":3.4000000000000002E-2},{"$f":"IF(F31=\"\",\"\",RANK(M31,M6:M70,0))","v":""},null,null,null,null,null,null,null,null,null,null,null,null,null,null,null,null,null,null,26,{"$f":"IF(AF6<26,\"\",VLOOKUP(26,B6:N70,4,FALSE))","v":""},{"$f":"IF(AF6<26,\"\",VLOOKUP(26,B6:N70,10,FALSE))","v":""}]
[null,{"$f":"IF(F32=\"\",\"\",N32)","v":""},null,null,null,null,null,null,null,null,{"$f":"SUM(F32:J32)","v":0},{"$f":"MAX(F32:J32)","v":0},{"$f":"SUM(K32*1000)+L32+0.033","v":3.3000000000000002E-2},{"$f":"IF(F32=\"\",\"\",RANK(M32,M6:M70,0))","v":""},null,null,null,null,null,null,null,null,null,null,null,null,null,null,null,null,null,null,27,{"$f":"IF(AF6<27,\"\",VLOOKUP(27,B6:N70,4,FALSE))","v":""},{"$f":"IF(AF6<27,\"\",VLOOKUP(27,B6:N70,10,FALSE))","v":""}]
[null,{"$f":"IF(F33=\"\",\"\",N33)","v":""},null,null,null,null,null,null,null,null,{"$f":"SUM(F33:J33)","v":0},{"$f":"MAX(F33:J33)","v":0},{"$f":"SUM(K33*1000)+L33+0.032","v":3.2000000000000001E-2},{"$f":"IF(F33=\"\",\"\",RANK(M33,M6:M70,0))","v":""},null,null,null,null,null,null,null,null,null,null,null,null,null,null,null,null,null,null,28,{"$f":"IF(AF6<28,\"\",VLOOKUP(28,B6:N70,4,FALSE))","v":""},{"$f":"IF(AF6<28,\"\",VLOOKUP(28,B6:N70,10,FALSE))","v":""}]
[null,{"$f":"IF(F34=\"\",\"\",N34)","v":""},null,null,null,null,null,null,null,null,{"$f":"SUM(F34:J34)","v":0},{"$f":"MAX(F34:J34)","v":0},{"$f":"SUM(K34*1000)+L34+0.031","v":3.1E-2},{"$f":"IF(F34=\"\",\"\",RANK(M34,M6:M70,0))","v":""},null,null,null,null,null,null,null,null,null,null,null,null,null,null,null,null,null,null,29,{"$f":"IF(AF6<29,\"\",VLOOKUP(29,B6:N70,4,FALSE))","v":""},{"$f":"IF(AF6<29,\"\",VLOOKUP(29,B6:N70,10,FALSE))","v":""}]
[null,null,null,null,null,{"$f":"SUM(F30:F34)","v":0},{"$f":"SUM(G30:G34)","v":0},{"$f":"SUM(H30:H34)","v":0},{"$f":"SUM(I30:I34)","v":0},{"$f":"SUM(J30:J34)","v":0},null,null,null,null,{"$f":"SUM(F35:J35)","v":0},{"$f":"MAX(F35:J35)+0.006","v":6.0000000000000001E-3},{"$f":"IF(F30=\"\",\"\",SUM(O35*1000)+P35)","v":""},null,null,null,null,null,null,null,null,null,null,null,null,null,null,null,30,{"$f":"IF(AF6<30,\"\",VLOOKUP(30,B6:N70,4,FALSE))","v":""},{"$f":"IF(AF6<30,\"\",VLOOKUP(30,B6:N70,10,FALSE))","v":""}]
[null,{"$f":"IF(F36=\"\",\"\",N36)","v":""},6,"KAČEROV II.",null,null,null,null,null,null,{"$f":"SUM(F36:J36)","v":0},{"$f":"MAX(F36:J36)","v":0},{"$f":"SUM(K36*1000)+L36+0.03","v":0.03},{"$f":"IF(F36=\"\",\"\",RANK(M36,M6:M70,0))","v":""},null,null,null,{"$f":"IF(F36=\"\",\"\",RANK(Q41,Q11:Q71,0))","v":""},null,null,{"$f":"IF(R36=\"\",\"\",R36)","v":""},{"$f":"IF(D36=\"\",\"\",D36)","v":"KAČEROV II."},{"$f":"IF(O41=\"\",\"\",O41)","v":0},null,null,null,null,null,null,null,null,null,31,{"$f":"IF(AF6<31,\"\",VLOOKUP(31,B6:N70,4,FALSE))","v":""},{"$f":"IF(AF6<31,\"\",VLOOKUP(31,B6:N70,10,FALSE))","v":""}]
[null,{"$f":"IF(F37=\"\",\"\",N37)","v":""},null,null,null,null,null,null,null,null,{"$f":"SUM(F37:J37)","v":0},{"$f":"MAX(F37:J37)","v":0},{"$f":"SUM(K37*1000)+L37+0.029","v":2.9000000000000001E-2},{"$f":"IF(F37=\"\",\"\",RANK(M37,M6:M70,0))","v":""},null,null,null,null,null,null,null,null,null,null,null,null,null,null,null,null,null,null,32,{"$f":"IF(AF6<32,\"\",VLOOKUP(32,B6:N70,4,FALSE))","v":""},{"$f":"IF(AF6<32,\"\",VLOOKUP(32,B6:N70,10,FALSE))","v":""}]
[null,{"$f":"IF(F38=\"\",\"\",N38)","v":""},null,null,null,null,null,null,null,null,{"$f":"SUM(F38:J38)","v":0},{"$f":"MAX(F38:J38)","v":0},{"$f":"SUM(K38*1000)+L38+0.028","v":2.8000000000000001E-2},{"$f":"IF(F38=\"\",\"\",RANK(M38,M6:M70,0))","v":""},null,null,null,null,null,null,null,null,null,null,null,null,null,null,null,null,null,null,33,{"$f":"IF(AF6<33,\"\",VLOOKUP(33,B6:N70,4,FALSE))","v":""},{"$f":"IF(AF6<33,\"\",VLOOKUP(33,B6:N70,10,FALSE))","v":""}]
[null,{"$f":"IF(F39=\"\",\"\",N39)","v":""},null,null,null,null,null,null,null,null,{"$f":"SUM(F39:J39)","v":0},{"$f":"MAX(F39:J39)","v":0},{"$f":"SUM(K39*1000)+L39+0.027","v":2.7E-2},{"$f":"IF(F39=\"\",\"\",RANK(M39,M6:M70,0))","v":""},null,null,null,null,null,null,null,null,null,null,null,null,null,null,null,null,null,null,34,{"$f":"IF(AF6<34,\"\",VLOOKUP(34,B6:N70,4,FALSE))","v":""},{"$f":"IF(AF6<34,\"\",VLOOKUP(34,B6:N70,10,FALSE))","v":""}]
[null,{"$f":"IF(F40=\"\",\"\",N40)","v":""},null,null,null,null,null,null,null,null,{"$f":"SUM(F40:J40)","v":0},{"$f":"MAX(F40:J40)","v":0},{"$f":"SUM(K40*1000)+L40+0.026","v":2.5999999999999999E-2},{"$f":"IF(F40=\"\",\"\",RANK(M40,M6:M70,0))","v":""},null,null,null,null,null,null,null,null,null,null,null,null,null,null,null,null,null,null,35,{"$f":"IF(AF6<35,\"\",VLOOKUP(35,B6:N70,4,FALSE))","v":""},{"$f":"IF(AF6<35,\"\",VLOOKUP(35,B6:N70,10,FALSE))","v":""}]
[null,null,null,null,null,{"$f":"SUM(F36:F40)","v":0},{"$f":"SUM(G36:G40)","v":0},{"$f":"SUM(H36:H40)","v":0},{"$f":"SUM(I36:I40)","v":0},{"$f":"SUM(J36:J40)","v":0},null,null,null,null,{"$f":"SUM(F41:J41)","v":0},{"$f":"MAX(F41:J41)+0.005","v":5.0000000000000001E-3},{"$f":"IF(F36=\"\",\"\",SUM(O41*1000)+P41)","v":""},null,null,null,null,null,null,null,null,null,null,null,{"$f":"SUM(O35,O41)","v":0},null,null,null,36,{"$f":"IF(AF6<36,\"\",VLOOKUP(36,B6:N70,4,FALSE))","v":""},{"$f":"IF(AF6<36,\"\",VLOOKUP(36,B6:N70,10,FALSE))","v":""}]
[null,{"$f":"IF(F42=\"\",\"\",N42)","v":""},7,"HOSTIVAŘ I.",null,null,null,null,null,null,{"$f":"SUM(F42:J42)","v":0},{"$f":"MAX(F42:J42)","v":0},{"$f":"SUM(K42*1000)+L42+0.025","v":2.5000000000000001E-2},{"$f":"IF(F42=\"\",\"\",RANK(M42,M6:M70,0))","v":""},null,null,null,{"$f":"IF(F42=\"\",\"\",RANK(Q47,Q11:Q71,0))","v":""},null,{"$f":"IF(F42=\"\",\"\",RANK(AA42,AA6:AA64,0))","v":""},{"$f":"IF(R42=\"\",\"\",R42)","v":""},{"$f":"IF(D42=\"\",\"\",D42)","v":"HOSTIVAŘ I."},{"$f":"IF(O47=\"\",\"\",O47)","v":0},{"$f":"IF(V42=\"HOSTIVAŘ I.\",\"GARÁŽ HOSTIVAŘ\",IF(V42=\"VRŠOVICE I.\",\"GARÁŽ VRŠOVICE\",IF(V42=\"KLÍČOV I.\",\"GARÁŽ KLÍČOV\",IF(V42=\"ŘEPY I.\",\"GARÁŽ ŘEPY\",IF(V42=\"KAČEROV I.\",\"GARÁŽ KAČEROV\",\"\")))))","v":"GARÁŽ HOSTIVAŘ"},{"$f":"MAX(F47:J47,F53:J53)+0.02","v":0.02},{"$f":"SUM(O47,O53)*1000","v":0},{"$f":"SUM(Y42:Z42)","v":0.02},{"$f":"IF(AC53=\"\",\"\",AC53)","v":0},null,{"$f":"IF(T42=\"\",\"\",T42)","v":""},null,null,37,{"$f":"IF(AF6<37,\"\",VLOOKUP(37,B6:N70,4,FALSE))","v":""},{"$f":"IF(AF6<37,\"\",VLOOKUP(37,B6:N70,10,FALSE))","v":""}]
[null,{"$f":"IF(F43=\"\",\"\",N43)","v":""},null,null,null,null,null,null,null,null,{"$f":"SUM(F43:J43)","v":0},{"$f":"MAX(F43:J43)","v":0},{"$f":"SUM(K43*1000)+L43+0.024","v":2.4E-2},{"$f":"IF(F43=\"\",\"\",RANK(M43,M6:M70,0))","v":""},null,null,null,null,null,null,null,null,null,null,null,null,null,null,null,null,null,null,38,{"$f":"IF(AF6<38,\"\",VLOOKUP(38,B6:N70,4,FALSE))","v":""},{"$f":"IF(AF6<38,\"\",VLOOKUP(38,B6:N70,10,FALSE))","v":""}]
[null,{"$f":"IF(F44=\"\",\"\",N44)","v":""},null,null,null,null,null,null,null,null,{"$f":"SUM(F44:J44)","v":0},{"$f":"MAX(F44:J44)","v":0},{"$f":"SUM(K44*1000)+L44+0.023","v":2.3E-2},{"$f":"IF(F44=\"\",\"\",RANK(M44,M6:M70,0))","v":""},null,null,null,null,null,null,null,null,null,null,null,null,null,null,null,null,null,null,39,{"$f":"IF(AF6<39,\"\",VLOOKUP(39,B6:N70,4,FALSE))","v":""},{"$f":"IF(AF6<39,\"\",VLOOKUP(39,B6:N70,10,FALSE))","v":""}]
[null,{"$f":"IF(F45=\"\",\"\",N45)","v":""},null,null,null,null,null,null,null,null,{"$f":"SUM(F45:J45)","v":0},{"$f":"MAX(F45:J45)","v":0},{"$f":"SUM(K45*1000)+L45+0.022","v":2.1999999999999999E-2},{"$f":"IF(F45=\"\",\"\",RANK(M45,M6:M70,0))","v":""},null,null,null,null,null,null,null,null,null,null,null,null,null,null,null,null,null,null,40,{"$f":"IF(AF6<40,\"\",VLOOKUP(40,B6:N70,4,FALSE))","v":""},{"$f":"IF(AF6<40,\"\",VLOOKUP(40,B6:N70,10,FALSE))","v":""}]
[null,{"$f":"IF(F46=\"\",\"\",N46)","v":""},null,null,null,null,null,null,null,null,{"$f":"SUM(F46:J46)","v":0},{"$f":"MAX(F46:J46)","v":0},{"$f":"SUM(K46*1000)+L46+0.021","v":2.1000000000000001E-2},{"$f":"IF(F46=\"\",\"\",RANK(M46,M6:M70,0))","v":""},null,null,null,null,null,null,null,null,null,null,null,null,null,null,null,null,null,null,41,{"$f":"IF(AF6<41,\"\",VLOOKUP(41,B6:N70,4,FALSE))","v":""},{"$f":"IF(AF6<41,\"\",VLOOKUP(41,B6:N70,10,FALSE))","v":""}]
[null,null,null,null,null,{"$f":"SUM(F42:F46)","v":0},{"$f":"SUM(G42:G46)","v":0},{"$f":"SUM(H42:H46)","v":0},{"$f":"SUM(I42:I46)","v":0},{"$f":"SUM(J42:J46)","v":0},null,null,null,null,{"$f":"SUM(F47:J47)","v":0},{"$f":"MAX(F47:J47)+0.004","v":4.0000000000000001E-3},{"$f":"IF(F42=\"\",\"\",SUM(O47*1000)+P47)","v":""},null,null,null,null,null,null,null,null,null,null,null,null,null,null,null,42,{"$f":"IF(AF6<42,\"\",VLOOKUP(42,B6:N70,4,FALSE))","v":""},{"$f":"IF(AF6<42,\"\",VLOOKUP(42,B6:N70,10,FALSE))","v":""}]
[null,{"$f":"IF(F48=\"\",\"\",N48)","v":""},8,"HOSTIVAŘ II.",null,null,null,null,null,null,{"$f":"SUM(F48:J48)","v":0},{"$f":"MAX(F48:J48)","v":0},{"$f":"SUM(K48*1000)+L48+0.02","v":0.02},{"$f":"IF(F48=\"\",\"\",RANK(M48,M6:M70,0))","v":""},null,null,null,{"$f":"IF(F48=\"\",\"\",RANK(Q53,Q11:Q71,0))","v":""},null,null,{"$f":"IF(R48=\"\",\"\",R48)","v":""},{"$f":"IF(D48=\"\",\"\",D48)","v":"HOSTIVAŘ II."},{"$f":"IF(O53=\"\",\"\",O53)","v":0},null,null,null,null,null,null,null,null,null,43,{"$f":"IF(AF6<43,\"\",VLOOKUP(43,B6:N70,4,FALSE))","v":""},{"$f":"IF(AF6<43,\"\",VLOOKUP(43,B6:N70,10,FALSE))","v":""}]
[null,{"$f":"IF(F49=\"\",\"\",N49)","v":""},null,null,null,null,null,null,null,null,{"$f":"SUM(F49:J49)","v":0},{"$f":"MAX(F49:J49)","v":0},{"$f":"SUM(K49*1000)+L49+0.019","v":1.9E-2},{"$f":"IF(F49=\"\",\"\",RANK(M49,M6:M70,0))","v":""},null,null,null,null,null,null,null,null,null,null,null,null,null,null,null,null,null,null,44,{"$f":"IF(AF6<44,\"\",VLOOKUP(44,B6:N70,4,FALSE))","v":""},{"$f":"IF(AF6<44,\"\",VLOOKUP(44,B6:N70,10,FALSE))","v":""}]
[null,{"$f":"IF(F50=\"\",\"\",N50)","v":""},null,null,null,null,null,null,null,null,{"$f":"SUM(F50:J50)","v":0},{"$f":"MAX(F50:J50)","v":0},{"$f":"SUM(K50*1000)+L50+0.018","v":1.7999999999999999E-2},{"$f":"IF(F50=\"\",\"\",RANK(M50,M6:M70,0))","v":""},null,null,null,null,null,null,null,null,null,null,null,null,null,null,null,null,null,null,45,{"$f":"IF(AF6<45,\"\",VLOOKUP(45,B6:N70,4,FALSE))","v":""},{"$f":"IF(AF6<45,\"\",VLOOKUP(45,B6:N70,10,FALSE))","v":""}]
[null,{"$f":"IF(F51=\"\",\"\",N51)","v":""},null,null,null,null,null,null,null,null,{"$f":"SUM(F51:J51)","v":0},{"$f":"MAX(F51:J51)","v":0},{"$f":"SUM(K51*1000)+L51+0.017","v":1.7000000000000001E-2},{"$f":"IF(F51=\"\",\"\",RANK(M51,M6:M70,0))","v":""},null,null,null,null,null,null,null,null,null,null,null,null,null,null,null,null,null,null,46,{"$f":"IF(AF6<46,\"\",VLOOKUP(46,B6:N70,4,FALSE))","v":""},{"$f":"IF(AF6<46,\"\",VLOOKUP(46,B6:N70,10,FALSE))","v":""}]
[null,{"$f":"IF(F52=\"\",\"\",N52)","v":""},null,null,null,null,null,null,null,null,{"$f":"SUM(F52:J52)","v":0},{"$f":"MAX(F52:J52)","v":0},{"$f":"SUM(K52*1000)+L52+0.016","v":1.6E-2},{"$f":"IF(F52=\"\",\"\",RANK(M52,M6:M70,0))","v":""},null,null,null,null,null,null,null,null,null,null,null,null,null,null,null,null,null,null,47,{"$f":"IF(AF6<47,\"\",VLOOKUP(47,B6:N70,4,FALSE))","v":""},{"$f":"IF(AF6<47,\"\",VLOOKUP(47,B6:N70,10,FALSE))","v":""}]
[null,null,null,null,null,{"$f":"SUM(F48:F52)","v":0},{"$f":"SUM(G48:G52)","v":0},{"$f":"SUM(H48:H52)","v":0},{"$f":"SUM(I48:I52)","v":0},{"$f":"SUM(J48:J52)","v":0},null,null,null,null,{"$f":"SUM(F53:J53)","v":0},{"$f":"MAX(F53:J53)+0.003","v":3.0000000000000001E-3},{"$f":"IF(F48=\"\",\"\",SUM(O53*1000)+P53)","v":""},null,null,null,null,null,null,null,null,null,null,null,{"$f":"SUM(O47,O53)","v":0},null,null,null,48,{"$f":"IF(AF6<48,\"\",VLOOKUP(48,B6:N70,4,FALSE))","v":""},{"$f":"IF(AF6<48,\"\",VLOOKUP(48,B6:N70,10,FALSE))","v":""}]
[null,{"$f":"IF(F54=\"\",\"\",N54)","v":""},9,"VRŠOVICE I.",null,null,null,null,null,null,{"$f":"SUM(F54:J54)","v":0},{"$f":"MAX(F54:J54)","v":0},{"$f":"SUM(K54*1000)+L54+0.015","v":1.4999999999999999E-2},{"$f":"IF(F54=\"\",\"\",RANK(M54,M6:M70,0))","v":""},null,null,null,{"$f":"IF(F54=\"\",\"\",RANK(Q59,Q11:Q71,0))","v":""},null,{"$f":"IF(F54=\"\",\"\",RANK(AA54,AA6:AA64,0))","v":""},{"$f":"IF(R54=\"\",\"\",R54)","v":""},{"$f":"IF(D54=\"\",\"\",D54)","v":"VRŠOVICE I."},{"$f":"IF(O59=\"\",\"\",O59)","v":0},{"$f":"IF(V54=\"HOSTIVAŘ I.\",\"GARÁŽ HOSTIVAŘ\",IF(V54=\"VRŠOVICE I.\",\"GARÁŽ VRŠOVICE\",IF(V54=\"KLÍČOV I.\",\"GARÁŽ KLÍČOV\",IF(V54=\"ŘEPY I.\",\"GARÁŽ ŘEPY\",IF(V54=\"KAČEROV I.\",\"GARÁŽ KAČEROV\",\"\")))))","v":"GARÁŽ VRŠOVICE"},{"$f":"MAX(F59:J59,F65:J65)+0.01","v":0.01},{"$f":"SUM(O59,O65)*1000","v":0},{"$f":"SUM(Y54:Z54)","v":0.01},{"$f":"IF(AC65=\"\",\"\",AC65)","v":0},null,{"$f":"IF(T54=\"\",\"\",T54)","v":""},null,null,49,{"$f":"IF(AF6<49,\"\",VLOOKUP(49,B6:N70,4,FALSE))","v":""},{"$f":"IF(AF6<49,\"\",VLOOKUP(49,B6:N70,10,FALSE))","v":""}]
[null,{"$f":"IF(F55=\"\",\"\",N55)","v":""},null,null,null,null,null,null,null,null,{"$f":"SUM(F55:J55)","v":0},{"$f":"MAX(F55:J55)","v":0},{"$f":"SUM(K55*1000)+L55+0.014","v":1.4E-2},{"$f":"IF(F55=\"\",\"\",RANK(M55,M6:M70,0))","v":""},null,null,null,null,null,null,null,null,null,null,null,null,null,null,null,null,null,null,50,{"$f":"IF(AF6<50,\"\",VLOOKUP(50,B6:N70,4,FALSE))","v":""},{"$f":"IF(AF6<50,\"\",VLOOKUP(50,B6:N70,10,FALSE))","v":""}]
[null,{"$f":"IF(F56=\"\",\"\",N56)","v":""},null,null,null,null,null,null,null,null,{"$f":"SUM(F56:J56)","v":0},{"$f":"MAX(F56:J56)","v":0},{"$f":"SUM(K56*1000)+L56+0.013","v":1.2999999999999999E-2},{"$f":"IF(F56=\"\",\"\",RANK(M56,M6:M70,0))","v":""},null,null,null,null,null,null,null,null,null,null,null,null,null,null,null,null,null,null,51,{"$f":"IF(AF6<51,\"\",VLOOKUP(51,B6:N70,4,FALSE))","v":""},{"$f":"IF(AF6<51,\"\",VLOOKUP(51,B6:N70,10,FALSE))","v":""}]
[null,{"$f":"IF(F57=\"\",\"\",N57)","v":""},null,null,null,null,null,null,null,null,{"$f":"SUM(F57:J57)","v":0},{"$f":"MAX(F57:J57)","v":0},{"$f":"SUM(K57*1000)+L57+0.012","v":1.2E-2},{"$f":"IF(F57=\"\",\"\",RANK(M57,M6:M70,0))","v":""},null,null,null,null,null,null,null,null,null,null,null,null,null,null,null,null,null,null,52,{"$f":"IF(AF6<52,\"\",VLOOKUP(52,B6:N70,4,FALSE))","v":""},{"$f":"IF(AF6<52,\"\",VLOOKUP(52,B6:N70,10,FALSE))","v":""}]
[null,{"$f":"IF(F58=\"\",\"\",N58)","v":""},null,null,null,null,null,null,null,null,{"$f":"SUM(F58:J58)","v":0},{"$f":"MAX(F58:J58)","v":0},{"$f":"SUM(K58*1000)+L58+0.011","v":1.0999999999999999E-2},{"$f":"IF(F58=\"\",\"\",RANK(M58,M6:M70,0))","v":""},null,null,null,null,null,null,null,null,null,null,null,null,null,null,null,null,null,null,53,{"$f":"IF(AF6<53,\"\",VLOOKUP(53,B6:N70,4,FALSE))","v":""},{"$f":"IF(AF6<53,\"\",VLOOKUP(53,B6:N70,10,FALSE))","v":""}]
[null,null,null,null,null,{"$f":"SUM(F54:F58)","v":0},{"$f":"SUM(G54:G58)","v":0},{"$f":"SUM(H54:H58)","v":0},{"$f":"SUM(I54:I58)","v":0},{"$f":"SUM(J54:J58)","v":0},null,null,null,null,{"$f":"SUM(F59:J59)","v":0},{"$f":"MAX(F59:J59)+0.002","v":2E-3},{"$f":"IF(F54=\"\",\"\",SUM(O59*1000)+P59)","v":""},null,null,null,null,null,null,null,null,null,null,null,null,null,null,null,54,{"$f":"IF(AF6<54,\"\",VLOOKUP(54,B6:N70,4,FALSE))","v":""},{"$f":"IF(AF6<54,\"\",VLOOKUP(54,B6:N70,10,FALSE))","v":""}]
[null,{"$f":"IF(F60=\"\",\"\",N60)","v":""},10,"VRŠOVICE II.",null,null,null,null,null,null,{"$f":"SUM(F60:J60)","v":0},{"$f":"MAX(F60:J60)","v":0},{"$f":"SUM(K60*1000)+L60+0.01","v":0.01},{"$f":"IF(F60=\"\",\"\",RANK(M60,M6:M70,0))","v":""},null,null,null,{"$f":"IF(F60=\"\",\"\",RANK(Q65,Q11:Q71,0))","v":""},null,null,{"$f":"IF(R60=\"\",\"\",R60)","v":""},{"$f":"IF(D60=\"\",\"\",D60)","v":"VRŠOVICE II."},{"$f":"IF(O65=\"\",\"\",O65)","v":0},null,null,null,null,null,null,null,null,null,55,{"$f":"IF(AF6<55,\"\",VLOOKUP(55,B6:N70,4,FALSE))","v":""},{"$f":"IF(AF6<55,\"\",VLOOKUP(55,B6:N70,10,FALSE))","v":""}]
[null,{"$f":"IF(F61=\"\",\"\",N61)","v":""},null,null,null,null,null,null,null,null,{"$f":"SUM(F61:J61)","v":0},{"$f":"MAX(F61:J61)","v":0},{"$f":"SUM(K61*1000)+L61+0.009","v":8.9999999999999993E-3},{"$f":"IF(F61=\"\",\"\",RANK(M61,M6:M70,0))","v":""}]
[null,{"$f":"IF(F62=\"\",\"\",N62)","v":""},null,null,null,null,null,null,null,null,{"$f":"SUM(F62:J62)","v":0},{"$f":"MAX(F62:J62)","v":0},{"$f":"SUM(K62*1000)+L62+0.008","v":8.0000000000000002E-3},{"$f":"IF(F62=\"\",\"\",RANK(M62,M6:M70,0))","v":""}]
[null,{"$f":"IF(F63=\"\",\"\",N63)","v":""},null,null,null,null,null,null,null,null,{"$f":"SUM(F63:J63)","v":0},{"$f":"MAX(F63:J63)","v":0},{"$f":"SUM(K63*1000)+L63+0.007","v":7.0000000000000001E-3},{"$f":"IF(F63=\"\",\"\",RANK(M63,M6:M70,0))","v":""}]
[null,{"$f":"IF(F64=\"\",\"\",N64)","v":""},null,null,null,null,null,null,null,null,{"$f":"SUM(F64:J64)","v":0},{"$f":"MAX(F64:J64)","v":0},{"$f":"SUM(K64*1000)+L64+0.006","v":6.0000000000000001E-3},{"$f":"IF(F64=\"\",\"\",RANK(M64,M6:M70,0))","v":""}]
[null,null,null,null,null,{"$f":"SUM(F60:F64)","v":0},{"$f":"SUM(G60:G64)","v":0},{"$f":"SUM(H60:H64)","v":0},{"$f":"SUM(I60:I64)","v":0},{"$f":"SUM(J60:J64)","v":0},null,null,null,null,{"$f":"SUM(F65:J65)","v":0},{"$f":"MAX(F65:J65)+0.001","v":1E-3},{"$f":"IF(F60=\"\",\"\",SUM(O65*1000)+P65)","v":""},null,null,null,null,null,null,null,null,null,null,null,{"$f":"SUM(O59,O65)","v":0}]
[null,{"$f":"IF(F66=\"\",\"\",N66)","v":""},11,"VRŠOVICE III.",null,null,null,null,null,null,{"$f":"SUM(F66:J66)","v":0},{"$f":"MAX(F66:J66)","v":0},{"$f":"SUM(K66*1000)+L66-0.005","v":-5.0000000000000001E-3},{"$f":"IF(F66=\"\",\"\",RANK(M66,M6:M70,0))","v":""},null,null,null,{"$f":"IF(F66=\"\",\"\",RANK(Q71,Q11:Q71,0))","v":""},null,null,{"$f":"IF(R66=\"\",\"\",R66)","v":""},{"$f":"IF(D66=\"\",\"\",D66)","v":"VRŠOVICE III."},{"$f":"IF(O71=\"\",\"\",O71)","v":0},null,null,null,null,null,null,{"$f":"IF(E66=\"\",\"\",\"Mimo soutěž garáží\")","v":""}]
[null,{"$f":"IF(F67=\"\",\"\",N67)","v":""},null,null,null,null,null,null,null,null,{"$f":"SUM(F67:J67)","v":0},{"$f":"MAX(F67:J67)","v":0},{"$f":"SUM(K67*1000)+L67-0.004","v":-4.0000000000000001E-3},{"$f":"IF(F67=\"\",\"\",RANK(M67,M6:M70,0))","v":""}]
[null,{"$f":"IF(F68=\"\",\"\",N68)","v":""},null,null,null,null,null,null,null,null,{"$f":"SUM(F68:J68)","v":0},{"$f":"MAX(F68:J68)","v":0},{"$f":"SUM(K68*1000)+L68-0.003","v":-3.0000000000000001E-3},{"$f":"IF(F68=\"\",\"\",RANK(M68,M6:M70,0))","v":""}]
[null,{"$f":"IF(F69=\"\",\"\",N69)","v":""},null,null,null,null,null,null,null,null,{"$f":"SUM(F69:J69)","v":0},{"$f":"MAX(F69:J69)","v":0},{"$f":"SUM(K69*1000)+L69+0.002","v":2E-3},{"$f":"IF(F69=\"\",\"\",RANK(M69,M6:M70,0))","v":""}]
[null,{"$f":"IF(F70=\"\",\"\",N70)","v":""},null,null,null,null,null,null,null,null,{"$f":"SUM(F70:J70)","v":0},{"$f":"MAX(F70:J70)","v":0},{"$f":"SUM(K70*1000)+L70+0.001","v":1E-3},{"$f":"IF(F70=\"\",\"\",RANK(M70,M6:M70,0))","v":""}]
[null,null,null,null,null,{"$f":"SUM(F66:F70)","v":0},{"$f":"SUM(G66:G70)","v":0},{"$f":"SUM(H66:H70)","v":0},{"$f":"SUM(I66:I70)","v":0},{"$f":"SUM(J66:J70)","v":0},null,{"$f":"MAX(L12:L70,L6:L10)","v":0},null,null,{"$f":"SUM(F71:J71)","v":0},{"$f":"MAX(F71:J71)","v":0},{"$f":"IF(F66=\"\",\"\",SUM(O71*1000)+P71)","v":""}]

{"sheet":"zápis","index":12,"n_rows":125,"n_cols":48,"rows_kept":125,"cut":false,"hidden":true,"merged":[[0,38,0,42],[0,2,0,6],[0,8,0,12],[0,14,0,18],[0,20,0,24],[0,26,0,30],[0,32,0,36]]}
["garáž"," jméno",null,null,null,null,null,"16.2.",null,null,null,null,null,"14.3.",null,null,null,null,null,"28.3.",null,null,null,null,null,"18.4.",null,null,null,null,null,"12.9.",null,null,null,null,null,"17.10.",null,null,null,null,null,"7.11.","kuželky",null,"průměr","Zpět"]
["Dejvice","Jošt Michal",null,null,null,null,null,{"$f":"SUM(C2+D2+E2+F2+G2)","v":0},null,null,null,null,null,{"$f":"SUM(I2+J2+K2+L2+M2)","v":0},null,null,null,null,null,{"$f":"SUM(O2+P2+Q2+R2+S2)","v":0},null,null,null,null,null,{"$f":"SUM(U2+V2+W2+X2+Y2)","v":0},null,null,null,null,null,{"$f":"SUM(AA2+AB2+AC2+AD2+AE2)","v":0},null,null,null,null,null,{"$f":"SUM(AG2+AH2+AI2+AJ2+AK2)","v":0},null,null,null,null,null,{"$f":"SUM(AM2+AN2+AO2+AP2+AQ2)","v":0},{"$f":"SUM(N2,H2,T2,Z2,AF2,AL2,AR2)","v":0},{"$f":"COUNT(C2:G2,I2:M2,O2:S2,U2:Y2,AA2:AE2,AG2:AK2,AM2:AQ2)","v":0},{"$f":"IF(AT2=0,\"\",AS2/AT2)","v":""}]
["Dejvice","Pěchočová Soňa",null,null,null,null,null,{"$f":"SUM(C3+D3+E3+F3+G3)","v":0},null,null,null,null,null,{"$f":"SUM(I3:M3)","v":0},null,null,null,null,null,{"$f":"SUM(O3:S3)","v":0},null,null,null,null,null,{"$f":"SUM(U3:Y3)","v":0},null,null,null,null,null,{"$f":"SUM(AA3:AE3)","v":0},null,null,null,null,null,{"$f":"SUM(AG3:AK3)","v":0},null,null,null,null,null,{"$f":"SUM(AM3:AQ3)","v":0},{"$f":"SUM(N3,H3,T3,Z3,AF3,AL3,AR3)","v":0},{"$f":"COUNT(C3:G3,I3:M3,O3:S3,U3:Y3,AA3:AE3,AG3:AK3,AM3:AQ3)","v":0},{"$f":"IF(AT3=0,\"\",AS3/AT3)","v":""}]
["Dejvice","Joštová Alena",null,null,null,null,null,{"$f":"SUM(C4+D4+E4+F4+G4)","v":0},null,null,null,null,null,{"$f":"SUM(I4:M4)","v":0},null,null,null,null,null,{"$f":"SUM(O4:S4)","v":0},null,null,null,null,null,{"$f":"SUM(U4:Y4)","v":0},null,null,null,null,null,{"$f":"SUM(AA4:AE4)","v":0},null,null,null,null,null,{"$f":"SUM(AG4:AK4)","v":0},null,null,null,null,null,{"$f":"SUM(AM4:AQ4)","v":0},{"$f":"SUM(N4,H4,T4,Z4,AF4,AL4,AR4)","v":0},{"$f":"COUNT(C4:G4,I4:M4,O4:S4,U4:Y4,AA4:AE4,AG4:AK4,AM4:AQ4)","v":0},{"$f":"IF(AT4=0,\"\",AS4/AT4)","v":""}," "]
["Dejvice","Štěrba Ladislav",null,null,null,null,null,{"$f":"SUM(C5+D5+E5+F5+G5)","v":0},null,null,null,null,null,{"$f":"SUM(I5:M5)","v":0},null,null,null,null,null,{"$f":"SUM(O5:S5)","v":0},null,null,null,null,null,{"$f":"SUM(U5:Y5)","v":0},null,null,null,null,null,{"$f":"SUM(AA5:AE5)","v":0},null,null,null,null,null,{"$f":"SUM(AG5:AK5)","v":0},null,null,null,null,null,{"$f":"SUM(AM5:AQ5)","v":0},{"$f":"SUM(N5,H5,T5,Z5,AF5,AL5,AR5)","v":0},{"$f":"COUNT(C5:G5,I5:M5,O5:S5,U5:Y5,AA5:AE5,AG5:AK5,AM5:AQ5)","v":0},{"$f":"IF(AT5=0,\"\",AS5/AT5)","v":""}]
["Dejvice","Novák Antonín",null,null,null,null,null,{"$f":"SUM(C6+D6+E6+F6+G6)","v":0},null,null,null,null,null,{"$f":"SUM(I6:M6)","v":0},null,null,null,null,null,{"$f":"SUM(O6:S6)","v":0},null,null,null,null,null,{"$f":"SUM(U6:Y6)","v":0},null,null,null,null,null,{"$f":"SUM(AA6:AE6)","v":0},null,null,null,null,null,{"$f":"SUM(AG6:AK6)","v":0},null,null,null,null,null,{"$f":"SUM(AM6:AQ6)","v":0},{"$f":"SUM(N6,H6,T6,Z6,AF6,AL6,AR6)","v":0},{"$f":"COUNT(C6:G6,I6:M6,O6:S6,U6:Y6,AA6:AE6,AG6:AK6,AM6:AQ6)","v":0},{"$f":"IF(AT6=0,\"\",AS6/AT6)","v":""}]
[]
[null,null,null,null,null,null,null,null,null,null,null,null,null,null,null,null,null,null,null,null,null,null,null,null,null,null,null,null,null,null,null,null,null,null,null,null,null,null,null,null,null,null,null,null,{"$f":"SUM(AS2:AS7)","v":0},{"$f":"SUM(AT2:AT7)","v":0},{"$f":"IF(AT8=0,\"\",AS8/AT8)","v":""}]
[]
["Hostivař","Šafařík Luděk",160,186,178,138,150,{"$f":"SUM(C10+D10+E10+F10+G10)","v":812},null,null,null,null,null,{"$f":"SUM(I10+J10+K10+L10+M10)","v":0},null,null,null,null,null,{"$f":"SUM(O10+P10+Q10+R10+S10)","v":0},null,null,null,null,null,{"$f":"SUM(U10+V10+W10+X10+Y10)","v":0},null,null,null,null,null,{"$f":"SUM(AA10+AB10+AC10+AD10+AE10)","v":0},null,null,null,null,null,{"$f":"SUM(AG10+AH10+AI10+AJ10+AK10)","v":0},null,null,null,null,null,{"$f":"SUM(AM10+AN10+AO10+AP10+AQ10)","v":0},{"$f":"SUM(N10,H10,T10,Z10,AF10,AL10,AR10)","v":812},{"$f":"COUNT(C10:G10,I10:M10,O10:S10,U10:Y10,AA10:AE10,AG10:AK10,AM10:AQ10)","v":5},{"$f":"IF(AT10=0,\"\",AS10/AT10)","v":162.4}]
["Hostivař","Sláma Karel",null,null,null,null,null,0,null,null,null,null,null,0,null,null,null,null,null,0,null,null,null,null,null,0,null,null,null,null,null,0,null,null,null,null,null,0,null,null,null,null,null,0,0,0,""]
["Hostivař","Jelínek Jan",114,111,130,138,113,606,null,null,null,null,null,0,null,null,null,null,null,0,null,null,null,null,null,0,null,null,null,null,null,0,null,null,null,null,null,0,null,null,null,null,null,0,606,5,121.2]
["Hostivař","Mysliveček  Jaroslav",159,113,132,147,116,667,null,null,null,null,null,0,null,null,null,null,null,0,null,null,null,null,null,0,null,null,null,null,null,0,null,null,null,null,null,0,null,null,null,null,null,0,667,5,133.4]
["Hostivař","Jirkovská Iveta",null,null,null,null,null,0,null,null,null,null,null,0,null,null,null,null,null,0,null,null,null,null,null,0,null,null,null,null,null,0,null,null,null,null,null,0,null,null,null,null,null,0,0,0,""]
["Hostivař","Křápek Roman",130,132,160,128,129,679,null,null,null,null,null,0,null,null,null,null,null,0,null,null,null,null,null,0,null,null,null,null,null,0,null,null,null,null,null,0,null,null,null,null,null,0,679,5,135.80000000000001]
["Hostivař","Svítil Pavel",null,null,null,null,null,0,null,null,null,null,null,0,null,null,null,null,null,0,null,null,null,null,null,0,null,null,null,null,null,0,null,null,null,null,null,0,null,null,null,null,null,0,0,0,""]
["Hostivař","Čermák Tomáš",141,110,168,132,143,694,null,null,null,null,null,0,null,null,null,null,null,0,null,null,null,null,null,0,null,null,null,null,null,0,null,null,null,null,null,0,null,null,null,null,null,0,694,5,138.80000000000001]
["Hostivař","Buzi Jiří",null,null,null,null,null,0,null,null,null,null,null,0,null,null,null,null,null,0,null,null,null,null,null,0,null,null,null,null,null,0,null,null,null,null,null,0,null,null,null,null,null,0,0,0,""]
["Hostivař","Lazur Ladislav",151,159,139,157,223,829,null,null,null,null,null,0,null,null,null,null,null,0,null,null,null,null,null,0,null,null,null,null,null,0,null,null,null,null,null,0,null,null,null,null,null,0,829,5,165.8]
["Hostivař","Lazurová Jiřina",141,135,122,103,105,606,null,null,null,null,null,0,null,null,null,null,null,0,null,null,null,null,null,0,null,null,null,null,null,0,null,null,null,null,null,0,null,null,null,null,null,0,{"$f":"SUM(N20,H20,T20,Z20,AF20,AL20,AR20)","v":606},{"$f":"COUNT(C20:G20,I20:M20,O20:S20,U20:Y20,AA20:AE20,AG20:AK20,AM20:AQ20)","v":5},{"$f":"IF(AT20=0,\"\",AS20/AT20)","v":121.2}]
["Hostivař","Kačena Martin",null,null,null,null,null,0,null,null,null,null,null,0,null,null,null,null,null,0,null,null,null,null,null,0,null,null,null,null,null,0,null,null,null,null,null,0,null,null,null,null,null,0,0,0,""]
["Hostivař","Bulka Miroslav",null,null,null,null,null,0,null,null,null,null,null,0,null,null,null,null,null,0,null,null,null,null,null,0,null,null,null,null,null,0,null,null,null,null,null,0,null,null,null,null,null,0,0,0,""]
["Hostivař","Zelenková Jitka",null,null,null,null,null,0,null,null,null,null,null,0,null,null,null,null,null,0,null,null,null,null,null,0,null,null,null,null,null,0,null,null,null,null,null,0,null,null,null,null,null,0,0,0,""]
["Hostivař","Berger Michal",166,185,140,145,115,751,null,null,null,null,null,0,null,null,null,null,null,0,null,null,null,null,null,0,null,null,null,null,null,0,null,null,null,null,null,0,null,null,null,null,null,0,751,5,150.19999999999999]
["Hostivař","Kollár Pavel",null,null,null,null,null,0,null,null,null,null,null,0,null,null,null,null,null,0,null,null,null,null,null,0,null,null,null,null,null,0,null,null,null,null,null,0,null,null,null,null,null,0,0,0,""]
["Hostivař","Šafář Vladimír",125,123,125,128,121,622,null,null,null,null,null,0,null,null,null,null,null,0,null,null,null,null,null,0,null,null,null,null,null,0,null,null,null,null,null,0,null,null,null,null,null,0,{"$f":"SUM(N26,H26,T26,Z26,AF26,AL26,AR26)","v":622},{"$f":"COUNT(C26:G26,I26:M26,O26:S26,U26:Y26,AA26:AE26,AG26:AK26,AM26:AQ26)","v":5},{"$f":"IF(AT26=0,\"\",AS26/AT26)","v":124.4}]
["Hostivař","Bergerová Marcela",null,null,null,null,null,0,null,null,null,null,null,0,null,null,null,null,null,0,null,null,null,null,null,0,null,null,null,null,null,0,null,null,null,null,null,0,null,null,null,null,null,0,{"$f":"SUM(N27,H27,T27,Z27,AF27,AL27,AR27)","v":0},{"$f":"COUNT(C27:G27,I27:M27,O27:S27,U27:Y27,AA27:AE27,AG27:AK27,AM27:AQ27)","v":0},{"$f":"IF(AT27=0,\"\",AS27/AT27)","v":""}]
["Hostivař","Růžička Ladislav",115,190,116,151,140,712,null,null,null,null,null,0,null,null,null,null,null,0,null,null,null,null,null,0,null,null,null,null,null,0,null,null,null,null,null,0,null,null,null,null,null,0,{"$f":"SUM(N28,H28,T28,Z28,AF28,AL28,AR28)","v":712},{"$f":"COUNT(C28:G28,I28:M28,O28:S28,U28:Y28,AA28:AE28,AG28:AK28,AM28:AQ28)","v":5},{"$f":"IF(AT28=0,\"\",AS28/AT28)","v":142.4}]
["Hostivař","Tóth Lubomír",null,null,null,null,null,0,null,null,null,null,null,0,null,null,null,null,null,0,null,null,null,null,null,0,null,null,null,null,null,0,null,null,null,null,null,0,null,null,null,null,null,0,{"$f":"SUM(N29,H29,T29,Z29,AF29,AL29,AR29)","v":0},{"$f":"COUNT(C29:G29,I29:M29,O29:S29,U29:Y29,AA29:AE29,AG29:AK29,AM29:AQ29)","v":0},{"$f":"IF(AT29=0,\"\",AS29/AT29)","v":""}]
[]
[null,null,null,null,null,null,null,null,null,null,null,null,null,null,null,null,null,null,null,null,null,null,null,null,null,null,null,null,null,null,null,null,null,null,null,null,null,null,null,null,null,null,null,null,{"$f":"SUM(AS10:AS27)","v":6266},{"$f":"SUM(AT10:AT27)","v":45},{"$f":"IF(AT31=0,\"\",AS31/AT31)","v":139.24444444444444}]
[]
["Kačerov","Carvan Pavel",113,138,155,159,183,{"$f":"SUM(C33+D33+E33+F33+G33)","v":748},null,null,null,null,null,{"$f":"SUM(I33+J33+K33+L33+M33)","v":0},null,null,null,null,null,{"$f":"SUM(O33+P33+Q33+R33+S33)","v":0},null,null,null,null,null,{"$f":"SUM(U33+V33+W33+X33+Y33)","v":0},null,null,null,null,null,{"$f":"SUM(AA33+AB33+AC33+AD33+AE33)","v":0},null,null,null,null,null,{"$f":"SUM(AG33+AH33+AI33+AJ33+AK33)","v":0},null,null,null,null,null,{"$f":"SUM(AM33+AN33+AO33+AP33+AQ33)","v":0},{"$f":"SUM(N33,H33,T33,Z33,AF33,AL33,AR33)","v":748},{"$f":"COUNT(C33:G33,I33:M33,O33:S33,U33:Y33,AA33:AE33,AG33:AK33,AM33:AQ33)","v":5},{"$f":"IF(AT33=0,\"\",AS33/AT33)","v":149.6}]
["Kačerov","Brož Stanislav",132,174,149,140,162,757,null,null,null,null,null,0,null,null,null,null,null,0,null,null,null,null,null,0,null,null,null,null,null,0,null,null,null,null,null,0,null,null,null,null,null,0,757,5,151.4]
["Kačerov","Tomášek Zdeněk",101,150,169,168,133,721,null,null,null,null,null,0,null,null,null,null,null,0,null,null,null,null,null,0,null,null,null,null,null,0,null,null,null,null,null,0,null,null,null,null,null,0,721,5,144.19999999999999]
["Kačerov","Mašát Petr",170,166,164,160,192,852,null,null,null,null,null,0,null,null,null,null,null,0,null,null,null,null,null,0,null,null,null,null,null,0,null,null,null,null,null,0,null,null,null,null,null,0,852,5,170.4]
["Kačerov","Hübner Jiří",134,127,138,161,177,737,null,null,null,null,null,0,null,null,null,null,null,0,null,null,null,null,null,0,null,null,null,null,null,0,null,null,null,null,null,0,null,null,null,null,null,0,737,5,147.4]
["Kačerov","Douša Adam",132,173,137,151,119,712,null,null,null,null,null,0,null,null,null,null,null,0,null,null,null,null,null,0,null,null,null,null,null,0,null,null,null,null,null,0,null,null,null,null,null,0,712,5,142.4]
["Kačerov","Turek Stanislav",140,163,169,100,177,749,null,null,null,null,null,0,null,null,null,null,null,0,null,null,null,null,null,0,null,null,null,null,null,0,null,null,null,null,null,0,null,null,null,null,null,0,749,5,149.80000000000001]
["Kačerov","Brejcha Jaroslav",null,null,null,null,null,0,null,null,null,null,null,0,null,null,null,null,null,0,null,null,null,null,null,0,null,null,null,null,null,0,null,null,null,null,null,0,null,null,null,null,null,0,0,0,""]
["Kačerov","Žalud Miroslav",null,null,null,null,null,0,null,null,null,null,null,0,null,null,null,null,null,0,null,null,null,null,null,0,null,null,null,null,null,0,null,null,null,null,null,0,null,null,null,null,null,0,{"$f":"SUM(N41,H41,T41,Z41,AF41,AL41,AR41)","v":0},{"$f":"COUNT(C41:G41,I41:M41,O41:S41,U41:Y41,AA41:AE41,AG41:AK41,AM41:AQ41)","v":0},{"$f":"IF(AT41=0,\"\",AS41/AT41)","v":""}]
["Kačerov","Bánovský Jaroslav",null,null,null,null,null,0,null,null,null,null,null,0,null,null,null,null,null,0,null,null,null,null,null,0,null,null,null,null,null,0,null,null,null,null,null,0,null,null,null,null,null,0,0,0,""]
["Kačerov","Kutina Pavel",144,99,122,168,118,651,null,null,null,null,null,0,null,null,null,null,null,0,null,null,null,null,null,0,null,null,null,null,null,0,null,null,null,null,null,0,null,null,null,null,null,0,651,5,130.19999999999999]
["Kačerov","Ondřich František",175,163,149,119,143,749,null,null,null,null,null,0,null,null,null,null,null,0,null,null,null,null,null,0,null,null,null,null,null,0,null,null,null,null,null,0,null,null,null,null,null,0,749,5,149.80000000000001]
["Kačerov","Radová Petra",125,158,118,183,132,716,null,null,null,null,null,0,null,null,null,null,null,0,null,null,null,null,null,0,null,null,null,null,null,0,null,null,null,null,null,0,null,null,null,null,null,0,716,5,143.19999999999999]
["Kačerov","Katolický Zdeněk",null,null,null,null,null,0,null,null,null,null,null,0,null,null,null,null,null,0,null,null,null,null,null,0,null,null,null,null,null,0,null,null,null,null,null,0,null,null,null,null,null,0,0,0,""]
[]
[null,null,null,null,null,null,null,null,null,null,null,null,null,null,null,null,null,null,null,null,null,null,null,null,null,null,null,null,null,null,null,null,null,null,null,null,null,null,null,null,null,null,null,null,{"$f":"SUM(AS33:AS47)","v":7392},{"$f":"SUM(AT33:AT47)","v":50},{"$f":"IF(AT48=0,\"\",AS48/AT48)","v":147.84}]
[]
["Klíčov","Troller Pavel",132,128,141,132,148,{"$f":"SUM(C50+D50+E50+F50+G50)","v":681},null,null,null,null,null,{"$f":"SUM(I50+J50+K50+L50+M50)","v":0},null,null,null,null,null,{"$f":"SUM(O50+P50+Q50+R50+S50)","v":0},null,null,null,null,null,{"$f":"SUM(U50+V50+W50+X50+Y50)","v":0},null,null,null,null,null,{"$f":"SUM(AA50+AB50+AC50+AD50+AE50)","v":0},null,null,null,null,null,{"$f":"SUM(AG50+AH50+AI50+AJ50+AK50)","v":0},null,null,null,null,null,{"$f":"SUM(AM50+AN50+AO50+AP50+AQ50)","v":0},{"$f":"SUM(N50,H50,T50,Z50,AF50,AL50,AR50)","v":681},{"$f":"COUNT(C50:G50,I50:M50,O50:S50,U50:Y50,AA50:AE50,AG50:AK50,AM50:AQ50)","v":5},{"$f":"IF(AT50=0,\"\",AS50/AT50)","v":136.19999999999999}]
["Klíčov","Pelikán Stanislav",null,null,null,null,null,0,null,null,null,null,null,0,null,null,null,null,null,0,null,null,null,null,null,0,null,null,null,null,null,0,null,null,null,null,null,0,null,null,null,null,null,0,0,0,""]
["Klíčov","Novotná Petra",91,145,110,130,99,575,null,null,null,null,null,0,null,null,null,null,null,0,null,null,null,null,null,0,null,null,null,null,null,0,null,null,null,null,null,0,null,null,null,null,null,0,575,5,115]
["Klíčov","Novotný Lukáš",145,163,148,160,139,755,null,null,null,null,null,0,null,null,null,null,null,0,null,null,null,null,null,0,null,null,null,null,null,0,null,null,null,null,null,0,null,null,null,null,null,0,755,5,151]
["Klíčov","Táborský Lukáš",null,null,null,null,null,0,null,null,null,null,null,0,null,null,null,null,null,0,null,null,null,null,null,0,null,null,null,null,null,0,null,null,null,null,null,0,null,null,null,null,null,0,0,0,""]
["Klíčov","Táborský František",null,null,null,null,null,0,null,null,null,null,null,0,null,null,null,null,null,0,null,null,null,null,null,0,null,null,null,null,null,0,null,null,null,null,null,0,null,null,null,null,null,0,0,0,""]
["Klíčov","Pecka Jiří",154,125,148,138,144,709,null,null,null,null,null,0,null,null,null,null,null,0,null,null,null,null,null,0,null,null,null,null,null,0,null,null,null,null,null,0,null,null,null,null,null,0,{"$f":"SUM(N56,H56,T56,Z56,AF56,AL56,AR56)","v":709},{"$f":"COUNT(C56:G56,I56:M56,O56:S56,U56:Y56,AA56:AE56,AG56:AK56,AM56:AQ56)","v":5},141.80000000000001]
["Klíčov","Kalfiřt Petr",133,159,155,149,126,722,null,null,null,null,null,0,null,null,null,null,null,0,null,null,null,null,null,0,null,null,null,null,null,0,null,null,null,null,null,0,null,null,null,null,null,0,722,5,144.4]
["Klíčov","Novotná Jana",null,null,null,null,null,0,null,null,null,null,null,0,null,null,null,null,null,0,null,null,null,null,null,0,null,null,null,null,null,0,null,null,null,null,null,0,null,null,null,null,null,0,0,0,{"$f":"IF(AT58=0,\"\",AS58/AT58)","v":""}]
["Klíčov","Šafářová Veronika",null,null,null,null,null,0,null,null,null,null,null,0,null,null,null,null,null,0,null,null,null,null,null,0,null,null,null,null,null,0,null,null,null,null,null,0,null,null,null,null,null,0,0,0,""]
["Klíčov","Novotný Josef",null,null,null,null,null,0,null,null,null,null,null,0,null,null,null,null,null,0,null,null,null,null,null,0,null,null,null,null,null,0,null,null,null,null,null,0,null,null,null,null,null,0,0,0,""]
["Klíčov","Šafrová Martina",null,null,null,null,null,0,null,null,null,null,null,0,null,null,null,null,null,0,null,null,null,null,null,0,null,null,null,null,null,0,null,null,null,null,null,0,null,null,null,null,null,0,0,0,""]
["Klíčov","Lokvenc Jiří",122,146,148,141,127,684,null,null,null,null,null,0,null,null,null,null,null,0,null,null,null,null,null,0,null,null,null,null,null,0,null,null,null,null,null,0,null,null,null,null,null,0,684,5,136.80000000000001]
["Klíčov","Hájek Lukáš",null,null,null,null,null,0,null,null,null,null,null,0,null,null,null,null,null,0,null,null,null,null,null,0,null,null,null,null,null,0,null,null,null,null,null,0,null,null,null,null,null,0,0,0,""]
["Klíčov","Křemenák Petr",null,null,null,null,null,0,null,null,null,null,null,0,null,null,null,null,null,0,null,null,null,null,null,0,null,null,null,null,null,0,null,null,null,null,null,0,null,null,null,null,null,0,0,0,""]
["Klíčov","Vychnerová Michala",null,null,null,null,null,0,null,null,null,null,null,0,null,null,null,null,null,0,null,null,null,null,null,0,null,null,null,null,null,0,null,null,null,null,null,0,null,null,null,null,null,0,0,0,""]
["Klíčov","Doman Marcel",93,99,90,87,123,492,null,null,null,null,null,{"$f":"SUM(I66+J66+K66+L66+M66)","v":0},null,null,null,null,null,{"$f":"SUM(O66+P66+Q66+R66+S66)","v":0},null,null,null,null,null,{"$f":"SUM(U66+V66+W66+X66+Y66)","v":0},null,null,null,null,null,{"$f":"SUM(AA66+AB66+AC66+AD66+AE66)","v":0},null,null,null,null,null,{"$f":"SUM(AG66+AH66+AI66+AJ66+AK66)","v":0},null,null,null,null,null,{"$f":"SUM(AM66+AN66+AO66+AP66+AQ66)","v":0},492,5,98.4]
["Klíčov","Svoboda Jan",null,null,null,null,null,0,null,null,null,null,null,0,null,null,null,null,null,0,null,null,null,null,null,0,null,null,null,null,null,0,null,null,null,null,null,0,null,null,null,null,null,0,{"$f":"SUM(N67,H67,T67,Z67,AF67,AL67,AR67)","v":0},{"$f":"COUNT(C67:G67,I67:M67,O67:S67,U67:Y67,AA67:AE67,AG67:AK67,AM67:AQ67)","v":0},{"$f":"IF(AT67=0,\"\",AS67/AT67)","v":""}]
["Klíčov","Křemenák Jakub",null,null,null,null,null,{"$f":"SUM(C68+D68+E68+F68+G68)","v":0},null,null,null,null,null,0,null,null,null,null,null,0,null,null,null,null,null,0,null,null,null,null,null,0,null,null,null,null,null,0,null,null,null,null,null,0,0,0,""]
["Klíčov","Kolář Ladislav",128,171,134,176,217,{"$f":"SUM(C69+D69+E69+F69+G69)","v":826},null,null,null,null,null,0,null,null,null,null,null,0,null,null,null,null,null,0,null,null,null,null,null,0,null,null,null,null,null,0,null,null,null,null,null,0,826,5,165.2]
["Klíčov","Štěpán Radek",145,129,167,165,170,{"$f":"SUM(C70+D70+E70+F70+G70)","v":776},null,null,null,null,null,0,null,null,null,null,null,0,null,null,null,null,null,0,null,null,null,null,null,0,null,null,null,null,null,0,null,null,null,null,null,0,776,5,155.19999999999999]
["Klíčov","Neshyba Jaroslav",139,94,113,97,144,{"$f":"SUM(C71+D71+E71+F71+G71)","v":587},null,null,null,null,null,0,null,null,null,null,null,0,null,null,null,null,null,0,null,null,null,null,null,0,null,null,null,null,null,0,null,null,null,null,null,0,{"$f":"SUM(N71,H71,T71,Z71,AF71,AL71,AR71)","v":587},{"$f":"COUNT(C71:G71,I71:M71,O71:S71,U71:Y71,AA71:AE71,AG71:AK71,AM71:AQ71)","v":5},{"$f":"IF(AT71=0,\"\",AS71/AT71)","v":117.4}]
["Klíčov","Pipek Pavel",null,null,null,null,null,{"$f":"SUM(C72+D72+E72+F72+G72)","v":0},null,null,null,null,null,0,null,null,null,null,null,0,null,null,null,null,null,0,null,null,null,null,null,0,null,null,null,null,null,0,null,null,null,null,null,0,{"$f":"SUM(N72,H72,T72,Z72,AF72,AL72,AR72)","v":0},{"$f":"COUNT(C72:G72,I72:M72,O72:S72,U72:Y72,AA72:AE72,AG72:AK72,AM72:AQ72)","v":0},{"$f":"IF(AT72=0,\"\",AS72/AT72)","v":""}]
[]
[null,null,null,null,null,null,null,null,null,null,null,null,null,null,null,null,null,null,null,null,null,null,null,null,null,null,null,null,null,null,null,null,null,null,null,null,null,null,null,null,null,null,null,null,{"$f":"SUM(AS50:AS72)","v":6807},{"$f":"SUM(AT50:AT72)","v":50},{"$f":"IF(AT74=0,\"\",AS74/AT74)","v":136.13999999999999}]
[" "]
["Řepy","Pospíšil Václav",149,144,199,145,154,{"$f":"SUM(C76+D76+E76+F76+G76)","v":791},null,null,null,null,null,{"$f":"SUM(I76+J76+K76+L76+M76)","v":0},null,null,null,null,null,{"$f":"SUM(O76+P76+Q76+R76+S76)","v":0},null,null,null,null,null,{"$f":"SUM(U76+V76+W76+X76+Y76)","v":0},null,null,null,null,null,{"$f":"SUM(AA76+AB76+AC76+AD76+AE76)","v":0},null,null,null,null,null,{"$f":"SUM(AG76+AH76+AI76+AJ76+AK76)","v":0},null,null,null,null,null,{"$f":"SUM(AM76+AN76+AO76+AP76+AQ76)","v":0},{"$f":"SUM(N76,H76,T76,Z76,AF76,AL76,AR76)","v":791},{"$f":"COUNT(C76:G76,I76:M76,O76:S76,U76:Y76,AA76:AE76,AG76:AK76,AM76:AQ76)","v":5},{"$f":"IF(AT76=0,\"\",AS76/AT76)","v":158.19999999999999}]
["Řepy","Kocúr Jaroslav",163,173,180,154,157,827,null,null,null,null,null,0,null,null,null,null,null,0,null,null,null,null,null,0,null,null,null,null,null,0,null,null,null,null,null,0,null,null,null,null,null,0,827,5,165.4]
["Řepy","Sehnal Ivan",108,104,132,126,133,603,null,null,null,null,null,0,null,null,null,null,null,0,null,null,null,null,null,0,null,null,null,null,null,0,null,null,null,null,null,0,null,null,null,null,null,0,603,5,120.6]
["Řepy","Plecháček Miroslav",null,null,null,null,null,0,null,null,null,null,null,0,null,null,null,null,null,0,null,null,null,null,null,0,null,null,null,null,null,0,null,null,null,null,null,0,null,null,null,null,null,0,0,0,""]
["Řepy","Sladovník Miloš",130,146,176,131,111,694,null,null,null,null,null,0,null,null,null,null,null,0,null,null,null,null,null,0,null,null,null,null,null,0,null,null,null,null,null,0,null,null,null,null,null,0,694,5,138.80000000000001]
["Řepy","Mottl Pavel",119,111,122,123,146,621,null,null,null,null,null,0,null,null,null,null,null,0,null,null,null,null,null,0,null,null,null,null,null,0,null,null,null,null,null,0,null,null,null,null,null,0,621,5,124.2]
["Řepy","Číhal František",null,null,null,null,null,0,null,null,null,null,null,0,null,null,null,null,null,0,null,null,null,null,null,0,null,null,null,null,null,0,null,null,null,null,null,0,null,null,null,null,null,0,0,0,""]
["Řepy","Kročil Tomáš",156,147,169,137,112,721,null,null,null,null,null,0,null,null,null,null,null,0,null,null,null,null,null,0,null,null,null,null,null,0,null,null,null,null,null,0,null,null,null,null,null,0,721,5,144.19999999999999]
["Řepy","Alba Vladimír",133,103,148,142,128,654,null,null,null,null,null,0,null,null,null,null,null,0,null,null,null,null,null,0,null,null,null,null,null,0,null,null,null,null,null,0,null,null,null,null,null,0,654,5,130.80000000000001]
["Řepy","Tichý Hugo",null,null,null,null,null,0,null,null,null,null,null,0,null,null,null,null,null,0,null,null,null,null,null,0,null,null,null,null,null,0,null,null,null,null,null,0,null,null,null,null,null,0,0,0,""]
["Řepy","Křikava Miroslav",121,119,143,156,142,681,null,null,null,null,null,0,null,null,null,null,null,0,null,null,null,null,null,0,null,null,null,null,null,0,null,null,null,null,null,0,null,null,null,null,null,0,{"$f":"SUM(N86,H86,T86,Z86,AF86,AL86,AR86)","v":681},{"$f":"COUNT(C86:G86,I86:M86,O86:S86,U86:Y86,AA86:AE86,AG86:AK86,AM86:AQ86)","v":5},{"$f":"IF(AT86=0,\"\",AS86/AT86)","v":136.19999999999999}]
["Řepy","Dvořák Petr",187,144,125,175,168,799,null,null,null,null,null,0,null,null,null,null,null,{"$f":"SUM(O87+P87+Q87+R87+S87)","v":0},null,null,null,null,null,{"$f":"SUM(U87+V87+W87+X87+Y87)","v":0},null,null,null,null,null,{"$f":"SUM(AA87+AB87+AC87+AD87+AE87)","v":0},null,null,null,null,null,{"$f":"SUM(AG87+AH87+AI87+AJ87+AK87)","v":0},null,null,null,null,null,{"$f":"SUM(AM87+AN87+AO87+AP87+AQ87)","v":0},799,5,159.80000000000001]
["Řepy","Froněk Martin",202,170,168,116,116,772,null,null,null,null,null,0,null,null,null,null,null,0,null,null,null,null,null,0,null,null,null,null,null,0,null,null,null,null,null,0,null,null,null,null,null,0,772,5,154.4]
["Řepy","Kozel Pavel",null,null,null,null,null,0,null,null,null,null,null,0,null,null,null,null,null,0,null,null,null,null,null,0,null,null,null,null,null,0,null,null,null,null,null,0,null,null,null,null,null,0,0,0,""]
["Řepy","Růžička Václav",132,137,104,167,113,653,null,null,null,null,null,0,null,null,null,null,null,0,null,null,null,null,null,0,null,null,null,null,null,0,null,null,null,null,null,0,null,null,null,null,null,0,653,5,130.6]
["Řepy","Šindelář Karel",121,165,139,135,141,701,null,null,null,null,null,0,null,null,null,null,null,0,null,null,null,null,null,0,null,null,null,null,null,0,null,null,null,null,null,0,null,null,null,null,null,0,701,5,140.19999999999999]
["Řepy","Piešťanský Josef",null,null,null,null,null,0,null,null,null,null,null,0,null,null,null,null,null,0,null,null,null,null,null,0,null,null,null,null,null,0,null,null,null,null,null,0,null,null,null,null,null,0,{"$f":"SUM(N92,H92,T92,Z92,AF92,AL92,AR92)","v":0},{"$f":"COUNT(C92:G92,I92:M92,O92:S92,U92:Y92,AA92:AE92,AG92:AK92,AM92:AQ92)","v":0},{"$f":"IF(AT92=0,\"\",AS92/AT92)","v":""}]
["Řepy","Erekt Stanislav",129,149,194,150,139,{"$f":"SUM(C93+D93+E93+F93+G93)","v":761},null,null,null,null,null,{"$f":"SUM(I93+J93+K93+L93+M93)","v":0},null,null,null,null,null,{"$f":"SUM(O93+P93+Q93+R93+S93)","v":0},null,null,null,null,null,{"$f":"SUM(U93+V93+W93+X93+Y93)","v":0},null,null,null,null,null,{"$f":"SUM(AA93+AB93+AC93+AD93+AE93)","v":0},null,null,null,null,null,{"$f":"SUM(AG93+AH93+AI93+AJ93+AK93)","v":0},null,null,null,null,null,{"$f":"SUM(AM93+AN93+AO93+AP93+AQ93)","v":0},{"$f":"SUM(N93,H93,T93,Z93,AF93,AL93,AR93)","v":761},{"$f":"COUNT(C93:G93,I93:M93,O93:S93,U93:Y93,AA93:AE93,AG93:AK93,AM93:AQ93)","v":5},{"$f":"IF(AT93=0,\"\",AS93/AT93)","v":152.19999999999999}]
["Řepy","Křikavová Miroslava",112,150,148,124,175,{"$f":"SUM(C94+D94+E94+F94+G94)","v":709},null,null,null,null,null,{"$f":"SUM(I94+J94+K94+L94+M94)","v":0},null,null,null,null,null,{"$f":"SUM(O94+P94+Q94+R94+S94)","v":0},null,null,null,null,null,{"$f":"SUM(U94+V94+W94+X94+Y94)","v":0},null,null,null,null,null,{"$f":"SUM(AA94+AB94+AC94+AD94+AE94)","v":0},null,null,null,null,null,{"$f":"SUM(AG94+AH94+AI94+AJ94+AK94)","v":0},null,null,null,null,null,{"$f":"SUM(AM94+AN94+AO94+AP94+AQ94)","v":0},{"$f":"SUM(N94,H94,T94,Z94,AF94,AL94,AR94)","v":709},{"$f":"COUNT(C94:G94,I94:M94,O94:S94,U94:Y94,AA94:AE94,AG94:AK94,AM94:AQ94)","v":5},{"$f":"IF(AT94=0,\"\",AS94/AT94)","v":141.80000000000001}]
["Řepy","Červenka Ivan",108,133,117,149,161,{"$f":"SUM(C95+D95+E95+F95+G95)","v":668},null,null,null,null,null,{"$f":"SUM(I95+J95+K95+L95+M95)","v":0},null,null,null,null,null,{"$f":"SUM(O95+P95+Q95+R95+S95)","v":0},null,null,null,null,null,{"$f":"SUM(U95+V95+W95+X95+Y95)","v":0},null,null,null,null,null,{"$f":"SUM(AA95+AB95+AC95+AD95+AE95)","v":0},null,null,null,null,null,{"$f":"SUM(AG95+AH95+AI95+AJ95+AK95)","v":0},null,null,null,null,null,{"$f":"SUM(AM95+AN95+AO95+AP95+AQ95)","v":0},{"$f":"SUM(N95,H95,T95,Z95,AF95,AL95,AR95)","v":668},{"$f":"COUNT(C95:G95,I95:M95,O95:S95,U95:Y95,AA95:AE95,AG95:AK95,AM95:AQ95)","v":5},{"$f":"IF(AT95=0,\"\",AS95/AT95)","v":133.6}]
[]
[null,null,null,null,null,null,null,null,null,null,null,null,null,null,null,null,null,null,null,null,null,null,null,null,null,null,null,null,null,null,null,null,null,null,null,null,null,null,null,null,null,null,null,null,{"$f":"SUM(AS76:AS91)","v":8517},{"$f":"SUM(AT76:AT91)","v":60},{"$f":"IF(AT97=0,\"\",AS97/AT97)","v":141.94999999999999}]
[]
["Vršovice","Krupa Jozef",135,202,188,170,149,{"$f":"SUM(C99+D99+E99+F99+G99)","v":844},null,null,null,null,null,{"$f":"SUM(I99+J99+K99+L99+M99)","v":0},null,null,null,null,null,{"$f":"SUM(O99+P99+Q99+R99+S99)","v":0},null,null,null,null,null,{"$f":"SUM(U99+V99+W99+X99+Y99)","v":0},null,null,null,null,null,{"$f":"SUM(AA99+AB99+AC99+AD99+AE99)","v":0},null,null,null,null,null,{"$f":"SUM(AG99+AH99+AI99+AJ99+AK99)","v":0},null,null,null,null,null,{"$f":"SUM(AM99+AN99+AO99+AP99+AQ99)","v":0},{"$f":"SUM(N99,H99,T99,Z99,AF99,AL99,AR99)","v":844},{"$f":"COUNT(C99:G99,I99:M99,O99:S99,U99:Y99,AA99:AE99,AG99:AK99,AM99:AQ99)","v":5},{"$f":"IF(AT99=0,\"\",AS99/AT99)","v":168.8}]
["Vršovice","Pospíšil Lukáš",null,null,null,null,null,0,null,null,null,null,null,0,null,null,null,null,null,0,null,null,null,null,null,0,null,null,null,null,null,0,null,null,null,null,null,0,null,null,null,null,null,0,0,0,""]
["Vršovice","Krupová Martina",null,null,null,null,null,0,null,null,null,null,null,0,null,null,null,null,null,0,null,null,null,null,null,0,null,null,null,null,null,0,null,null,null,null,null,0,null,null,null,null,null,0,0,0,""]
["Vršovice","Krupa Martin",null,null,null,null,null,0,null,null,null,null,null,0,null,null,null,null,null,0,null,null,null,null,null,0,null,null,null,null,null,0,null,null,null,null,null,0,null,null,null,null,null,0,0,0,""]
["Vršovice","Skružná Pavla",161,147,134,135,109,686,null,null,null,null,null,0,null,null,null,null,null,0,null,null,null,null,null,0,null,null,null,null,null,0,null,null,null,null,null,0,null,null,null,null,null,0,686,5,137.19999999999999]
["Vršovice","Aunický František",77,122,133,104,94,530,null,null,null,null,null,0,null,null,null,null,null,0,null,null,null,null,null,0,null,null,null,null,null,0,null,null,null,null,null,0,null,null,null,null,null,0,530,5,106]
["Vršovice","Kazda Jan",null,null,null,null,null,0,null,null,null,null,null,0,null,null,null,null,null,0,null,null,null,null,null,0,null,null,null,null,null,0,null,null,null,null,null,0,null,null,null,null,null,0,0,0,""]
["Vršovice","Leibichová Inke",90,89,69,77,108,433,null,null,null,null,null,0,null,null,null,null,null,0,null,null,null,null,null,0,null,null,null,null,null,0,null,null,null,null,null,0,null,null,null,null,null,0,433,5,86.6]
["Vršovice","Leibich František",159,140,137,149,171,756,null,null,null,null,null,0,null,null,null,null,null,0,null,null,null,null,null,0,null,null,null,null,null,0,null,null,null,null,null,0,null,null,null,null,null,0,756,5,151.19999999999999]
["Vršovice","Veselý Vlastimil",116,119,176,115,149,675,null,null,null,null,null,0,null,null,null,null,null,0,null,null,null,null,null,0,null,null,null,null,null,0,null,null,null,null,null,0,null,null,null,null,null,0,675,5,135]
["Vršovice","Věchtík Antonín",null,null,null,null,null,0,null,null,null,null,null,0,null,null,null,null,null,0,null,null,null,null,null,0,null,null,null,null,null,0,null,null,null,null,null,0,null,null,null,null,null,0,{"$f":"SUM(N109,H109,T109,Z109,AF109,AL109,AR109)","v":0},{"$f":"COUNT(C109:G109,I109:M109,O109:S109,U109:Y109,AA109:AE109,AG109:AK109,AM109:AQ109)","v":0},{"$f":"IF(AT109=0,\"\",AS109/AT109)","v":""}]
["Vršovice","Podhola Martin",133,162,207,176,179,857,null,null,null,null,null,0,null,null,null,null,null,0,null,null,null,null,null,0,null,null,null,null,null,0,null,null,null,null,null,0,null,null,null,null,null,0,857,5,171.4]
["Vršovice","Holkup Jan",91,132,172,190,163,748,null,null,null,null,null,0,null,null,null,null,null,0,null,null,null,null,null,0,null,null,null,null,null,0,null,null,null,null,null,0,null,null,null,null,null,0,748,5,149.6]
["Vršovice","Pokorný Josef",null,null,null,null,null,0,null,null,null,null,null,0,null,null,null,null,null,{"$f":"SUM(O112+P112+Q112+R112+S112)","v":0},null,null,null,null,null,{"$f":"SUM(U112+V112+W112+X112+Y112)","v":0},null,null,null,null,null,{"$f":"SUM(AA112+AB112+AC112+AD112+AE112)","v":0},null,null,null,null,null,{"$f":"SUM(AG112+AH112+AI112+AJ112+AK112)","v":0},null,null,null,null,null,{"$f":"SUM(AM112+AN112+AO112+AP112+AQ112)","v":0},0,0,""]
["Vršovice","Kučera Miroslav",null,null,null,null,null,0,null,null,null,null,null,0,null,null,null,null,null,0,null,null,null,null,null,0,null,null,null,null,null,0,null,null,null,null,null,0,null,null,null,null,null,0,0,0,""]
["Vršovice","Kovář Jaroslav",null,null,null,null,null,0,null,null,null,null,null,0,null,null,null,null,null,0,null,null,null,null,null,0,null,null,null,null,null,0,null,null,null,null,null,0,null,null,null,null,null,0,0,0,""]
["Vršovice","Fay Vlastimil",112,127,97,138,111,585,null,null,null,null,null,{"$f":"SUM(I115+J115+K115+L115+M115)","v":0},null,null,null,null,null,0,null,null,null,null,null,0,null,null,null,null,null,0,null,null,null,null,null,0,null,null,null,null,null,0,{"$f":"SUM(N115,H115,T115,Z115,AF115,AL115,AR115)","v":585},{"$f":"COUNT(C115:G115,I115:M115,O115:S115,U115:Y115,AA115:AE115,AG115:AK115,AM115:AQ115)","v":5},{"$f":"IF(AT115=0,\"\",AS115/AT115)","v":117}]
["Vršovice","Bošek Jan",157,119,139,129,166,710,null,null,null,null,null,{"$f":"SUM(I116+J116+K116+L116+M116)","v":0},null,null,null,null,null,0,null,null,null,null,null,0,null,null,null,null,null,0,null,null,null,null,null,0,null,null,null,null,null,0,{"$f":"SUM(N116,H116,T116,Z116,AF116,AL116,AR116)","v":710},{"$f":"COUNT(C116:G116,I116:M116,O116:S116,U116:Y116,AA116:AE116,AG116:AK116,AM116:AQ116)","v":5},{"$f":"IF(AT116=0,\"\",AS116/AT116)","v":142}]
["Vršovice","Pavlíček Rudolf",null,null,null,null,null,0,null,null,null,null,null,{"$f":"SUM(I117+J117+K117+L117+M117)","v":0},null,null,null,null,null,0,null,null,null,null,null,0,null,null,null,null,null,0,null,null,null,null,null,0,null,null,null,null,null,0,{"$f":"SUM(N117,H117,T117,Z117,AF117,AL117,AR117)","v":0},{"$f":"COUNT(C117:G117,I117:M117,O117:S117,U117:Y117,AA117:AE117,AG117:AK117,AM117:AQ117)","v":0},{"$f":"IF(AT117=0,\"\",AS117/AT117)","v":""}]
["Vršovice","Hrabě Jan",null,null,null,null,null,{"$f":"SUM(C118+D118+E118+F118+G118)","v":0},null,null,null,null,null,{"$f":"SUM(I118+J118+K118+L118+M118)","v":0},null,null,null,null,null,0,null,null,null,null,null,0,null,null,null,null,null,0,null,null,null,null,null,0,null,null,null,null,null,0,{"$f":"SUM(N118,H118,T118,Z118,AF118,AL118,AR118)","v":0},{"$f":"COUNT(C118:G118,I118:M118,O118:S118,U118:Y118,AA118:AE118,AG118:AK118,AM118:AQ118)","v":0},{"$f":"IF(AT118=0,\"\",AS118/AT118)","v":""}]
[]
[null,null,null,null,null,null,null,null,null,null,null,null,null,null,null,null,null,null,null,null,null,null,null,null,null,null,null,null,null,null,null,null,null,null,null,null,null,null,null,null,null,null,null,null,{"$f":"SUM(AS99:AS119)","v":6824},{"$f":"SUM(AT99:AT119)","v":50},{"$f":"IF(AT120=0,\"\",AS120/AT120)","v":136.47999999999999}]
[]
[]
[]
[]
[null," "]